Error:Execution failed for task ':app:compileDebugJavaWithJavac'. [问题点数:40分,结帖人springworker]

Bbs1
本版专家分:0
结帖率 96.47%
Bbs2
本版专家分:484
Bbs1
本版专家分:0
Bbs4
本版专家分:1336
:app:compileDebugJavaWithJavac 问题解决
今天在做新项目Demo的时候,需要从老项目拷贝部分文件过来,然后发现编译报错很多 第一个就是 :<em>app</em>:compileDebugJavaWithJavac  网上查了各种问题都有,也有各种解决的方法,试了试都没有效果,结果在一个博客里面找到了解决方法 就是在Android Studio 的Terminal 中查看build 的info   gradle compileDebugSourc...
Execution failed for task ':app:javaPreCompileDebug'
集成第三方代码出现此错误Execution <em>failed</em> for <em>task</em> ':<em>app</em>:javaPreCompileDebug' 解决方式如下: 在<em>app</em>的build.gradle中,添加如下代码: javaCompileOptions { annotationProcessorOptions { includeCom...
Error:Execution failed for task ':app:preDebugAndroidTestBuild'. > Conflict with dependency 'com.and
出现错误详细信息: Error:Execution <em>failed</em> for <em>task</em> ‘:<em>app</em>:preDebugAndroidTestBuild’. Conflict with dependency ‘com.android.support:support-annotations’ in project ‘:<em>app</em>’. Resolved versions for <em>app</em> (27.1.0)...
Android Studio Error:Execution failed for task ':app:preDebugAndroidTestBuild'.彻底解决的方法以及修改AScompileS...
Error Error:Execution <em>failed</em> for <em>task</em> ':<em>app</em>:preDebugAndroidTestBuild'. &gt; Conflict with dependency 'com.android.support:support-annotations' in project ':<em>app</em>'. Resolved versions for <em>app</em> (26.1.0) a...
快速解决Error:Execution failed for task ':app:transformClassesAndResourcesWithProguardForRelease'. >
Error:Execution <em>failed</em> for <em>task</em> ':<em>app</em>:transformClassesAndResourcesWithProguardForRelease'. &gt; 开发中遇到的问题 点击run运行没有问题,但是打包出现这个问题,别着急,那很快就可以解决了 如果你也遇到了相同的问题,有望在1分钟之内找到问题所在,往下读吧 如图: build <em>error</em> ...
Execution failed for task ':app:clean'.解决方案
Execution <em>failed</em> for <em>task</em> ':<em>app</em>:clean'.问题原因解决方案 晚上写着写着出现这个问题Execution <em>failed</em> for <em>task</em> ‘:<em>app</em>:clean’. 查了下网上说的方法没一个管用的 问题原因 这个build没删除掉,关闭studio还是删除不了,其实是删除不了build文件夹中的apk包 解决方案 ...
android Execution failed for task ':app:compileDebugJavaWithJavac'
转自:https://segmentfault.com/a/1190000014220112 at org.gradle.api.internal.<em>task</em>s.<em>execution</em>.SkipOnlyIfTaskExecuter.execute(SkipOnlyIfTaskExecuter.java:54) at org.gradle.api.internal.<em>task</em>s.executi...
Android Error:Execution failed for task ':app:compileDebugJavaWithJavac' 解决方案
最近Android项目开发中碰到一个异常,折腾了许久才找到问题的根源。Google、百度搜索前两页内容浏览了一遍,总结了几种方案:1、升级更新buildToolsVersion 到最新版本2、升级Android Studio 2.2.2版本,JDK 1.8版本3、配置JAVA_HOME路径android { compileSdkVersion 24 buildToolsVersion ...
android异常compileDebugJavaWithJavac
使用DataBinding变异异常: Error:Execution <em>failed</em> for <em>task</em> ':main:compileDebugJavaWithJavac'. > java.lang.RuntimeException: failure, see logs for details. Exception while handling step android.databinding.an
Error:Execution failed for task ':app:transformDexArchiveWithExternalLibsDexMergerForDebug'.
错误提示: Error:Execution <em>failed</em> for <em>task</em> ':ZMU.B:transformDexArchiveWithExternalLibsDexMergerForDebug'. &amp;gt; com.android.builder.dexing.DexArchiveMergerException: Unable to merge dex 原因: 根据相关文档提示,工程中有...
Execution failed for task ':app:kaptGenerateStubsDebugKotlin
错误: android studio更新了V3.1.1之后,原本跑的好端端的程序,突然崩了。然后报错。 org.gradle.api.<em>task</em>s.TaskExecutionException: Execution <em>failed</em> for <em>task</em> ':<em>app</em>:kaptGenerateStubsDebugKotlin' java.lang.ClassNotFoundException: ...
Error:Execution failed for task ':app:mergeReleaseResources'. > Error: java.util.concurrent.Executio
Error:java.util.concurrent.ExecutionException: com.android.tools.aapt2.Aapt2Exception: AAPT <em>error</em>: check logs for details Error:Execution <em>failed</em> for <em>task</em> ':<em>app</em>:mergeReleaseResources'. &gt; Error: jav...
Error:Compilation failed; see the compiler error output for details.
我们来看看这个博主:http://blog.csdn.net/runner__1/article/details/53482565我就是借鉴他找错的经历找到错误的在命令行中进入项目的根目录,或者可以在Android studio的Terminal中直接操作也可以,然后敲入一个命令: gradlew compileDebug --stacktrace 就可以输出较详细的信息,然后根据命令行给出的提...
Error: L6406E: No space in execution regions with .ANY selector matching
Keil 链接错误 Error: L6406E: No space in <em>execution</em> regions with .ANY selector matching 在开发过程当中遇到Keil build错误,检查发现时是链接时出错了。 错误内容为: Error: L6406E: No space in <em>execution</em> regions with .ANY selector
Error:Execution failed for task ':app:compileDebugJavaWithJavac' 根本解决方法
碰到这个异常,很懵逼 查找了各种解决方案,都不对症。 最后发现,造成这种异常的原因有很多。具体的还是要去终端编译,查看到底是什么地方出错了,然后具体问题具体分析。 终端进入项目的根目录,然后输入命令 ./gradlew compileDebugJavaWithJavac --stacktrace 最终定位到错误 警告: 无法找到类型
Execution failed for task ':app:compileDebugJavaWithJavac'. Failed to create MD5 hash for file ...
忽然之间电脑就出现了这个问题,所有的<em>app</em>都报这个问题。     不一定所有的<em>app</em>出的问题会比一个<em>app</em>出的问题要难解决,看见这种现象不要担心,不要害怕,因为这可能是最简单的问题。     每个<em>app</em>都出问题,肯定是as或者配置的问题喽,可以试一下删掉.android文件,我的这个文件在C:\Users\Administrator,你的文件可能也在这儿,也可能在别的地方,删了试试,w
TaskExecutionException: Execution failed for task ':app:compileDebugJavaWithJavac
今天项目中遇到一个问题,在网上找了一些解决方式,但是都没法解决,后来在日志中找到解决方法,查看日志的方式:gradlew  compileDebug --stacktrace -info,通过日志中的&amp;gt; Task :<em>app</em>:compileDebugJavaWithJavac FAILEDPutting <em>task</em> artifact state for <em>task</em> ':<em>app</em>:compileDeb...
Error:Execution failed for task ':app:compileDebugJavaWithJavac'. > Compilation failed; 奇怪错误
Parallel <em>execution</em> with configuration on demand is an incubating feature.:<em>app</em>:clean:<em>app</em>:buildInfoDebugLoader:<em>app</em>:preBuild UP-TO-DATE:<em>app</em>:preDebugBuild UP-TO-DATE:<em>app</em>:checkDebugManifest:<em>app</em>:prepareComA...
Execution failed for task ':app:compileDebugJavaWithJavac'
错误日志:Error:Execution <em>failed</em> for <em>task</em> ‘:<em>app</em>:compileDebugJavaWithJavac’. Failed to create MD5 hash for file ‘D:\android studio work space\work06\WrAndroid\<em>app</em>\libs\yunba-sdk-release1.8.0.jar’. 解决方法: 在
Error:Execution failed for task ':app:compileDebugJavaWithJavac'.> Compilation failed; see the compi
Error:Execution <em>failed</em> for <em>task</em> ':<em>app</em>:compileDebugJavaWithJavac'. > Compilation <em>failed</em>; see the compiler <em>error</em> output for details. 发生原因: 这个错误是因为我的音乐mp3的文件名里面有大写的字母,修改成小写的就好了。
Error:Execution failed for task ':app:compileDebugJavaWithJavac'.解决方案
Error:Execution <em>failed</em> for <em>task</em> ':<em>app</em>:compileDebugJavaWithJavac'.解决方案
Error:Execution failed for task ':xxx:compileReleaseJavaWithJavac'.
首先找到自己出现这个错误的原因,可以移步http://blog.csdn.net/u014453811/article/details/54582426 其他包括配置环境变量之类的方法,如果work for you,那么congratulations 不过我就没那么幸运了,stackoverflow上面的方法hava nothing work for me 我的配置AS3.0 Canary1
Bmob之Error:Execution failed for task ':app:compileDebugJavaWithJavac'. > Compilation failed; see the
最近在写Bmob相关内容,又遇到了这个问题,之前遇到过该问题,忘记怎么解决的了,今天又遇到调试了好久,特发一贴来记录一下,防止再走老路。 问题描述:Error:(19, 55) 错误: 无法访问Subscription,找不到rx.Subscription的类文件;Error:Execution <em>failed</em> for <em>task</em> ':<em>app</em>:compileDebugJavaWithJavac'.
安卓编译错误app:compileDebugJavaWithJavac>Compilation failed; see the compiler error output for details.
Error:Execution <em>failed</em> for <em>task</em> ':<em>app</em>:compileDebugJavaWithJavac'. &amp;gt; Compilation <em>failed</em>; see the compiler <em>error</em> output for details.编译代码的
Android Studio Error:Execution failed for task ':***:compileDebugJavaWithJavac'问题解决办法
今天在打开Android Studio的时候提示更新,但是更新之后对项目进行编译就报错:Error:Execution <em>failed</em> for <em>task</em> ':pandoctor:compileDebugJavaWithJavac'. > java.lang.NoSuchMethodError: com.google.common.collect.FluentIterable.<em>app</em>end(
快速解决Error:Execution failed for task ':app:compileReleaseJavaWithJavac'. > Compilation failed; see th
> 自从AS升级2.3之后,偶尔遇到一个问题 Error:Execution <em>failed</em> for <em>task</em> ':<em>app</em>main:compileReleaseJavaWithJavac'. > Compilation <em>failed</em>; see the compiler <em>error</em> output for details. 并没有提示错误的具体地方,然后查看代码也没有报错的地方 一分钟之内可以解决
android编译报错Error:Execution failed for task ':app:compileDebugJavaWithJavac'.
Android studio编译时报错:Error:Execution <em>failed</em> for <em>task</em> ':<em>app</em>:compileDebugJavaWithJavac'. > Failed to create MD5 hash for file 'E:\workspace\smartdevice\Robot\YIShuo_Robot_v0.0.1\<em>app</em>\android_api_3.7.1.1.
Error:Execution failed for task ':app:transformClassesWithDexForDebug'解决记录
转载请标明出处: http://blog.csdn.net/lxk_1993/article/details/50511172 本文出自:【lxk_1993的博客】; 新的排版地址https://blog.csdn.net/lxk_1993/article/details/95475603 3个错误non-zero exit value 1;non-ze...
android studio 编译调试 错误
Execution <em>failed</em> for <em>task</em> ':TestAndroid:compileDebug'. 有各种各样原因,具体就请自己进cmd编译看什么地方出错 进入项目的gradle文件所在目录打 gradlew compileDebug --stacktrace 来追踪就可以啦~   昨天编译的时候出现了问题,具体问题具体解决! Gradle: FAILURE: B
快速解决Error:Execution failed for task ':app:compileReleaseJavaWithJavac'. > Compilation failed; the co
Error:Execution <em>failed</em> for <em>task</em> ':<em>app</em>:compileDebugJavaWithJavac'. &amp;gt; Compilation <em>failed</em>; see the compiler <em>error</em> output for details.解决方案:在AndroidStudio的菜单栏点击View – ToolWindows – GradleConsole 把它显示出来查...
android studio 3.1.1 报错Execution failed for task ':app:compileDebugAidl'.
android level:25sdk build tool 版本:27.0.3错误:org.gradle.api.<em>task</em>s.TaskExecutionException: Execution <em>failed</em> for <em>task</em> ':<em>app</em>:compileDebugAidl'.解决方法:先将build.gradecompileSdkVersion 25改为compileSdkVersion 19编译...
react-native app:compileDebugJavaWithJavac错误解决
今天在react native 中导入一个三方库,出现了这个问题react-native <em>app</em>:compileDebugJavaWithJavac 在stackoverflow上找到了解决的办法,地址如下: https://stackoverflow.com/questions/45580452/react-native-android-method-does-not-override-or...
reactnative启动报错 app:compileDebugJavaWithJavac
-
react-native遇到过的错误
记录下使用react-native过的错误,实习期间一直没空写博客~~~ 1、development return response <em>error</em> 500:一般是引用文件组件等的路径错误,找不到; 2、cannot excute importjavascriptexception: 一般是写错变量名称等; 3、导入图片资源时,需要重新打包; 4、Application has not been
Error:Execution failed for task ':app:compileDebugJavaWithJavac'
Error:Execution <em>failed</em> for <em>task</em> ':<em>app</em>:compileDebugJavaWithJavac' 在工程根目录下命令行输入 .\gradlew compileDebugJavaWithJavac --stacktrace 编译输出错误信息,根据错误信息修改代码 ...
Execution failed for task ':app:compileDebugJavaWithJavac'
项目3.0版本,引入了2.0版本的modle出现的异常。 因为新版JDK1.8编译和旧版编译不一样,导致出现问题。 经过多次查看和调试,我的解决方法就是降低了modle相容性版本。   注意:2.0的项目升级到3.0时  build.grade 配置文件里面 引入关键字 compile要修改成implementation   有些问题也可以参考此链接:https://blo...
Error:Execution failed for task ':app:compileDebugJavaWithJavac'. > Compilation failed;
今天编译webrtc中的一个demo实例工程aarproject,遇到了这个报错:Error:Execution <em>failed</em> for <em>task</em> ':<em>app</em>:compileDebugJavaWithJavac'. &amp;gt; Compilation <em>failed</em>; see the compiler <em>error</em> output for details. 错误提示只有这一句话,实在不知道到底哪里出错了,m...
Execution failed for task ':app:compileDebugJavaWithJavac错误解决方案
Execution <em>failed</em> for <em>task</em> ':<em>app</em>:compileDebugJavaWithJavac  这边项目是多人开发,使用SVN服务器,部分人不太按照规定办事,代码再本地没跑通那个就直接提交了,导致了代码出现各种问题。 出现上面这种错误,编译都是没问题的,就是跑起来的时候,出问题比较多,而且没有更多的提示。 解决方案: 打开项目的根目录,打开终端,输入 ./gradl...
Error:Execution failed for task ':app:javaPreCompileDebug' 报错!
报错原因:Error:Execution <em>failed</em> for <em>task</em> ':<em>app</em>:javaPreCompileDebug'.&amp;gt; Annotation processors must be explicitly declared now.  The following dependencies on the compile classpath are found to contain an...
Error:Execution failed for task ':app:compileDebugJavaWithJavac'解决方法
今天在使用databing的时候删除了一个文件突然报了这个错误,撤销删除之后也一直这样,这就让我很尴尬了,项目马上就要检查了怎么能出这种问题呢。后来就感觉是androd studio是不是出问题了,重启之后发现也不行。最后删除了.gradle解决了此问题。解决方法:删除.gradle文件。...
TaskExecutionException: Execution failed for task ':app:transformJackWithJackForDebug'最权威有效的解决方案
     关于TaskExecutionException:Execution <em>failed</em> for <em>task</em>                 ':<em>app</em>:compileDebugJavaWithJavac'和               ':<em>app</em>:transformJackWithJackForDebug'.    通过亲身受害,爬坑实践证明非常权威有效的解决方案         ...
compileDebugJavaWithJavac
现象: 在AS中进行编译,出现如下错误: Error:Execution <em>failed</em> for <em>task</em> ‘:xxx:compileDebugJavaWithJavac’. Compilation <em>failed</em>; see the compiler <em>error</em> output for details. 2 在网上找了几种方案:.1解决: 缺少了一个lib的引用,在iml文件中,加上
Error:Execution failed for task ':app:javaPreCompileDebug'. > Annotation pro
在集成tinker的anno依赖包的时候出现的问题,百度了一下差不多的情况:http://blog.csdn.net/andytsui/article/details/78613885 这位仁兄是集成butterknife出现的问题,解决方式都是一样的:  ...... set android.defaultConfig.javaCompileOptions.annotationProcess
app:compileDebugJavaWithJavac 解决方案
Android Studio配置androidannotations 出现 Error:Execution <em>failed</em> for <em>task</em> ':<em>app</em>:compileDebugJavaWithJavac'。      在github翻看androidannotations,终于找到了问题所在。      1.androidannotations配置环境,要求在最新的的SDKtools, Bui
Error:Execution failed for task ':app:compileDebugJavaWithJavac'. > compileSdkVersion 'android-24' r
最近遇到这个问题,困扰了好久,我的解决办法是这样的 刚开始我的sdkVersion是24和toolsVersion24.0.0的,版本太高了,就报了这个异常,然后我把这两个版本号降低了一下,改为了23 , 结果就可以编译项目了
Tips:使用retrolambda 是出错 failed for task ':app:compileDebugJavaWithJavac'
最近在研究RxJava 相关内容,有些别人的项目中,使用了lambda表达式,使用了Retrolambda这个开源库。 然而在使用过程中,发现出现了如下的报错Execution <em>failed</em> for <em>task</em> ':<em>app</em>:compileDebugJavaWithJavac'
导入Module运行出现问Error:Execution failed for task ':app:compileDebugJavaWithJavac'. > Compilation failed;
今天我导入Module做个仿微信的相册运行出现了问题 总是出现找不到包错误并且报了如下异常 Error:Execution <em>failed</em> for <em>task</em> ':<em>app</em>:compileDebugJavaWithJavac'. > Compilation <em>failed</em>; 经过一番查看找到了解决问题的方法 1、右键工程-》Open Module Settings
Error:Execution failed for task ':app:compileDebugJavaWithJavac'. > Compilat
Error:Execution <em>failed</em> for <em>task</em> ‘:<em>app</em>:compileDebugJavaWithJavac’. > Compilat问题描述:当初学android小伙伴当遇到这样问题时,真是很酸爽,就是不知为什么错了,自己明明照着视频敲的代码,为什么出错了,而且上网查,照做也不好用,想死,,,,,小编在这里温馨提示,照视频敲代码需谨慎,不要完全搬下面说说具体原因1.导致上面这个错
使用Gradle 构建spring源码 Execution failed for task ':spring-oxm:compileTestJava'.JiBXException in JiBX
下载spring源码压缩包 解压  版本:spring-framework-3.2.6.RELEASE安装gradle压缩包,解压,配置环境变量  版本:gradle-4.6修改spring源码包中 build.gradlerepositories属性添加 阿里云的仓库 加快jar包下载速度maven { url &quot;http://maven.aliyun.com/nexus/content/gro...
填坑app:compileDebugJavaWithJavac
前言 Android Studio 3.3.1 运行项目时,在某个module进行编译时,报错了! FAILURE: Build <em>failed</em> with an exception. * What went wrong: Execution <em>failed</em> for <em>task</em> ':module1:compileDebugJavaWithJavac'. &amp;gt; Compilation <em>failed</em>; ...
游戏打包AS Execution failed for task ':app:compileDebugJavaWithJavac (后面没有MD5)
在defaultConfig 里面加这个就行 multiDexEnabled true
android stdio项目运行时报错app:compileDebugJavaWithJavac
-
org.gradle.api.tasks.TaskExecutionException: Execution failed for task ':app:compileDebugJavaWithJav
操作不慎导致build文件夹的一些build文件出错了,解决方法是把项目build文件夹和<em>app</em>下的build文件夹删除,重新build,然后根据报错内容修改即可。
Error:Execution failed for task ':app:compileReleaseJavaWithJavac'
问题: Failed to create MD5 hash for file 'D:\AndroidStudioProjects\CarAndShi\<em>app</em>\libs\android-support-v7-<em>app</em>compat.jar'. 解决方案:在项目<em>app</em>中的build.gradle里,注释掉或者删除jar包
"compileDebugJavaWithJavac"错误解决
在AS中进行编译,出现如下错误: Error:Execution <em>failed</em> for <em>task</em> ':xxx:compileDebugJavaWithJavac'. > Compilation <em>failed</em>; see the compiler <em>error</em> output for details.
处理AS报错:compileDebugJavaWithJavac
自身原因是修改了compileSdkVersion  、buildToolsVersion 的版本  
Android studio 引入butterknife使用时: Error:Execution failed for task ':app:javaPreCompileDebug'.
Android studio 引入butterknife使用时: Error:Execution <em>failed</em> for <em>task</em> ‘:<em>app</em>:javaPreCompileDebug’. Annotation processors must be explicitly declared now. The following dependencies on the compile clas...
Gradle 4.1 版本 百度云网盘地址(永久有效)
http://pan.baidu.com/s/1pL9OjYb
gradle编译出错:Execution failed for task ':app:compileTestDebugJava'.
今天更新了android studio,从0.5.3升级到0.6.1版本,结果在IDE中编译时没有问题,但是在命令行时编译就会出现以下错误: :<em>app</em>:compileTestDebugJava FAILED FAILURE: Build <em>failed</em> with an exception. * What went wrong: Execution <em>failed</em> for <em>task</em> ':<em>app</em>:c
Error:Execution failed for task ':app:transformClassesWithMultidexlistForDebug'. > java.io.IOExcepti
在升级到as3.0后出现部分错误,但是通过查度娘解决起来还可以,但是遇到了以上这个错误着实让我头大!!!主要解决方法:由于自己项目有很多第三方依赖,导致dex文件合并失败,解决方法在Module下的build.gradle中添加 multiDexEnabled truedefaultConfig{        multiDexEnabled true}dependencies{ compile'...
android databinding不出现具体错误':app:compileDebugJavaWithJavac'. > Compilation failed;
最近项目使用databinding框架开发,出现了BR找不到的文件,于是到处检查是否是databinding的变量写错了,花了两大天。之后发现是fragment定义了一个名为viewmodel的变量,fragment布局 fragment里的recyclerview 下的子布局,ItemView里出现重名变量引发的血案。就此记录!
Android Execution failed for task ':app:compileDebugJavaWithJavac'
Android Execution <em>failed</em> for <em>task</em> ':<em>app</em>:compileDebugJavaWithJavac' 此问题一般都是java类里出现问题了,studio编译时才会报错。
AndroidStudio报compileMiguDebugJavaWithJavac异常的定位
在Android开发过程中,因为各种不同的原因,Androidstudio总是会报出:Execution <em>failed</em> for <em>task</em> ':main:compileMiguDebugJavaWithJavac’这样的错误,莫名其妙的。 What went wrong: Execution <em>failed</em> for <em>task</em> ':main:compileMiguDebugJavaWithJavac'....
Execution failed for task ':app:compileDebugUnitTestJavaWithJavac'. (Solved)
Android Studio Execution <em>failed</em> for <em>task</em> ':<em>app</em>:compileDebugUnitTestJavaWithJavac'. (Solved)
:app:compileDebugJavaWithJavac - is not incremental
:<em>app</em>:compileDebugJavaWithJavac - is not incremental (e.g. outputs have changed, no previous <em>execution</em>, etc.). /root/.jenkins/workspace/HttpBaseReq.java:139: <em>error</em>: cannot find symbol         int tas
快速处理编译运行compileDebugJavaWithJavac问题
快速处理编译运行AS compileDebugJavaWithJavac问题 compileDebugJavaWithJavac是什么,从字面上看就是在debug调试的执行javac命令,编译器遇到不能解析的内容而抛出的异常。 上面一大片报红,很难定位错误的原因在哪里,在Terminal执行gradlew compileDebugJavaWithJavac命令能快速找到原因: 下面是命令执行结...
Android studio 描述简单bug解决之compileDebugJavaWithJavac
今天想写博客这天周五,在公司,SVN上合并了代码之后,以为今天的工作可以告一段落了,结果还没歇会儿看点其他啥的,测试人员过来说有bug,需要看下,结果跑过去一看是老版本的问题,没事,马上编出测试版给你再看。于是,再次打开AS开始编译apk了,出bug了!还是如此简单的描述:Execution <em>failed</em> for <em>task</em> ':<em>app</em>:compileDebugJavaWithJavac'看到这里,...
compileDebugJavaWithJavac 错误解决
错误: compileDebugJavaWithJavac 解决方法: 报这个错的原因贼多了。 想要知道具体的错误是什么。 就去File》Setting》Compile的Command-line Options里面输入–debug并确认 再运行一次就可以看到更详细的错误是什么了。
新手求救~~ app:compileDebugJavaWithJavac 上手一个报错,百度一天搞不定啊。。。
自己的一个老工程,加入了别人的代码,编译可以,运行就出问题了,先上报错截图 截图1: 截图2: 截图3: 最后在Terminal 敲入命令 gradlew compileDebugJavaWithJa
:app:compileDebugJavaWithJavac异常
异常:Error:Execution <em>failed</em> for <em>task</em> ':<em>app</em>:compileDebugJavaWithJavac'. &amp;gt; Compilation <em>failed</em>; see the compiler <em>error</em> output for details.  碰到这个异常我也是挺无语的,因为Android Studio根本不会提示你详细的错误信息。我们来看看这个博主:http://...
今天遇到的一个BUG :app:compileDebugJavaWithJavac'. Could not add entry '0' to cache localClassSetAnalysis.b
今天来开个项目,一运行跑debug包就报:<em>app</em>:compileDebugJavaWithJavac'. Could not add entry '0' to cache localClassSetAnalysis.bin  ,打成正式包又没问题,就百度了下,在stackoverflow上找到一篇 https://stackoverflow.com/questions/37827055/cou
Databinding :app:compileDebugJavaWithJavac
使用databinding时候,有时因为以前的习惯,喜欢复制粘贴已有的界面以及布局,从而导致BR文件出现错误,或者找不到对应界面的Binding,下图是本人在复制粘贴fragment时出现的错误,提供参考在网上搜索了解决一些办法,提供一些总结得比较好的文章:Data Binding的报错集合: 例如Error:(10, 54) 错误: 程序包com.kodulf.recyclerviewdatab
compileReleaseJavaWithJavac
如果你打release 包的时候,出现这个问题,那么请你先跑一下程序,肯定是有什么方法名,或者什么东西没找到。release 的时候不会报错,只有你跑的时候才会报错。
adnroid 打包问题 :compileReleaseJavaWithJavac
今天打包的时候,由于着急。改了些本地的变化就assembleRelease. 然后就报错: compileReleaseJavaWithJavac后来网上乱找,。。。。 之后我想到先跑一下,果然是因为少一个字符串。 所以,以后打包的时候,要先确保你的代码可以运行起来。注意: 1.打包之前确保你的代码能够运行起来。 打包过程中遇到问题,先跑一下代码,看看能不能跑起来。 2.打包的时候,要
Error:Execution failed for task ':app:compileDebugJavaWithJavac'.问题报错
Error:Execution <em>failed</em> for <em>task</em> ':<em>app</em>:compileDebugJavaWithJavac'. &amp;gt; Compilation <em>failed</em>; see the compiler <em>error</em> output for details. 增加了dataBinding的注解导致的这个错误,去掉就完美解决了...
TaskExecutionException: Execution failed for task ':app:compileDebugJavaWithJavac'
问题 编译的时候出错,而且也没有定位到错误 org.gradle.api.<em>task</em>s.TaskExecutionException: Execution <em>failed</em> for <em>task</em> ':<em>app</em>:compileDebugJavaWithJavac'. at org.gradle.api.internal.<em>task</em>s.<em>execution</em>.ExecuteActionsTaskExecut...
Android Studio三种方式导入外部资源 以及 报错处理
android studio提供了三种方式导入外部资源:1. Library dependency – 在线添加、需联网下载2. File dependency – 从本地添加一些jar包(要先将jar包拷贝到项目的libs文件夹下)3. Module dependency – 从本地添加带有源码的库工程(要先 import Moudle 将库工程导入项目中) 其中第三种方式导入会报一些错误,这里
android studio导jar包找不到类的解决方法
今天更新了universal-image-loader-1.9.5.jar文件,studio死活找不到其中相关的类,上网百度试了很多办法,总算解决了,具体方法跟一篇老外的帖子的差不多,这里分享下。 解决步骤: Something went wrong in incremental build system. One of this should ...
关于android项目导入外部jar包的问题
一个android项目需要导入一个外部的jar包。在我导入jar包后,没有报任何的错误,可是当我运行的时候就错误,找了半天,最后发现它提示说没有找到那个类(就是在导入的包里的类)然后然后,就各种Google,各种百度,最后就解决的哈,我的解决方法是这样的:(有同样问题的童鞋可以试试哈)一、 在项目右键--&amp;gt; Build Path --&amp;gt; Configure Build Path --&amp;...
Error:Execution failed for task ':app:compileDebugAidl'. > aidl is missing(Android Studio编译错误)
今天下载了一个1.2.1.1版本的Android Studio,使用VPN更新好SDK之后就新建了一个hello world工程测试一下环境,然后就出现以下错误: Error:Execution <em>failed</em> for <em>task</em> ':<em>app</em>:compileDebugAidl'. > aidl is missing
Android Studio3.0 Error:Execution failed for task ':app:javaPreCompileDebug' 错误
Error:Execution <em>failed</em> for <em>task</em> ':<em>app</em>:javaPreCompileDebug'. &amp;gt; Annotation processors must be explicitly declared now.  The following dependencies on the compile classpath are found to contain annota...
Error:Execution failed for task ':pullToRefreshListFragment:processDebugAndr
问题描述:从github上down下的pullToRefresh项目(https://github.com/johannilsson/android-pulltorefresh):导入Android studio出现如图的问题及解决方式: RefreshListFragment中没有指明其编译的最低版本;因为它依赖了pullToRefresh_library库,所以它的miniSdkVe
[Android Studio]关于定位compileDebugJavaWithJavac具体问题的方法
在Windows中,在系统cmd调出的控制台,进入项目的根目录,输入以下命令: gradlew compileDebugJavaWithJavac --stacktrace 如果是在Linux/Mac下,这样输入: ./gradlew compileDebugJavaWithJavac --stacktrace 然后等待以下,会看到详细错误信息 ...
java.lang.NoClassDefFoundError: Failed resolution of: Landroid/support/v4/animation/AnimatorCompatHe
apk使用RecycleView运行的时候出现了这个错误,导致apk崩溃,根本原因是gradle中声明的RecycleView的方式是:    implementation 'com.android.support:recyclerview-v7:24.2.1'而在前面定义了AppCompat的声明implementation 'com.android.support:<em>app</em>compat-v7:2...
学生信息管理系统(java源码)下载
功能:<br>1,1套完美的学生/老师登陆系统<br>2,老师可增加/删除科目,学科等信息<br>3,可增加/删除学生信息<br>4,分5个版块:[学生资料管理] [学生成绩管理] [系统设置] [查询与报表] [操作员管理] [退出]<br> 相关下载链接:[url=//download.csdn.net/download/user_ylc/463847?utm_source=bbsseo]//download.csdn.net/download/user_ylc/463847?utm_source=bbsseo[/url]
寒江独钓----代码下载
内核程序的知识涉及面非常广,不同类别的内核程序差别也特别大,他几乎都有所涉猎 4.5.7 打开两种键盘端口驱动寻找设备 81 7.7.2 文件的打开与关闭 203 1.3.1 下载和安装WinDbg 9 相关下载链接:[url=//download.csdn.net/download/uestczhangchao/2044099?utm_source=bbsseo]//download.csdn.net/download/uestczhangchao/2044099?utm_source=bbsseo[/url]
asp 获取ip下载
asp 获取 ip ,获取ip asp技术 供学习 相关下载链接:[url=//download.csdn.net/download/zhongzhizhuo/4786917?utm_source=bbsseo]//download.csdn.net/download/zhongzhizhuo/4786917?utm_source=bbsseo[/url]
相关热词 c# 标准差 计算 c#siki第五季 c#入门推荐书 c# 解码海康数据流 c# xml的遍历循环 c# 取 查看源码没有的 c#解决高并发 委托 c#日期转化为字符串 c# 显示问号 c# 字典对象池
我们是很有底线的