myeclipse maven run as clean install都没有反应 [问题点数:40分]

Bbs1
本版专家分:93
结帖率 94.44%
Bbs4
本版专家分:1397
Bbs1
本版专家分:35
Bbs1
本版专家分:0
Bbs1
本版专家分:0
java maven项目、运行没问题,cleaninstall出现这个错误。请问为啥?
-
svn 下载一个maven 项目 为啥先 run as maven clean 然后maven install
为啥先 <em>run</em> as <em>maven</em> <em>clean</em> 然后<em>maven</em> <em>install</em>
maven clean install报系统资源不足
系统资源不足。 有关详细信息, 请参阅以下堆栈跟踪。 java.lang.OutOfMemoryError: Java heap space at com.sun.tools.javac.util.Position$LineMapImpl.build(Position.java:153 ) at com.sun.tools.javac.util.Posit...
为什么maven命令一般只用cleaninstall
项目中的<em>maven</em>命令如下:nmvn <em>clean</em> -U <em>install</em> -D<em>maven</em>.test.skip=true -DskipTestsn为什么只有<em>clean</em>(清除target)和<em>install</em>(放到本地仓库供其他模块使用),没有complie和package。同事说<em>install</em>包含了编译和打包,是这样吗?是的话为什么没有包含<em>clean</em>只包含了compile和package呢
maven cleaninstall产生的错误
今天想写一点东西。 因为用<em>maven</em>的时候老是<em>clean</em>后<em>install</em>会报错,所以看了很多资料,得到了一些自己的见解。 首先,<em>maven</em>的<em>clean</em>是删除target文件。在项目真实路径里,target是一直存在的(target文件夹里一直有class文件夹和test-class文件夹),而且删除的只是src里java的字节码文件。 <em>maven</em>的<em>install</em>是打包,把项目发布到本地仓库。...
maven clean install遇到测试代码编译失败
今天执行<em>maven</em>命令的时候:<em>maven</em> <em>clean</em> <em>install</em> -X的时候,报错: org.apache.<em>maven</em>.lifecycle.LifecycleExecutionException: Failed to execute goal org.apache.<em>maven</em>.plugins:<em>maven</em>-surefire-plugin:2.6:test (default-test) on...
Eclipse Maven Build命令执行无效解决方法
现象右键项目- <em>run</em> as – <em>maven</em> <em>install</em> 时,控制台没有任何响应  原因 Jdk没有配置<em>maven</em>的执行参数解决方法1.打开eclipse的window菜单:2.接着选定<em>maven</em>项目使用的jdk,点击edit按钮,出现如下页面:3.在红色框中添加如图所示的一行代码,代码如下: -D<em>maven</em>.multiModuleProjectDirectory=D:\\apache-mav...
eclipse Run as Maven install毫无反应
eclipse的<em>maven</em>项目中,Run as Maven <em>install</em>的时候发现毫无<em>反应</em>,控台console中也不打印任何信息,是因为没有传参数,解决步骤如下:1、打开eclipse中的Window菜单,选择<em>maven</em>项目所使用的jdk版本,之后点击Edit按钮:注意:红框内的代码为:“-D<em>maven</em>.multiModuleProjectDirectory=$MAVEN_HOME”,其中的“M...
eclipse maven 项目运行mvn clean 后无法运行
2019独角兽企业重金招聘Python工程师标准&gt;&gt;&gt; ...
maven 项目在eclipse中没有 run as -> maven clean , maven install 等选项
1.在项目上右击, 选择 configure ->Convert to <em>maven</em> project 此命令把该项目转换成 <em>maven</em> 项目 2.然后在项目右击, <em>run</em> as 选项里就有 <em>maven</em> <em>install</em> 菜单了
maven初使用遇到的一些问题-Eclipse中执行maven命令无反应
eclipse中运行<em>maven</em>命令没有<em>反应</em> 问题现象:在Eclipse中建好一个<em>maven</em>工程后,通过<em>run</em> as执行<em>maven</em> 的各种命令时,Eclipse没有任何<em>反应</em>,console控制台也没有任何东西打印出来。 解决方法:打开Window-preference-java-Installed JREs,如下图:  选择项目所使用的jdk,双击打开下图:  在红线圈出的地方配置这个参数...
maven clean install 执行测试类 内存溢出设置
&amp;lt;build&amp;gt; &amp;lt;plugins&amp;gt; &amp;lt;plugin&amp;gt; &amp;lt;groupId&amp;gt;org.apache.<em>maven</em>.plugins&amp;lt;/groupId&amp;gt; &amp;lt;artifactId&amp;gt;<em>maven</em>-surefire-plugin&amp;lt;/artifactId&amp;gt;
Windows install clean up
一直以为微软这个东西是累赘,现在才发现原来很强大。
window install clean up
window <em>install</em> <em>clean</em> up 工具
Windows Install Clean Up
Windows Install Clean Up
Windows Install Clean Up.zip
清除安装与反安装失败程序信息,itunes安装时网络路径什么的时候可以用到
Windows Install Clean Up+SRVINSTW
两个不错的工具,供卸载头痛的sqlserver使用
windows install clean up
windows自带的服务卸载软件,很强大
windows install clean up.rar
windows <em>install</em> <em>clean</em> up,用于清除桌面系统、win10、win7等卸载不干净的内容。 运行方式,用管理员方式运行 安装软件后,运行软件,选中需要删除项,remove即可。 本想把下载积分改成0,结果,csdn跟川普学会了,只要是跟csdn沾边就成它的了!!!连撤销上传的地方<em>都没有</em>,这不不就是流氓吗!!!
myeclipse中使用maven插件的时候,运行run as maven test或者install的时候报错,显示teminated....javaw.exe
在<em>myeclipse</em>中使用<em>maven</em>插件的时候,运行<em>run</em> as <em>maven</em> test或者<em>install</em>的时候报错,显示teminated....javaw.exe
maven run clean install 的时候报错,完全看不懂,求教大神(下面的板块确实傻傻分不清)
[ERROR] Failed to execute goal org.apache.<em>maven</em>.plugins:<em>maven</em>-javadoc-plugin:2.8:jar (default) on project spring<em>maven</em>project: MavenReportException: Error while creating archive: rn[ERROR] Exit code: 1 - ȡD:\repository\org\springframework\spring-core\4.3.9.RELEASE\spring-core-4.3.9.RELEASE.jar; invalid LOC header (bad signature)rn[ERROR] javadoc: com.mine.spring<em>maven</em>project.daorn[ERROR] javadoc: com.mine.spring<em>maven</em>project.entityrn[ERROR] javadoc: com.mine.spring<em>maven</em>project.servicern[ERROR] rn[ERROR] Command line was: "C:\Program Files\Java\jdk1.8.0_111\jre\..\bin\javadoc.exe" @options @packagesrn[ERROR] rn[ERROR] Refer to the generated Javadoc files in 'D:\eclipse 存储路径\spring<em>maven</em>project\target\apidocs' dir.rn[ERROR] -> [Help 1]rnorg.apache.<em>maven</em>.lifecycle.LifecycleExecutionException: Failed to execute goal org.apache.<em>maven</em>.plugins:<em>maven</em>-javadoc-plugin:2.8:jar (default) on project spring<em>maven</em>project: MavenReportException: Error while creating archive: rnExit code: 1 - D:\repository\org\springframework\spring-core\4.3.9.RELEASE\spring-core-4.3.9.RELEASE.jar; invalid LOC header (bad signature)rnjavadoc: com.mine.spring<em>maven</em>project.daornjavadoc: com.mine.spring<em>maven</em>project.entityrnjavadoc: com.mine.spring<em>maven</em>project.servicernrnCommand line was: "C:\Program Files\Java\jdk1.8.0_111\jre\..\bin\javadoc.exe" @options @packagesrnrnRefer to the generated Javadoc files in 'D:\eclipse 存储路径\spring<em>maven</em>project\target\apidocs' dir.rnrn at org.apache.<em>maven</em>.lifecycle.internal.MojoExecutor.execute(MojoExecutor.java:213)rn at org.apache.<em>maven</em>.lifecycle.internal.MojoExecutor.execute(MojoExecutor.java:154)rn at org.apache.<em>maven</em>.lifecycle.internal.MojoExecutor.execute(MojoExecutor.java:146)rn at org.apache.<em>maven</em>.lifecycle.internal.LifecycleModuleBuilder.buildProject(LifecycleModuleBuilder.java:117)rn at org.apache.<em>maven</em>.lifecycle.internal.LifecycleModuleBuilder.buildProject(LifecycleModuleBuilder.java:81)rn at org.apache.<em>maven</em>.lifecycle.internal.builder.singlethreaded.SingleThreadedBuilder.build(SingleThreadedBuilder.java:51)rn at org.apache.<em>maven</em>.lifecycle.internal.LifecycleStarter.execute(LifecycleStarter.java:128)rn at org.apache.<em>maven</em>.DefaultMaven.doExecute(DefaultMaven.java:309)rn at org.apache.<em>maven</em>.DefaultMaven.doExecute(DefaultMaven.java:194)rn at org.apache.<em>maven</em>.DefaultMaven.execute(DefaultMaven.java:107)rn at org.apache.<em>maven</em>.cli.MavenCli.execute(MavenCli.java:993)rn at org.apache.<em>maven</em>.cli.MavenCli.doMain(MavenCli.java:345)rn at org.apache.<em>maven</em>.cli.MavenCli.main(MavenCli.java:191)rn at sun.reflect.NativeMethodAccessorImpl.invoke0(Native Method)rn at sun.reflect.NativeMethodAccessorImpl.invoke(NativeMethodAccessorImpl.java:62)rn at sun.reflect.DelegatingMethodAccessorImpl.invoke(DelegatingMethodAccessorImpl.java:43)rn at java.lang.reflect.Method.invoke(Method.java:498)rn at org.codehaus.plexus.classworlds.launcher.Launcher.launchEnhanced(Launcher.java:289)rn at org.codehaus.plexus.classworlds.launcher.Launcher.launch(Launcher.java:229)rn at org.codehaus.plexus.classworlds.launcher.Launcher.mainWithExitCode(Launcher.java:415)rn at org.codehaus.plexus.classworlds.launcher.Launcher.main(Launcher.java:356)rnCaused by: org.apache.<em>maven</em>.plugin.MojoExecutionException: MavenReportException: Error while creating archive: rnExit code: 1(这些地方是有些乱码的,发布出来我只有删了) D:\repository\org\springframework\spring-core\4.3.9.RELEASE\spring-core-4.3.9.RELEASE.jarʱ; invalid LOC header (bad signature)rnjavadoc: com.mine.spring<em>maven</em>project.dao(这些地方是有些乱码的,发布出来我只有删了)rnjavadoc: com.mine.spring<em>maven</em>project.entity(这些地方是有些乱码的,发布出来我只有删了)rnjavadoc: com.mine.spring<em>maven</em>project.service(这些地方是有些乱码的,发布出来我只有删了)rnrnCommand line was: "C:\Program Files\Java\jdk1.8.0_111\jre\..\bin\javadoc.exe" @options @packagesrnrnRefer to the generated Javadoc files in 'D:\eclipse 存储路径\spring<em>maven</em>project\target\apidocs' dir.rnrn at org.apache.<em>maven</em>.plugin.javadoc.AbstractJavadocMojo.failOnError(AbstractJavadocMojo.java:5777)rn at org.apache.<em>maven</em>.plugin.javadoc.JavadocJar.execute(JavadocJar.java:207)rn at org.apache.<em>maven</em>.plugin.DefaultBuildPluginManager.executeMojo(DefaultBuildPluginManager.java:134)rn at org.apache.<em>maven</em>.lifecycle.internal.MojoExecutor.execute(MojoExecutor.java:208)rn ... 20 morernCaused by: org.apache.<em>maven</em>.reporting.MavenReportException: rnExit code: 1 -D:\repository\org\springframework\spring-core\4.3.9.RELEASE\spring-core-4.3.9.RELEASE.jar; invalid LOC header (bad signature)rnjavadoc: com.mine.spring<em>maven</em>project.daornjavadoc: com.mine.spring<em>maven</em>project.entityrnjavadoc: com.mine.spring<em>maven</em>project.service(这些地方是有些乱码的,发布出来我只有删了)rnrnCommand line was: "C:\Program Files\Java\jdk1.8.0_111\jre\..\bin\javadoc.exe" @options @packagesrnrnRefer to the generated Javadoc files in 'D:\eclipse 存储路径\spring<em>maven</em>project\target\apidocs' dir.rnrn at org.apache.<em>maven</em>.plugin.javadoc.AbstractJavadocMojo.executeJavadocCommandLine(AbstractJavadocMojo.java:4997)rn at org.apache.<em>maven</em>.plugin.javadoc.AbstractJavadocMojo.executeReport(AbstractJavadocMojo.java:1975)rn at org.apache.<em>maven</em>.plugin.javadoc.JavadocJar.execute(JavadocJar.java:179)rn ... 22 morern[ERROR] rn[ERROR] rn[ERROR] For more information about the errors and possible solutions, please read the following articles:rn[ERROR] [Help 1] http://cwiki.apache.org/confluence/display/MAVEN/MojoExecutionException
开机一点反应都没有
我昨天在玩游戏时机子突然关机,然后再开机就没<em>反应</em>了,就连CPU风扇都不转了,但是主板上的灯是亮的,rnrn后来拆开,将里边的电源线,还有开关的 接线统统拔了 插了一遍rn开机还是不行rn 拔了那个电池换了个也不行rnrn确认过了,电源是没事的,放别的机子可以,rn看主板里电容好好的rn没什么异常样子 就是开不了rnrn后来统统拔了电源插头后放那两天rn再开又可以开了,而且都正常rn等到晚上回来再开机rn完了,又开不了了 rn难道说是因为没拔掉电源弄的 ??rn怎么回事啊,帮帮忙,真的 快给弄晕了 ,,,,rnrn
运行什么都没有反应
我的电脑是XP2 pro,目前的情况是通过键盘快捷键或是鼠标等方式都无法打开系统的很多项功能,比如“我的电脑”,“网上邻居”,“控制面板”,“网络连接”,IE等,打开时看到鼠标出现几秒钟的沙漏,然后就没有<em>反应</em>了,在进程中看到随着出现drwtsn32的进程,此进程应是好的进程。杀软等在正常情况下也无法运行,新安装的一个百度HI也只能运行一小下随着就出现百度HI调用drwtsn32,最后关闭。有部分软件如OFFICE可以打开但很慢,随之就不会动了,只能结束进程。有部分软件可以正常使用,像FireFox可以使用,此贴就是firefox发的。在安全模式下瑞星杀毒软件可以运行,用几天前的病毒库杀了没有病毒,但升级不了杀软(带网络),系统关闭、启动与平时一样速度,没有感觉变慢,能运行的东西也没有感觉变慢,。我只用了一个ssm,ssm也能正常使用,在ssm 中也看不出什么不良的进程,看样子不象是中毒。rn这台机子平时是我自已专用,出现故障时是别人在用有故障后才告知我的,(但可以排除人为的因素),我当时看了ssm没有开启注册表的防护,我想这些故障是不是注册表什么地方被修改了?或是系统什么东西损坏了?rn请大家帮我一下,谢谢。这台机子不能重装,只能修复,再次谢谢。
为什么一点反应都没有
private void CheckBox1_CheckedChanged(object sender, System.EventArgs e)rn rn Response.Write(" ");rn rn
机器一点反应都没有
我的计算机前两天启动的时候,虽然启动不起来,但有长鸣声,把所有硬件拆下来重擦插后就一点声音也没有了,除了电源风扇和主板风扇转,硬盘灯也不闪也听不见硬盘读盘的声音,光驱灯亮但弹不出来,显示器是一直黄灯闪烁,内存和显卡我又重新插了一下,主板电池也放电后重装还是没<em>反应</em>,这是怎么回事?
Maven 工程clean tomcat7:run运行成功,访问失败
    创建<em>maven</em>工程后通过 <em>clean</em> tomcat7:<em>run</em>运行成功,但是使用localhost:8081访问失败。pom文件夹中也正确配置了tomcat插件经过检查发现竟然是访问页面的问题。web.xml中设置了但是把Index.jsp创建在了WEB-INF下面,当把index.jsp放到webapp文件夹下面就行了。...
Maven clean tomcat7:run命令启动端口冲突,修改端口
-D<em>maven</em>.tomcat.port=8081 <em>clean</em> tomcat7:<em>run</em> -D<em>maven</em>.tomcat.port=8081把8081换成你需要的端口就ok, 简单解决问题
windows Install clean up.exe + srvinstw
windows Install <em>clean</em> up.exe + srvinstw 完全卸载SQL server2005所有服务,无需重装系统 先用windows Install <em>clean</em> up.exe 安全卸载SQL Server2005的程序,在用srvinstw 完全卸载SQL server2005所有服务,无需重装系统。 本人每次都是这样完全卸载SQL server2005。
Windows Install Clean Up工具
进行清除历史残留的残余文件,处理烦人的弹窗的问题,处理烦人的弹窗的问题
msicuu2 Windows Install Clean Up
Windows Install Clean Up SQL Server2005想完全卸载的话,可以用这个东西。其余的在添加/删除程序里删掉就可以了
jetty部署项目&maven cleaninstall报jdk错误解决
    有段时间没有做分享了,今天是因为新项目是<em>maven</em>的,每次用tomcat部署好慢,而<em>maven</em>的pom.xml里已经写了jetty的支持,就想到试试jetty部署,还别说,这个jetty还真是快。不废话了,先说说eclipse集成jetty。一,eclipse的jetty插件的集成help-&amp;gt;Eclipse marketplacesearch项的find输入jetty,点击go,选择...
maven clean install 错误: 编码GBK的不可映射字符
1.出现这种问题:主要是新建项目时,默认是GBK之后之后将项目改为UTF-8 或者Java      文件之默认是GBK后改称      UTF-8编码格式  2.解决方法:在刚新建项目时就将项目,改为UTF-8编码格式 或者就使用默认的编码模式 ,编码格式最好在新建项目      时设定,否则就不要写修改编码格式。
运行maven clean报错解决
[ERROR] Failed to execute goal org.apache.<em>maven</em>.plugins:<em>maven</em>-<em>clean</em>-plugin:2.4.1:<em>clean</em> (default-<em>clean</em>) on project cboss-framework: Execution default-<em>clean</em> of goal org.apache.<em>maven</em>.plugins:<em>maven</em>-<em>clean</em>-
maven聚合工程的子工程单独maven cleanmaven install失败
用了<em>maven</em>好久了,最近刚从git上下载下来一个<em>maven</em>项目,聚合工程.........有子工程A和B,A依赖B...直接对其子工程B进行<em>maven</em> <em>clean</em>后<em>maven</em> <em>install</em>,,,ok.........因为A依赖B,再对A进行<em>maven</em> <em>install</em>的时候...<em>install</em>失败:::::提示在本地仓库中,找不到B.jar这个包......但是当自己去本地仓库找的时候,发现有这...
run as maven install 出现中文注解报错问题。
中文注解不能注掉,公司要求我已经修改了rnwindow->preferences->workspace->text files encoding 为UTF-8rn,window->preferences->content types->text->java source file为UTF-8。rnproject->preferences->Resource->other为UTF-8。rnpom.xml里也加上了UTF-8rnrn但是依然报错,一下为错误代码,[???/??]????为中文注释。rnrnTotal time: 27.702 srn[INFO] Finished at: 2014-06-17T15:22:19+08:00rn[INFO] Final Memory: 37M/240Mrn[INFO] ------------------------------------------------------------------------rn[ERROR] Failed to execute goal org.apache.<em>maven</em>.plugins:<em>maven</em>-javadoc-plugin:2.8.1:jar (attach-javadocs) on project pcms-intf: MavenReportException: Error while creating archive:rn[ERROR] Exit code: 1 - D:\MyNew\pcms-intf\src\main\java\com\suning\pcms\constant\SysConfConstant.java:11: warning - Tag @see:illegal character: "47" in "[???/??]????"rn[ERROR] D:\MyNew\pcms-intf\src\main\java\com\suning\pcms\constant\SysConfConstant.java:11: warning - Tag @see:illegal character: "65288" in "[???/??]????"rn[ERROR] D:\MyNew\pcms-intf\src\main\java\com\suning\pcms\constant\SysConfConstant.java:11: warning - Tag @see:illegal character: "65289" in "[???/??]????"rn[ERROR] D:\MyNew\pcms-intf\src\main\java\com\suning\pcms\constant\CmmdtyRepeatConstant.java:11: warning - Tag @see:illegal character: "47" in "[???/??]????"rn[ERROR] D:\MyNew\pcms-intf\src\main\java\com\suning\pcms\constant\CmmdtyRepeatConstant.java:11: warning - Tag @see:illegal character: "65288" in "[???/??]????"rn[ERROR] D:\MyNew\pcms-intf\src\main\java\com\suning\pcms\constant\CmmdtyRepeatConstant.java:11: warning - Tag @see:illegal character: "65289" in "[???/??]????"rn[ERROR] D:\MyNew\pcms-intf\src\main\java\com\suning\pcms\rsc\PretreatmentMsgService.java:21: warning - Tag @see:illegal character: "47" in "[???/??]????"rn[ERROR] D:\MyNew\pcms-intf\src\main\java\com\suning\pcms\rsc\PretreatmentMsgService.java:21: warning - Tag @see:illegal character: "65288" in "[???/??]????"rn[ERROR] D:\MyNew\pcms-intf\src\main\java\com\suning\pcms\rsc\PretreatmentMsgService.java:21: warning - Tag @see:illegal character: "65289" in "[???/??]????"rn[ERROR] D:\MyNew\pcms-intf\src\main\java\com\suning\pcms\rsc\DistributeMsgService.java:11: warning - Tag @see:illegal character: "47" in "[???/??]????"rn[ERROR] D:\MyNew\pcms-intf\src\main\java\com\suning\pcms\rsc\DistributeMsgService.java:11: warning - Tag @see:illegal character: "65288" in "[???/??]????"rn[ERROR] D:\MyNew\pcms-intf\src\main\java\com\suning\pcms\rsc\DistributeMsgService.java:11: warning - Tag @see:illegal character: "65289" in "[???/??]????"rn[ERROR] D:\MyNew\pcms-intf\src\main\java\com\suning\pcms\rscserver\RscServerService.java:27: warning - Tag @see:illegal character: "47" in "[???/??]????"rn[ERROR] D:\MyNew\pcms-intf\src\main\java\com\suning\pcms\rscserver\RscServerService.java:27: warning - Tag @see:illegal character: "65288" in "[???/??]????"rn[ERROR] D:\MyNew\pcms-intf\src\main\java\com\suning\pcms\rscserver\RscServerService.java:27: warning - Tag @see:illegal character: "65289" in "[???/??]????"rn[ERROR] D:\MyNew\pcms-intf\src\main\java\com\suning\pcms\rscserver\RscConstant.java:21: warning - Tag @see:illegal character: "47" in "[???/??]????"rn[ERROR] D:\MyNew\pcms-intf\src\main\java\com\suning\pcms\rscserver\RscConstant.java:21: warning - Tag @see:illegal character: "65288" in "[???/??]????"rn[ERROR] D:\MyNew\pcms-intf\src\main\java\com\suning\pcms\rscserver\RscConstant.java:21: warning - Tag @see:illegal character: "65289" in "[???/??]????"rn[ERROR] D:\MyNew\pcms-intf\src\main\java\com\suning\pcms\rscserver\RequestDto.java:24: warning - Tag @see:illegal character: "47" in "[???/??]????"rn[ERROR] D:\MyNew\pcms-intf\src\main\java\com\suning\pcms\rscserver\RequestDto.java:24: warning - Tag @see:illegal character: "65288" in "[???/??]????"rn[ERROR] D:\MyNew\pcms-intf\src\main\java\com\suning\pcms\rscserver\RequestDto.java:24: warning - Tag @see:illegal character: "65289" in "[???/??]????"rn[ERROR] D:\MyNew\pcms-intf\src\main\java\com\suning\pcms\rscserver\EsbMsgVo.java:25: warning - Tag @see:illegal character: "47" in "[???/??]????"rn[ERROR] D:\MyNew\pcms-intf\src\main\java\com\suning\pcms\rscserver\EsbMsgVo.java:25: warning - Tag @see:illegal character: "65288" in "[???/??]????"rn[ERROR] D:\MyNew\pcms-intf\src\main\java\com\suning\pcms\rscserver\EsbMsgVo.java:25: warning - Tag @see:illegal character: "65289" in "[???/??]????"rn[ERROR] D:\MyNew\pcms-intf\src\main\java\com\suning\pcms\rscserver\ApplicationContextInit.java:25: warning - Tag @see:illegal character: "47" in "[???/??]????"rn[ERROR] D:\MyNew\pcms-intf\src\main\java\com\suning\pcms\rscserver\ApplicationContextInit.java:25: warning - Tag @see:illegal character: "65288" in "[???/??]????"rn[ERROR] D:\MyNew\pcms-intf\src\main\java\com\suning\pcms\rscserver\ApplicationContextInit.java:25: warning - Tag @see:illegal character: "65289" in "[???/??]????"rn
myEclipse 中使用maven命令 Tomcat:run没有任何反应,控制台console也没有输出任何语句
myEclipse 中使用<em>maven</em>命令 Tomcat:<em>run</em>没有任何<em>反应</em>,控制台console也没有输出任何语句
使用ajax什么反应都没有
我有一个注册会员的界面,初始界面在member_register.php的index函数,点击注册按钮就到member_resiter.php的sendMailingListRequest函数,结果什么<em>反应</em>也没有。rn我在sendMailingListRequest里面echo什么<em>都没有</em>输出。rnajax部分:rn[code=javascript]$(document).ready(function() rn $('#btnSave').click(function() if(check_name('First_name')&&check_name('Last_name')&&check_email()&&check_captcha()&&check_phonenumber())rnrn$.ajax(rntype: 'POST',rnURL: site_url+'/member_register/sendMailingListRequest',rndata: $('#btnSave').serialize(),rndataType: 'json', success:function(data) alert(data);rnvar error_message=false; $.each(data,function(index,item) if(index=="status_code") if(item=="400 Bad request") error_message=true; if(item=="200 OK")rnerror_message=false; rn else if(index=="json") if(error_message) $('#error_message').text(item.notification.message); $("#error_message").fadeIn(3000);rnreloadCaptcha();rn$("#error_message").fadeOut(3000);rn elsern$('#success_message').text(item.notification.message);rn$("#success_message").fadeIn(3000);rnreloadCaptcha();rn$("#success_message").fadeOut(3000);rn$('#First_name').val("");rn$('#Last_name').val("");rn$('#email').val("");rn$('#mobile').val("");rn$('#captcha').val("");rnrnrn ) rn,rnerror: function(response)rnrn);rnrn);[/code] rn检查有效性的地方没有问题,因为可以走到success:function(data) 然后跳到error
设置快捷键一点反应都没有
#1:rnPress Alt+1 to set focus to textboxrnrn我按下alt+1文本框没有焦点。你们有吗?
MyEclipse 怎么样 run as ??
原来用 eclipse3.3 写完jsp 后都需要 <em>run</em> as 选择 tomcat5.5 运行! 但是 myelipse 好象不需要 只要点下previewrn就可以看到网页效果 ! 但是用 和原来使用 tomcat5.5 不一样! myelipse/preview 显示效果是"显示内容" 而不是 显示内容 多了个双引号 和一个大括号 我想用 <em>run</em> as (tomcat5.5)运行我写的jsp ,html怎么操作!
myeclipse 怎样run java?
我是JAVA 初学者,rnrn向有些JAVA SOURCE 可以在界面上的RUN 按钮可以执行,有些不行,不知道为啥?rnrn我试过了:rn有的点一下按钮: 有的有:<em>run</em> as :java Application (我在测试MAP的时候有)rnrn有的就没有,只有MYECLIPSE SEVER APPLICTION (我在测试LIST的时候)rnrn我想问一下:怎么样才能RUN 这个Java呀?
myeclipse无法run运行
题主把<em>myeclipse</em>工作区间设置成为c盘,然后被小伙伴告知C盘最好不要作为工作路径。(影响系统启动)于是在d盘重建一个工作路径发现<em>myeclipse</em>里面类无法<em>run</em>运行了只有一个这样的提示![图片说明](https://img-ask.csdn.net/upload/201610/20/1476962739_165599.jpg)
MyEclipse Quick Install问题
MyEclipse + Eclipse 配置后弹出MyEclipse Quick Install问题,选择安装Matisse4MyEclipse Swing UI Designer 5.5.0。rn安装完以后弹出The current configuration contains errors and this operation can have unpredictable results。rnrnThe current configuration contains errors and this operation can have unpredictable results.rn MyEclipse JSP Design Support (5.5.0) requires plug-in "com.ibm.icu (3.4.4)", or equivalent.rn WST Web Core (1.5.3.z<em>myeclipse</em>55020070514) requires feature "org.eclipse.platform (3.2.0)", or equivalent.rn WST XML Core (1.5.4.z<em>myeclipse</em>55020070514) requires feature "org.eclipse.rcp (3.2.0)", or equivalent.rn WST Web Services Core (1.5.4.z<em>myeclipse</em>55020070514) requires feature "org.eclipse.platform (3.2.0)", or equivalent.rn WST Server Core (1.5.4.z<em>myeclipse</em>55020070514) requires feature "org.eclipse.rcp (3.2.0)", or equivalent.rn JST Web Core (1.5.4.z<em>myeclipse</em>55020070514) requires feature "org.eclipse.platform (3.2.0)", or equivalent.rn JST Server Core (1.5.4.z<em>myeclipse</em>55020070514) requires feature "org.eclipse.platform (3.2.0)", or equivalent.rn JST Enterprise UI (1.5.4.z<em>myeclipse</em>55020070514) requires feature "org.eclipse.platform (3.2.0)", or equivalent.rn JST Common Core (1.5.3.z<em>myeclipse</em>55020070514) requires feature "org.eclipse.platform (3.2.0)", or equivalent.rn JST Enterprise Core (1.5.4.z<em>myeclipse</em>55020070514) requires feature "org.eclipse.platform (3.2.0)", or equivalent.rn
jetty maven pom run
jetty <em>maven</em> pom <em>run</em> ---------------------------------------- http://knight-black-bob.iteye.com/blog/2360698
myeclipse quick install
我用的是<em>myeclipse</em>6.0 今天打开的时候出现<em>myeclipse</em> quick <em>install</em>对话框,这个对话框是做什么的?怎么才能取消?哪位知道啊,指点一下
Maven 执行 install 问题
导入工程,执行<em>maven</em> <em>install</em>时n报如下警告:n[WARNING] The POM for db2jcc:db2jcc:jar:0.x is missing, no dependency information availablen[WARNING] The POM for db2jcc:db2jcc_license_cisuz:jar:0.x is missing, no dependency information availablen[WARNING] The POM for db2jcc:db2jcc_license_cu:jar:0.x is missing, no dependency information availablen之后报如下错误:n[ERROR] Failed to execute goal on project TopMallWeb: Could not resolve dependencies for project com.gdrcu.96138:TopMallWeb:war:1.0: The following artifacts could not be resolved: db2jcc:db2jcc:jar:0.x, db2jcc:db2jcc_license_cisuz:jar:0.x,nn但是本地的<em>maven</em>库里是有相应的jar包的nn请教问题出在哪里?
maven install的用途
这个命令是什么用的,根据说明会自动安装一些东西到仓库里。rn是不是我可以从已经安装的archetype创建项目,如果可以要怎么做。rn比如我现在创建了一个项目,添加了spring,log4j,jettyrn并且我用了mvn <em>install</em>,之后我怎么快速的从这个原型创建一个新项目呢
maven install 报错
ERROR] Failed to execute goal on project mis: Could not resolve dependencies for project com.chinasoft.midea:mis:war:0.0.1-SNAPSHOT: Could not find artifact com.chinasoft.midea:user:jar:0.0.1-SNAPSHOT -> [Help 1]rn[ERROR] rn[ERROR] To see the full stack trace of the errors, re-<em>run</em> Maven with the -e switch.rn[ERROR] Re-<em>run</em> Maven using the -X switch to enable full debug logging.rn[ERROR] rn[ERROR] For more information about the errors and possible solutions, please read the following articles:rn[ERROR] [Help 1] http://cwiki.apache.org/confluence/display/MAVEN/DependencyResolutionExceptionrn
maven install 跳过测试类
在pom.xml 中添加以下代码即可: &amp;amp;lt;build&amp;amp;gt; &amp;amp;lt;plugins&amp;amp;gt; &amp;amp;lt;plugin&amp;amp;gt; &amp;amp;lt;groupId&amp;amp;gt;org.apache.<em>maven</em>.plugins&amp;amp;lt;/groupId&amp;amp;gt;
maven install的时候报错
Maven <em>install</em>失败 Failed to execute goal org.apache.<em>maven</em>.plugins:<em>maven</em>-compiler-plugin:3.1:compile (default-compile) on project autotest_fchtgl: Compilation failure ....... 总结办法如下:将IDE工具中的java中的
maveninstall的作用
一,使用eclipse 1,<em>maven</em>的<em>install</em>可以将项目本身编译并打包到本地仓库,这样其他项目引用本项目的jar包时不用去私服上下载jar包,直接从本地就可以拿到刚刚编译打包好的项目的jar包,很灵活,避免每次都需要重新往私服发布jar包的痛苦; 2,修改服务端比如manage层和dao层的项目的时候如果eclipse没有自动编译,则在调试的时候容易出很奇怪的错误,就是明明代码已经改好...
maven install 控制台乱码问题
修改 pom.xml 在 project 标签中添加如下配置:            -Dfile.encoding=UTF-8     如图:
maven install 报错解决方案
Failed to execute goal org.apache.<em>maven</em>.plugins:<em>maven</em>-compiler-plugin:3.3:compile
Maven install 出错解决方法
[ERROR] Failed to execute goal org.apache.<em>maven</em>.plugins:<em>maven</em>-<em>install</em>-plugin:2.3.1:<em>install</em> (default-<em>install</em>) on project  com/hs/moonbox/admin-api: Failed to <em>install</em> metadata  C:/Users/wang/.m2/repos
Maven install 问题
导入工程,执行<em>maven</em> <em>install</em>时rn报如下警告:rn[WARNING] The POM for db2jcc:db2jcc:jar:0.x is missing, no dependency information availablern[WARNING] The POM for db2jcc:db2jcc_license_cisuz:jar:0.x is missing, no dependency information availablern[WARNING] The POM for db2jcc:db2jcc_license_cu:jar:0.x is missing, no dependency information availablern之后报如下错误:rn[ERROR] Failed to execute goal on project TopMallWeb: Could not resolve dependencies for project com.gdrcu.96138:TopMallWeb:war:1.0: The following artifacts could not be resolved: db2jcc:db2jcc:jar:0.x, db2jcc:db2jcc_license_cisuz:jar:0.x,rnrn但是本地的<em>maven</em>库里是有相应的jar包的rnrn请教问题出在哪里?
maven install子项目报错
错误提示:Failed to execute goal on project pinyougou-sellergoods-interface: Could not resolve dependencies for project com.pinyougou:pinyougou-sellergoods-interface:jar:0.0.1-SNAPSHOT: Failed to collect d...
先执行mvn clean在执行mvn install 和mvn clean install有什么区别吗
先执行mvn <em>clean</em>在执行mvn <em>install</em> 和mvn <em>clean</em> <em>install</em>有什么区别吗
maven在Eclipse操作clean时报错
<em>maven</em>的<em>clean</em>时报错: -D<em>maven</em>.multiModuleProjectDirectory system propery is not set. Check $M2_HOME environment variable and mvn script match. 解决方案: 1、在计算机中添加M2_HOME的环境变量。 2、选择eclipse中windows的Preferenc...
Maven执行clean时候的问题
这是错误信息rn[code=java][INFO] Scanning for projects...rn[INFO] rn[INFO] ------------------------------------------------------------------------rn[INFO] Building beijing-crs 14.12.04rn[INFO] ------------------------------------------------------------------------rn[WARNING] The POM for org.apache.<em>maven</em>.plugins:<em>maven</em>-<em>clean</em>-plugin:jar:2.4.1 is invalid, transitive dependencies (if any) will not be available, enable debug logging for more detailsrn[INFO] rn[INFO] --- <em>maven</em>-<em>clean</em>-plugin:2.4.1:<em>clean</em> (default-<em>clean</em>) @ beijing-crs ---rn[WARNING] The POM for org.apache.<em>maven</em>.plugins:<em>maven</em>-<em>clean</em>-plugin:jar:2.4.1 is invalid, transitive dependencies (if any) will not be available, enable debug logging for more detailsrn[INFO] ------------------------------------------------------------------------rn[INFO] BUILD FAILURErn[INFO] ------------------------------------------------------------------------rn[INFO] Total time: 0.186srn[INFO] Finished at: Thu Dec 04 15:43:19 CST 2014rn[INFO] Final Memory: 2M/121Mrn[INFO] ------------------------------------------------------------------------rn[ERROR] Failed to execute goal org.apache.<em>maven</em>.plugins:<em>maven</em>-<em>clean</em>-plugin:2.4.1:<em>clean</em> (default-<em>clean</em>) on project beijing-crs: Execution default-<em>clean</em> of goal org.apache.<em>maven</em>.plugins:<em>maven</em>-<em>clean</em>-plugin:2.4.1:<em>clean</em> failed: A required class was missing while executing org.apache.<em>maven</em>.plugins:<em>maven</em>-<em>clean</em>-plugin:2.4.1:<em>clean</em>: org/codehaus/plexus/util/Osrn[ERROR] -----------------------------------------------------rn[ERROR] realm = plugin>org.apache.<em>maven</em>.plugins:<em>maven</em>-<em>clean</em>-plugin:2.4.1rn[ERROR] strategy = org.codehaus.plexus.classworlds.strategy.SelfFirstStrategyrn[ERROR] urls[0] = file:/C:/Users/yu/.m2/repository/org/apache/<em>maven</em>/plugins/<em>maven</em>-<em>clean</em>-plugin/2.4.1/<em>maven</em>-<em>clean</em>-plugin-2.4.1.jarrn[ERROR] urls[1] = file:/C:/Users/yu/.m2/repository/org/codehaus/plexus/plexus-utils/1.1/plexus-utils-1.1.jarrn[ERROR] Number of foreign imports: 1rn[ERROR] import: Entry[import from realm ClassRealm[<em>maven</em>.api, parent: null]]rn[ERROR] rn[ERROR] -----------------------------------------------------: org.codehaus.plexus.util.Osrn[ERROR] -> [Help 1]rn[ERROR] rn[ERROR] To see the full stack trace of the errors, re-<em>run</em> Maven with the -e switch.rn[ERROR] Re-<em>run</em> Maven using the -X switch to enable full debug logging.rn[ERROR] rn[ERROR] For more information about the errors and possible solutions, please read the following articles:rn[ERROR] [Help 1] http://cwiki.apache.org/confluence/display/MAVEN/PluginContainerException[/code]rnrn
maven install 时报错
WARNING] Missing POM for org.apache.<em>maven</em>.surefire:surefire-junit3:jar:2.16rn[INFO] Downloading: http://mirrors.ibiblio.org/pub/mirrors/<em>maven</em>2/org/apache/<em>maven</em>/surefire/surefire-junit3/2.16/surefire-junit3-2.16.jarrn[INFO] ------------------------------------------------------------------------rn[INFO] Reactor Summary:rn[INFO] rn[INFO] smartrouter ........................................ SUCCESS [ 15.674 s]rn[INFO] A Smart Log Control Bundle ......................... FAILURE [ 23.133 s]rn[INFO] JNI Manage Bundle .................................. SKIPPEDrn[INFO] Gateway Manage Bundle .............................. SKIPPEDrn[INFO] commonUtil Bundle .................................. SKIPPEDrn[INFO] Bundel Manage Center ............................... SKIPPEDrn[INFO] ------------------------------------------------------------------------rn[INFO] BUILD FAILURErn[INFO] ------------------------------------------------------------------------rn[INFO] Total time: 40.602 srn[INFO] Finished at: 2014-07-07T21:02:56+08:00rn[INFO] Final Memory: 12M/29Mrn[INFO] ------------------------------------------------------------------------rn[ERROR] Failed to execute goal org.apache.<em>maven</em>.plugins:<em>maven</em>-surefire-plugin:2.16:test (default-test) on project com.gj.s304.smartlog: Unable to generate classpath: org.apache.<em>maven</em>.artifact.resolver.MultipleArtifactsNotFoundException: Missing:rn[ERROR] ----------rn[ERROR] 1) org.apache.<em>maven</em>.surefire:surefire-junit3:jar:2.16rn[ERROR] rn[ERROR] Try downloading the file manually from the project website.rn[ERROR] rn[ERROR] Then, <em>install</em> it using the command:rn[ERROR] mvn <em>install</em>:<em>install</em>-file -DgroupId=org.apache.<em>maven</em>.surefire -DartifactId=surefire-junit3 -Dversion=2.16 -Dpackaging=jar -Dfile=/path/to/filern[ERROR] rn[ERROR] Alternatively, if you host your own repository you can deploy the file there:rn[ERROR] mvn deploy:deploy-file -DgroupId=org.apache.<em>maven</em>.surefire -DartifactId=surefire-junit3 -Dversion=2.16 -Dpackaging=jar -Dfile=/path/to/file -Durl=[url] -DrepositoryId=[id]rn[ERROR] rn[ERROR] Path to dependency:rn[ERROR] 1) dummy:dummy:jar:1.0rn[ERROR] 2) org.apache.<em>maven</em>.surefire:surefire-junit3:jar:2.16rn[ERROR] rn[ERROR] ----------rn[ERROR] 1 required artifact is missing.rn[ERROR] rn[ERROR] for artifact:rn[ERROR] dummy:dummy:jar:1.0rn[ERROR] rn[ERROR] from the specified remote repositories:rn[ERROR] ibiblio.org (http://mirrors.ibiblio.org/pub/mirrors/<em>maven</em>2, releases=true, snapshots=false)rn[ERROR] -> [Help 1]rn[ERROR] rn[ERROR] To see the full stack trace of the errors, re-<em>run</em> Maven with the -e switch.rn[ERROR] Re-<em>run</em> Maven using the -X switch to enable full debug logging.rn[ERROR] rn[ERROR] For more information about the errors and possible solutions, please read the following articles:rn[ERROR] [Help 1] http://cwiki.apache.org/confluence/display/MAVEN/MojoExecutionExceptionrn[ERROR] rn[ERROR] After correcting the problems, you can resume the build with the commandrn[ERROR] mvn -rf :com.gj.s304.smartlogrnrnrnrn请大家帮忙给看一下
maven install时出现问题
[INFO] Scanning for projects...rn[INFO] Downloading: https://repo.spring.io/libs-release/org/springframework/boot/spring-boot-starter-parent/1.3.5.RELEASE/spring-boot-starter-parent-1.3.5.RELEASE.pomrn[INFO] Downloading: http://repo.<em>maven</em>.apache.org/<em>maven</em>2/org/springframework/boot/spring-boot-starter-parent/1.3.5.RELEASE/spring-boot-starter-parent-1.3.5.RELEASE.pomrn[ERROR] The build could not read 1 project -> [Help 1]rn[ERROR] rn[ERROR] The project com.founder:bdp:0.0.1 (E:\work\workspace\demo\pom.xml) has 1 errorrn[ERROR] Non-resolvable parent POM: Could not transfer artifact org.springframework.boot:spring-boot-starter-parent:pom:1.3.5.RELEASE from/to spring-releases (https://repo.spring.io/libs-release): connect timed out and 'parent.relativePath' points at no local POM @ line 15, column 10 -> [Help 2]rn[ERROR] rn[ERROR] To see the full stack trace of the errors, re-<em>run</em> Maven with the -e switch.rn[ERROR] Re-<em>run</em> Maven using the -X switch to enable full debug logging.rn[ERROR] rn[ERROR] For more information about the errors and possible solutions, please read the following articles:rn[ERROR] [Help 1] http://cwiki.apache.org/confluence/display/MAVEN/ProjectBuildingExceptionrn[ERROR] [Help 2] http://cwiki.apache.org/confluence/display/MAVEN/UnresolvableModelExceptionrn请大神解答有哪些错误的可能呢?
maven install 程序包不存在
大家通常会在自己的一个项目中依赖另外一个项目,最简单的方式就是把依赖的项目(A项目)<em>install</em>到本地<em>maven</em>库,然后在新项目(B项目)中通过dependency引用。 我这里遇到一个奇葩问题,A项目成功<em>install</em>到本地<em>maven</em>库了,B项目引用没问题,<em>run</em>也没有问题,但是我再把B项目<em>install</em>的时候却报找不到A项目的程序包,百度了好多,大家都说是jdk版本问题,我都看了无数遍jd
test-mvn clean install -Dmaven.test.skip=true dependency:sources
NULL 博文链接:https://swanmarx.iteye.com/blog/1778928
maven不能install项目, mvn install报错
![图片说明](https://img-ask.csdn.net/upload/201511/11/1447208798_757246.png)n说找不到这个类,但是在我的仓库里头明明又有这个类n![图片说明](https://img-ask.csdn.net/upload/201511/11/1447209183_497411.png)n新手上路,最基本的一个HelloWorld了,求大神解救
mvn clean install失败 如何解决
首先说下正常的话IDEA使用<em>maven</em> <em>clean</em> <em>install</em>是不会有问题的,但是我们公司不让我们自己打包 我忘记了还是mvn <em>install</em>了,导致targat不能访问了,项目跑不起来,百度搜了一下说idea可以自己打包,试了一下不行 请教了组长说先mvn <em>clean</em>下 然后再启动项目,依然不行,我就想着是不是我之前加的jar包问题,就删除了之前设置jar, 然后在META-INF...
modem 2008下载
电脑moden支持问题,非常好用的手动挡等等等等等等打成 相关下载链接:[url=//download.csdn.net/download/chenlinfan/3394644?utm_source=bbsseo]//download.csdn.net/download/chenlinfan/3394644?utm_source=bbsseo[/url]
installanywhere2009使用说明下载
installanywhere2009使用说明,教你如何打包 相关下载链接:[url=//download.csdn.net/download/cngezhao/3557358?utm_source=bbsseo]//download.csdn.net/download/cngezhao/3557358?utm_source=bbsseo[/url]
Lock by Xiaofei下载
自己写的一个屏幕锁(挂机锁) 高手勿喷 相关下载链接:[url=//download.csdn.net/download/spongelearn/4137590?utm_source=bbsseo]//download.csdn.net/download/spongelearn/4137590?utm_source=bbsseo[/url]
相关热词 c#入门推荐书 c# 解码海康数据流 c# xml的遍历循环 c# 取 查看源码没有的 c#解决高并发 委托 c#日期转化为字符串 c# 显示问号 c# 字典对象池 c#5.0 安装程序 c# 分页算法
我们是很有底线的