Qt报错Error - RtlWerpReportException failed with status code :-1073741823. Will tr [问题点数:40分]

Bbs1
本版专家分:0
结帖率 20%
Bbs12
本版专家分:380708
Blank
状元 2017年 总版技术专家分年内排行榜第一
Blank
榜眼 2014年 总版技术专家分年内排行榜第二
Blank
探花 2013年 总版技术专家分年内排行榜第三
Blank
进士 2018年总版新获得的技术专家分排名前十
2012年 总版技术专家分年内排行榜第七
Bbs9
本版专家分:66823
版主
Blank
金牌 2016年7月 总版技术专家分月排行榜第一
2016年6月 总版技术专家分月排行榜第一
2016年4月 总版技术专家分月排行榜第一
Blank
银牌 2016年5月 总版技术专家分月排行榜第二
Blank
优秀版主 2016年10月优秀大版主
2016年8月论坛优秀大版主
Blank
铜牌 2016年11月 总版技术专家分月排行榜第三
2016年8月 总版技术专家分月排行榜第三
解决Qt 运行错误 错误代码 : code -1073741571
Qt 用着确实挺方便,以前没用过C++ 有些概念理解不好。 在用Qt 绘制坐标系时 点击 RUN 出现以下错误: Application Output: Starting F:\Qt_Code\Qt_Table\Qt_table-build-desktop-Qt_4_8_4__4_8_4__Debug\debug\Qt_table.exe... The program has unex
SQLSERVER数据库中的字段类型对应的java类型
今天遇到一个问题,做一个带图片和文字内容的数据保存时,用了sqlsever2008的varbinary(MAX)这个字段,但是因为用sqlserver比较少,很多字段对应的java数据类型都忘了,因此就百度确定了下,发现自己用对varbinary(MAX)这个字段类型用byte[]这种java数据类型与之对应还是对的。 在此记录下查到Mysql和Sqlsever的字段类型与java类型的对应关...
一个编译报错
这个<em>报错</em>是什么意思?我百度之,说是什么关于越界的事,但是我的程序应该不存在越界问题 程序结构大致是: class tank:public QWidget{} class Btank: public
Qt 编译时报错“退出,退出代码2”的原因
-------------------------------------------- -- 创建人:Ruo_Xiao -- 邮箱:xclsoftware@163.com -------------------------------------------- 1、<em>报错</em>如下: 2、原因: 工程路径中存在中文,如上图中的“测试”。     (SAW:Game Over...
Qt 段错误解决办法1
做多语言翻译,无缘无故段错误
mapviewoffile failed with error code 8
一个文件可能有几百M,分段映射,每次映射64MB,如果不足64MB,是多少就映射多少,有时会出现映射失败,<em>error</em> <em>code</em>值为8,Not enough storage is available to process this command。搜了下资料,大意有可能是多次分配映射后产生了内存碎片,导致虚拟空间虽然有足够的内存,但没有一块连续的足够大的内存,所以分配失败(这有可能是一个原因,也许还有其他的原因)。求解决方法rn除了一次映射64kb外还有神马方法?
BluetoothFindFirstRadio() failed with error code 259?
BluetoothFindFirstRadio()<em>failed</em> with <em>error</em> <em>code</em> 259,明明有设备存在,却找不到,是为什么呢?
报错 :error: command 'gcc' failed with exit status 1
系统: CentOS6.5 ,Python3.6n安装 mysqlclient 时候 <em>报错</em>:<em>error</em>: command 'gcc' <em>failed</em> with exit <em>status</em> 1n以下是错误信息:nCollecting mysqlclientn Using cached mysqlclient-1.3.10.tar.gznInstalling collected packages: mysqlclientn Running setup.py install for mysqlclient ... <em>error</em>n Complete output from command /usr/local/python3/bin/python3.6 -u -c "import setuptools, tokenize;__file__='/tmp/pip-build-t3olsi0s/mysqlclient/setup.py';f=getat<em>tr</em>(tokenize, 'open', open)(__file__);<em>code</em>=f.read().replace('\r\n', '\n');f.close();exec(compile(<em>code</em>, __file__, 'exec'))" install --record /tmp/pip-oqq8k4wv-record/install-record.txt --single-version-externally-managed --compile:n running installn running buildn running build_pyn creating buildn creating build/lib.linux-x86_64-3.6n copying _mysql_exceptions.py -> build/lib.linux-x86_64-3.6n creating build/lib.linux-x86_64-3.6/MySQLdbn copying MySQLdb/__init__.py -> build/lib.linux-x86_64-3.6/MySQLdbn copying MySQLdb/compat.py -> build/lib.linux-x86_64-3.6/MySQLdbn copying MySQLdb/connections.py -> build/lib.linux-x86_64-3.6/MySQLdbn copying MySQLdb/converters.py -> build/lib.linux-x86_64-3.6/MySQLdbn copying MySQLdb/cursors.py -> build/lib.linux-x86_64-3.6/MySQLdbn copying MySQLdb/release.py -> build/lib.linux-x86_64-3.6/MySQLdbn copying MySQLdb/times.py -> build/lib.linux-x86_64-3.6/MySQLdbn creating build/lib.linux-x86_64-3.6/MySQLdb/constantsn copying MySQLdb/constants/__init__.py -> build/lib.linux-x86_64-3.6/MySQLdb/constantsn copying MySQLdb/constants/CLIENT.py -> build/lib.linux-x86_64-3.6/MySQLdb/constantsn copying MySQLdb/constants/CR.py -> build/lib.linux-x86_64-3.6/MySQLdb/constantsn copying MySQLdb/constants/ER.py -> build/lib.linux-x86_64-3.6/MySQLdb/constantsn copying MySQLdb/constants/FIELD_TYPE.py -> build/lib.linux-x86_64-3.6/MySQLdb/constantsn copying MySQLdb/constants/FLAG.py -> build/lib.linux-x86_64-3.6/MySQLdb/constantsn copying MySQLdb/constants/REFRESH.py -> build/lib.linux-x86_64-3.6/MySQLdb/constantsn running build_extn building '_mysql' extensionn creating build/temp.linux-x86_64-3.6n gcc -pthread -Wsign-compare -DNDEBUG -g -fwrapv -O3 -Wall -Ws<em>tr</em>ict-prototypes -fPIC -Dversion_info=(1,3,10,'final',0) -D__version__=1.3.10 -I/usr/include/mysql -I/usr/local/python3/include/python3.6m -c _mysql.c -o build/temp.linux-x86_64-3.6/_mysql.o -g -fstack-protector -m64 -fPIC -g -fabi-version=2 -fno-omit-frame-pointer -fno-s<em>tr</em>ict-aliasingn In file included from /usr/local/python3/include/python3.6m/Python.h:8,n from _mysql.c:40:n /usr/local/python3/include/python3.6m/pyconfig.h:600:1: warning: "HAVE_MBRTOWC" redefinedn In file included from _mysql.c:29:n /usr/include/mysql/my_config.h:439:1: warning: this is the location of the previous definitionn gcc -pthread -shared build/temp.linux-x86_64-3.6/_mysql.o -L/usr/lib64 -lmysqlclient -lpthread -lm -lrt -ldl -o build/lib.linux-x86_64-3.6/_mysql.cpython-36m-x86_64-linux-gnu.son /usr/bin/ld: cannot find -lmysqlclientn collect2: ld returned 1 exit <em>status</em>n <em>error</em>: command 'gcc' <em>failed</em> with exit <em>status</em> 1n n ----------------------------------------nCommand "/usr/local/python3/bin/python3.6 -u -c "import setuptools, tokenize;__file__='/tmp/pip-build-t3olsi0s/mysqlclient/setup.py';f=getat<em>tr</em>(tokenize, 'open', open)(__file__);<em>code</em>=f.read().replace('\r\n', '\n');f.close();exec(compile(<em>code</em>, __file__, 'exec'))" install --record /tmp/pip-oqq8k4wv-record/install-record.txt --single-version-externally-managed --compile" <em>failed</em> with <em>error</em> <em>code</em> 1 in /tmp/pip-build-t3olsi0s/mysqlclient/nnn按照别的帖子 yum install 了 python-devel了还是一样..而且 安装的python-devel的version 是2.6.6的 跟我的Python版本不符,但是yum仓库里又没有 3.6的 python-develnn如何解决?菜鸡求助...n
谷歌浏览器弹框报错:Error:status code is 0
谷歌浏览器<em>报错</em>:Error:<em>status</em> <em>code</em> is 0rnrn[<em>code</em>=HTML] rnrn rnrn rnrn rnrn rnrn rn[/<em>code</em>]rnrn就是上面这段代码,键盘事件,当按下回车键的时候就提交表单页面跳转,但是在谷歌浏览器会弹出一个警告框Error:<em>status</em> <em>code</em> is 0,是为什么?别的ie,ff都好使~·不解。
dll在xp系统下正常,在vista系统关闭报错:RtlWerpReportException failed
详细信息如下,有没人遇到过?rn[400] Error - rn[400] RtlWerpReportException <em>failed</em> with <em>status</em> <em>code</em> :-1073741772. Will <em>tr</em>y to launch the process directly rn[400] rn[400] Error - rn[400] Failed to create the process C:\Windows\system32\WerFault.exe
Qt :-1073741823 错误总结(备忘)
Error - RtlWerpReportException <em>failed</em> with <em>status</em> <em>code</em> :-<em>1073741823.</em> Will <em>tr</em>y to launch the process directly RtlWerpReportException <em>failed</em> with <em>status</em> <em>code</em> :-<em>1073741823.</em> Will <em>tr</em>y to launch the proc
Qt段错误集录(RtlWerpReportException failed with status code :-1073741823. Will try to launch the process)
Qt中经常出现段错误,其原因大多是内存问题,形式如下: RtlWerpReportException <em>failed</em> with <em>status</em> <em>code</em> :-<em>1073741823.</em> Will <em>tr</em>y to launch the process directly 这种错误在Linux下通常称为“段错误”,错误原因一般是内存问题,如访问了空指针、堆栈溢出、内存泄漏等,发生错误后第一件事就是检查内...
Qt编译错误Error - RtlWerpReportException failed with status code :-1073741823
这是一个比较新手入门常见的问题,其实说白了就是内存泄漏,很具体的说大部分就是你对类里面的一个指针变量没有初始化,一下面的例子为例,m_tooltip未初始化为0导致后面的判断未申请内存导致内存泄漏 #ifndef MYBARVIEW_H #define MYBARVIEW_H #include &amp;lt;QtWidgets/QApplication&amp;gt; #include &amp;lt;QtWid...
Qt Windows 安装问题RtlWerpReportException failed with status code :-1073741823
------------------------------------ Windows下Qt安装  ------------------------------------         需要下载以下三个文件 : Qt Creator   : <em>qt</em>-creator-windows-opensource-2.8.1.exe         (Qt Creator 2.8.1  Qt L
Qt 跨线程初始化变量,程序奔溃(Error - RtlWerpReportException failed with status code :-1073741823.
以及输出窗口会显示以下内容:Error - RtlWerpReportException <em>failed</em> with <em>status</em> <em>code</em>:-<em>1073741823.</em> Will <em>tr</em>y to launch the process directly Error - Failed to create the process C:\Windows\sy
win7 writefile failed error code 5
我在win7上写了个application.是对SD卡进行操作的!rn往里面写返回的<em>error</em> <em>code</em> 是5rn1.我已经调用了DeviceIoCon<em>tr</em>ol(hDevice,FSCTL_LOCK_VOLUME,NULL,0,NULL,0,&dwOutBytes,()NULL)rn2.uAC也已经拉到最低(关了)rn但仍然是<em>error</em> <em>code</em> 5rn请问怎么解决
SSPI handshake failed with error code 0x8009030c
服务器总是出现如下的错误,请问是啥原因,如何解决?rnrnSSPI handshake <em>failed</em> with <em>error</em> <em>code</em> 0x8009030c while establishing a connection with integrated security; the connection has been closed. [CLIENT: 192.168.40.1]rnrn谢谢。
求助:Failed:Error Domain=AVFoundationErrorDomain Code=-11841
做视频合成时<em>报错</em>:Failed:Error Domain=AVFoundationErrorDomain Code=-11841 "Operation Stopped" UserInfo=NSLocalizedDescription=Operation Stopped, NSLocalizedFailureReason=The video could not be composed.rn有人知道这是什么问题导致的吗
求助:PING transmit failed, error code 1450
win2k server服务器每运行一段较长的时间(2到3个周左右)以后就出现PING <em>tr</em>ansmit <em>failed</em>, <em>error</em> <em>code</em> 1450,造成应用程序无法访问网络,只能重新启动机器,请高手大侠指点迷津,上述故障是什么原因、如何解决? rn rn记事本中系统错误记载如下: rn rnID 2019 rn rn服务器无法通过系统非页面共享区来进行分配,因为共享区当前是空的。
Execution failed with error code 1. 问题
[size=12px]本人初学J2ME,从sun官网下载了个Netbeans6.91和JDK,JDK已配置好环境变量并无错误!但用Netbeans6.91生成一个J2ME的项目试运行,就出现这个错误,麻烦高手指点下。[/size]rnrn具体错误信息:rn[color=#FF0000]Copying 1 file to C:\Users\sf\Documents\NetBeansProjects\MobileApplication1\dist\nbrun4595314924359565417rnCopying 1 file to C:\Users\sf\Documents\NetBeansProjects\MobileApplication1\dist\nbrun4595314924359565417rnJad URL for OTA execution: http://localhost:8082/servlet/org.netbeans.modules.mobility.project.jam.JAMServlet/C%3A/Users/sf/Documents/NetBeansProjects/MobileApplication1/dist//MobileApplication1.jadrnStarting emulator in execution modernC:\Users\sf\Documents\NetBeansProjects\MobileApplication1\nbproject\build-impl.xml:898: Execution <em>failed</em> with <em>error</em> <em>code</em> 1.rn生成失败(总时间:8 秒)[/color]rnrn提示的错误行:rn
运行Qt时,显示的错误信息令人费解
做一个画图板程序,遇到一个奇怪的问题。 运行程序是没有错误,只是退出的时候会显示一条信息。 E:\360Store\Codes\QtProject\Painter-build-desktop-Qt_4
Error - RtlWerpReportException failed with status code :-1073741823. Will try to launch the process
错误内容Error - RtlWerpReportException <em>failed</em> with <em>status</em> <em>code</em> :-<em>1073741823.</em> Will <em>tr</em>y to launch the process directly 程序异常结束。这个问题是编译通过,但是运行时<em>报错</em>! 关于Qt Creator报上诉错,通过debug定位错误的地方是在申请堆内存的地方出错。仔细的查了相关代码,还是没什么大
简述内存管理的原理和其简单实现
我们平时在linux或者其他的嵌入式系统中经常会用到两个函数,malloc和free。因为有这种动态内存分配的方法,所以给我们日常的编程带来了很多的便捷之处。那么,这两个函数其工作机理是怎么样的呢?在这里,我不想太过复杂地去阐述操作系统中其真正的运行过程,只是把这种动态内存分配的一些思路给说明一下,因为真正的动态内存分配是十分复杂的,我这里只能简单地描述其中的一种,并用C来把这种动态内存分配的方法给
Ubuntu打deb包,出现dpkg-shlibdeps: error问题解决办法
今天打一个依赖于protobuf的deb包,出现了以下错误: dpkg-shlibdeps: <em>error</em>: no dependency information found for /usr/local/lib/libprotobuf.so.15 由于protobuf是手动装的,不是通过dpkg deb安装的,所以没有protobuf的依赖信息,解决办法也很简单: 到需要打包的目录中,找到...
NSHTTPURLResponse中获取Status Code和Error Code 和 Header内容
NSHTTPURLResponse *response = nil; NSError *<em>error</em> = nil; [NSURLConnection sendSynchronousRequest:webView.request returningResponse:&response <em>error</em>:&<em>error</em>]; NSLog(@"%@",webView.request
The compiler failed with error code 128错误的问题
访问我的服务器上所有aspx程序均出现下面这种错误: rnrnServer Error in '/' Application. rn-------------------------------------------------------------------------------- rnrnCompilation Error rnDescription: An <em>error</em> occurred during the compilation of a resource required to service this request. Please review the following specific <em>error</em> details and modify your source <em>code</em> appropriately. rnrnCompiler Error Message: The compiler <em>failed</em> with <em>error</em> <em>code</em> 128. rnrn在网上查到了这篇文章,但是也没有帮助 rnhttp://www.hanselman.com/blog/Trackback,guid,bf4814b2-c3b8-4fa6-b232-9fad081eaab4.aspx rnrn请高手解答rn
noVNC报错:Failed to connect to server (code: 1006)
我的openstack共三个节点,控制节点、计算节点、dashboardrn控制节点安装mysql、keystone、swift-proxy、nova-api、cinder-api等控制组件rn计算节点安装nova-computes、swift-storage等计算和存储组件rndashboard安装dashboard组件,rnrn当时只在dashboard和计算节点启用了noVNC,控制节点没有启用rn在打开实例console时<em>报错</em>:Failed to connect to server (<em>code</em>: 1006)rn日志为openstack At<em>tr</em>ibuteError: 'NoneType' object has no at<em>tr</em>ibute 'items'rnrn官方的文档说控制节点和计算节点都 要装noVNC,然后就在控制节点启用了noVNC,但打开console时仍<em>报错</em>:Failed to connect to server (<em>code</em>: 1006),日志时的错误变成了 [errno 98]Address already in use(大概是这个意思,具体怎么写的忘了)rnrn也不能理解nova.conf里关于noVNC 的参数为什么要这么设置,反正官方文档里说是控制节点、计算节点、dashboard都要设置成本机地址,就一直狂改,一会都 改成控制节点的IP,一会都改成计算节点的IP、都解决不。rnrn问题一、noVNC应该在哪个节点上启动,应该怎么配置,rn问题 二、这些<em>报错</em>怎么解决
VS Design time报错code generation failed
“Code generation <em>failed</em>.....xx is not marked as serializable”rn提示自定义的构件rn我把定义的类前加了[Serializable]可还是不行rn快烦死了rn请问这是怎么回事啊
Compiler Error Message: The compiler failed with error code 128.
不知道什么时候开始报这个错误,现在已经重装了.NetFrame Work 1.0 +sp2还是<em>报错</em>,问题出在哪呢?rnrnrnServer Error in '/' Application.rn--------------------------------------------------------------------------------rnrnCompilation Error rnDescription: An <em>error</em> occurred during the compilation of a resource required to service this request. Please review the following specific <em>error</em> details and modify your source <em>code</em> appropriately. rnrnCompiler Error Message: The compiler <em>failed</em> with <em>error</em> <em>code</em> 128.rnrnrnrnShow Detailed Compiler Output:rnrnrnC:\WINNT\system32> "c:\winnt\microsoft.net\framework\v1.0.3705\csc.exe" /t:library /utf8output /R:"c:\winnt\assembly\gac\system\1.0.3300.0__b77a5c561934e089\system.dll" /R:"c:\winnt\assembly\gac\system.web\1.0.3300.0__b03f5f7f11d50a3a\system.web.dll" /R:"c:\winnt\microsoft.net\framework\v1.0.3705\mscorlib.dll" /R:"c:\winnt\microsoft.net\framework\v1.0.3705\temporary asp.net files\root\872f2ddf\d6fd8929\assembly\dl2\444e3219\80aba5cf_0683c401\webapplication2.dll" /R:"c:\winnt\assembly\gac\system.xml\1.0.3300.0__b77a5c561934e089\system.xml.dll" /R:"c:\winnt\assembly\gac\system.enterpriseservices\1.0.3300.0__b03f5f7f11d50a3a\system.enterpriseservices.dll" /R:"c:\winnt\assembly\gac\system.drawing\1.0.3300.0__b03f5f7f11d50a3a\system.drawing.dll" /R:"c:\winnt\assembly\gac\system.web.services\1.0.3300.0__b03f5f7f11d50a3a\system.web.services.dll" /R:"c:\winnt\assembly\gac\system.data\1.0.3300.0__b77a5c561934e089\system.data.dll" /out:"C:\WINNT\Microsoft.NET\Framework\v1.0.3705\Temporary ASP.NET Files\root\872f2ddf\d6fd8929\brwra8a8.dll" /D:DEBUG /debug+ /optimize- /warnas<em>error</em> /w:1 "C:\WINNT\Microsoft.NET\Framework\v1.0.3705\Temporary ASP.NET Files\root\872f2ddf\d6fd8929\brwra8a8.0.cs"rnrnrnrn rnrnrnrnShow Complete Compilation Source:rnrnrnLine 1: //------------------------------------------------------------------------------rnLine 2: // rnLine 3: // This <em>code</em> was generated by a tool.rnLine 4: // Runtime Version: 1.0.3705.288rnLine 5: //rnLine 6: // Changes to this file may cause incorrect behavior and will be lost if rnLine 7: // the <em>code</em> is regenerated.rnLine 8: // rnLine 9: //------------------------------------------------------------------------------rnLine 10: rnLine 11: namespace ASP rnLine 12: using System;rnLine 13: using System.Collections;rnLine 14: using System.Collections.Specialized;rnLine 15: using System.Configuration;rnLine 16: using System.Text;rnLine 17: using System.Text.RegularExpressions;rnLine 18: using System.Web;rnLine 19: using System.Web.Caching;rnLine 20: using System.Web.SessionState;rnLine 21: using System.Web.Security;rnLine 22: using System.Web.UI;rnLine 23: using System.Web.UI.WebCon<em>tr</em>ols;rnLine 24: using System.Web.UI.HtmlCon<em>tr</em>ols;rnLine 25: rnLine 26: rnLine 27: [System.Runtime.CompilerServices.CompilerGlobalScopeAt<em>tr</em>ibute()]rnLine 28: public class Global_asax : WebApplication2.Global rnLine 29: rnLine 30: private static bool __intialized = false;rnLine 31: rnLine 32: public Global_asax() rnLine 33: if ((ASP.Global_asax.__intialized == false)) rnLine 34: ASP.Global_asax.__intialized = <em>tr</em>ue;rnLine 35: rnLine 36: rnLine 37: rnLine 38: rnLine 39: rn rnrnrnrnrn--------------------------------------------------------------------------------rnVersion Information: Microsoft .NET Framework Version:1.0.3705.288; ASP.NET Version:1.0.3705.288
征解:Compiler Error Message: The compiler failed with error code 128.
不知道什么时候开始报这个错误,现在已经重装了.NetFrame Work 1.0 +sp2还是<em>报错</em>,问题出在哪呢?rnrnrnServer Error in '/' Application.rn--------------------------------------------------------------------------------rnrnCompilation Error rnDescription: An <em>error</em> occurred during the compilation of a resource required to service this request. Please review the following specific <em>error</em> details and modify your source <em>code</em> appropriately. rnrnCompiler Error Message: The compiler <em>failed</em> with <em>error</em> <em>code</em> 128.rnrnrnrnShow Detailed Compiler Output:rnrnrnC:\WINNT\system32> "c:\winnt\microsoft.net\framework\v1.0.3705\csc.exe" /t:library /utf8output /R:"c:\winnt\assembly\gac\system\1.0.3300.0__b77a5c561934e089\system.dll" /R:"c:\winnt\assembly\gac\system.web\1.0.3300.0__b03f5f7f11d50a3a\system.web.dll" /R:"c:\winnt\microsoft.net\framework\v1.0.3705\mscorlib.dll" /R:"c:\winnt\microsoft.net\framework\v1.0.3705\temporary asp.net files\root\872f2ddf\d6fd8929\assembly\dl2\444e3219\80aba5cf_0683c401\webapplication2.dll" /R:"c:\winnt\assembly\gac\system.xml\1.0.3300.0__b77a5c561934e089\system.xml.dll" /R:"c:\winnt\assembly\gac\system.enterpriseservices\1.0.3300.0__b03f5f7f11d50a3a\system.enterpriseservices.dll" /R:"c:\winnt\assembly\gac\system.drawing\1.0.3300.0__b03f5f7f11d50a3a\system.drawing.dll" /R:"c:\winnt\assembly\gac\system.web.services\1.0.3300.0__b03f5f7f11d50a3a\system.web.services.dll" /R:"c:\winnt\assembly\gac\system.data\1.0.3300.0__b77a5c561934e089\system.data.dll" /out:"C:\WINNT\Microsoft.NET\Framework\v1.0.3705\Temporary ASP.NET Files\root\872f2ddf\d6fd8929\brwra8a8.dll" /D:DEBUG /debug+ /optimize- /warnas<em>error</em> /w:1 "C:\WINNT\Microsoft.NET\Framework\v1.0.3705\Temporary ASP.NET Files\root\872f2ddf\d6fd8929\brwra8a8.0.cs"rnrnrnrn rnrnrnrnShow Complete Compilation Source:rnrnrnLine 1: //------------------------------------------------------------------------------rnLine 2: // rnLine 3: // This <em>code</em> was generated by a tool.rnLine 4: // Runtime Version: 1.0.3705.288rnLine 5: //rnLine 6: // Changes to this file may cause incorrect behavior and will be lost if rnLine 7: // the <em>code</em> is regenerated.rnLine 8: // rnLine 9: //------------------------------------------------------------------------------rnLine 10: rnLine 11: namespace ASP rnLine 12: using System;rnLine 13: using System.Collections;rnLine 14: using System.Collections.Specialized;rnLine 15: using System.Configuration;rnLine 16: using System.Text;rnLine 17: using System.Text.RegularExpressions;rnLine 18: using System.Web;rnLine 19: using System.Web.Caching;rnLine 20: using System.Web.SessionState;rnLine 21: using System.Web.Security;rnLine 22: using System.Web.UI;rnLine 23: using System.Web.UI.WebCon<em>tr</em>ols;rnLine 24: using System.Web.UI.HtmlCon<em>tr</em>ols;rnLine 25: rnLine 26: rnLine 27: [System.Runtime.CompilerServices.CompilerGlobalScopeAt<em>tr</em>ibute()]rnLine 28: public class Global_asax : WebApplication2.Global rnLine 29: rnLine 30: private static bool __intialized = false;rnLine 31: rnLine 32: public Global_asax() rnLine 33: if ((ASP.Global_asax.__intialized == false)) rnLine 34: ASP.Global_asax.__intialized = <em>tr</em>ue;rnLine 35: rnLine 36: rnLine 37: rnLine 38: rnLine 39: rn rnrnrnrnrn--------------------------------------------------------------------------------rnVersion Information: Microsoft .NET Framework Version:1.0.3705.288; ASP.NET Version:1.0.3705.288rn
Qt中出现的错误总结
QT错误:collect2:ld returned 1 exit <em>status</em> 1.编译成功的例子在后台执行,有时一闪而过,如果再次build ,则会提示上述错误。 解决方法:打开任务管理器,找到相应的exe进程,关闭即可;  或者直接关闭QtCreator。 2.没有编译成功的情况下,最常见情况是程序本身需要include的头文件被遗漏了 解决方法:细心查找基类所
编译内核报错,请问是什么原因啊。
-
petalinux auto login error
参照GU1144 使用petalinux 创建APP自动运行工程,编译时出现如下错误: ERROR: myapp-init-1.0-r0 do_install: Function <em>failed</em>: do_install (log file is located at /home/zynq/petalnx_prj/linux_gpio/build/tmp/work/cortexa9hf-neon-x...
解决Qt5.5运行时,出现Error - RtlWerpReportException failed with status code :-1073741823.
问题描述 在进行QT项目的运行时,出现了 Error - RtlWerpReportException <em>failed</em> with <em>status</em> <em>code</em> :-<em>1073741823.</em> Will <em>tr</em>y to launch the process directly 程序异常结束。 无法解决,查了网上的文章有的是缺少某些初始化数据。 解决办法 最后发现,在Qt中我用的是MySQL的数据库,而我的数据库没...
apache报错:request failed: error reading the headers
[Thu Sep 04 18:19:28 2008] [<em>error</em>] [client 125.120.123.86] request <em>failed</em>: <em>error</em> reading the headersrn[Thu Sep 04 18:19:33 2008] [<em>error</em>] [client 125.120.123.86] request <em>failed</em>: <em>error</em> reading the headersrn[Thu Sep 04 18:19:38 2008] [<em>error</em>] [client 125.120.123.86] request <em>failed</em>: <em>error</em> reading the headersrn[Thu Sep 04 18:19:43 2008] [<em>error</em>] [client 125.120.123.86] request <em>failed</em>: <em>error</em> reading the headersrn[Thu Sep 04 18:19:48 2008] [<em>error</em>] [client 125.120.123.86] request <em>failed</em>: <em>error</em> reading the headersrn[Thu Sep 04 18:19:53 2008] [<em>error</em>] [client 125.120.123.86] request <em>failed</em>: <em>error</em> reading the headersrn[Thu Sep 04 18:19:58 2008] [<em>error</em>] [client 125.120.123.86] request <em>failed</em>: <em>error</em> reading the headersrn[Thu Sep 04 18:20:03 2008] [<em>error</em>] [client 125.120.123.86] request <em>failed</em>: <em>error</em> reading the headersrn[Thu Sep 04 18:20:08 2008] [<em>error</em>] [client 125.120.123.86] request <em>failed</em>: <em>error</em> reading the headersrn[Thu Sep 04 18:20:24 2008] [<em>error</em>] [client 125.120.123.86] request <em>failed</em>: <em>error</em> reading the headersrn[Thu Sep 04 18:20:29 2008] [<em>error</em>] [client 125.120.123.86] request <em>failed</em>: <em>error</em> reading the headersrn[Thu Sep 04 18:20:34 2008] [<em>error</em>] [client 125.120.123.86] request <em>failed</em>: <em>error</em> reading the headersrn[Thu Sep 04 18:20:39 2008] [<em>error</em>] [client 125.120.123.86] request <em>failed</em>: <em>error</em> reading the headersrn[Thu Sep 04 18:20:44 2008] [<em>error</em>] [client 125.120.123.86] request <em>failed</em>: <em>error</em> reading the headersrn[Thu Sep 04 18:20:49 2008] [<em>error</em>] [client 125.120.123.86] request <em>failed</em>: <em>error</em> reading the headersrn[Thu Sep 04 18:20:54 2008] [<em>error</em>] [client 125.120.123.86] request <em>failed</em>: <em>error</em> reading the headersrn[Thu Sep 04 18:20:59 2008] [<em>error</em>] [client 125.120.123.86] request <em>failed</em>: <em>error</em> reading the headersrn[Thu Sep 04 18:21:05 2008] [<em>error</em>] [client 125.120.123.86] request <em>failed</em>: <em>error</em> reading the headersrn[Thu Sep 04 18:21:10 2008] [<em>error</em>] [client 125.120.123.86] request <em>failed</em>: <em>error</em> reading the headersrn[Thu Sep 04 18:21:15 2008] [<em>error</em>] [client 125.120.123.86] request <em>failed</em>: <em>error</em> reading the headersrnrn这种错误是什么原因造成的呢?是攻击吗?
求教gitment的初始化报错,Error: Validation Failed
看了网上的教程说是,因为issue的标签label有长度限制!labels的最大长度限制是50个字符。,id从默认 location.href改成 id: '',对着js之类的完全不知道,当初是想用一下这个评论功能,应该是该哪个文件的哪段代码啊,我连改的位置都找不到,求教各位大佬。[img=https://forum.csdn.net/PointForum/ui/scripts/csdn/Plugin/001/face/9.gif][/img]
DataStage Status Code
现在想获得DS作业运行完成之后返回的Status Code的值,要根据返回的值是不是0进行判断下一步操作,现在的难题是,不知道怎么获得Status Code,求指教
symtec netbackup status code
symtec netbackup <em>status</em> <em>code</em>
在Qt Creator中循环一次可以正常运行,循环两次时就崩溃了,是什么原因?该怎么办
-
qt连接信号与槽的问题报错的原因
有一个A类对象的指针a,A有信号signalA()和槽函数slotA(),连接这对信号与槽一般用如下语句: connect(a,SIGNAL(signalA()),this,SLOT(slotA())); 但是若a指向的对象没有实例化,该语句会<em>报错</em>。因此在连接信号与槽时,应该确保发送者和接收者都已经实例化,以免<em>报错</em>!
QT5 tableWidget转excel 无法转换成excel 错误-1073741823
-
【开发日记】错误杂锦
实际编程时,往往出现一些低级错误。这些错误与代码的使用本身无关,与算法也无关,而是由于自己的粗心大意。一旦出现这种错误,往往让人摸不着头脑,瞎糊弄半天没找出问题的根源。 将自己所犯过的低级错误一一记录于此,谨防日后再犯! 1、不要在子函数内部打印输出变量的值 因为,子函数往往被多次调用,每次调用的结果都不一样。如果用类似控制台打印、写文件的方法,只会显示或保存最后一次调用的结果!
响应状态码 status code
202: 成功 302: 临时转移至新的url 307: 临时转移至新的url 404: not found 500: 服务器内部错误
string to wstring error: codecvt convert failed! status=1, locale=zh_CN.UTF-8
请问这种问题怎么解决 rnrn程序在我的机器上可以运行 在别人的机器上跑不了 rnrn是用uni<em>code</em>编的 rnrn求 不吝赐教rnrn
Application application_1528268043578_0246 finished with failed status
[img=https://img-bbs.csdn.net/upload/201806/27/1530081178_674429.png][/img]
HTTP Status 500 - Error
如题,第一次用myeclipse 就出问题了,唉、、、rnimport java.io.IOException;rnimport java.io.OutputS<em>tr</em>eam;rnimport javax.servlet.GenericServlet;rnimport javax.servlet.ServletException;rnimport javax.servlet.ServletRequest;rnimport javax.servlet.ServletResponse;rnpublic class ServletDemo1 extends GenericServle<em>tr</em>nrn @Overridern public void service(ServletRequest req, ServletResponse res)rn throws ServletException, IOException rn OutputS<em>tr</em>eam out = res.getOutputS<em>tr</em>eam();rn out.write("Servlet!!!!".getBytes());rn rn rn[/<em>code</em>]rn这是Java代码、、、rnrnrn rn ServletDemo1rn /Web_Servlet/src/com/fox/ServletDemo1rn rn rn rn ServletDemo1rn /ServletDemo1rn rn rn rn index.jsprn rnrnrn这是配置文件,好了,然后我把server启动,在IE里面访问http://localhost:8080/Web_Servlet/ServletDemo1就出问题了。rn首先,ie里面显示500错误,服务器那段抛出java.lang.ClassNotFoundException: /Web_Servlet/src/com/fox/ServletDemo1这个异常、、、rn百度了好多,实在搞不明白,求大神啊!!!!!!
根据错误码获取错误信息,读写文件
CS<em>tr</em>ing GetErrorS<em>tr</em>ing(int errCode, LPTSTR name = NULL) { CS<em>tr</em>ing ret; LPVOID lpMsgBuf; FormatMessage(FORMAT_MESSAGE_ALLOCATE_BUFFER | FORMAT_MESSAGE_FROM_SYSTEM | FORMAT_MESSAGE_IGNORE_INSERTS,
从c++到初学qt
c++课程期末有个课设,我选的是一个仿扣扣聊天软件,那么就得涉及到GUI编程,开始尝试接触mfc,后了解到mfc已过时,遍想了解强大的<em>qt</em>。 首先,<em>qt</em>的安装和配置就很繁琐(我是小白),经几天的摸索,我总结下我的经验。希望对初学者有帮助。   首先我推荐大家看看《零基础学<em>qt</em>4编程》(吴迪),上面有很基础的东西。 首先得下载<em>qt</em> greator 网址:http://www.<em>qt</em>.io/dow
Eclipse 安装 maven2插件
Installing m2eclipse Core To install m2eclipse, use the following Eclipse update site to install the core of the m2eclipse plugin. This Core update site contains a single component: "Maven Integration for Eclipse (Required)". When you install this comp
新人Qt 打开别人的项目 release时遇到的问题 请前辈解答
在VS里面加了Qt库编写的程序 错误信息 Qt: Untested Windows version 6.2 detected! f:\graduation design\<em>code</em>\vaa3d\plug
Qt一条令人费解的错误
D:\Program Files (x86)\SogouInput\Components\Error - RtlWerpReportException <em>failed</em> with <em>status</em> <em>code</em> :-<em>1073741823.</em> Will <em>tr</em>y to launch the process directly在QT开发过程中,遇到一个很奇葩的问题,报异常直接报道搜狗拼音输入法中去了,首先想到的是卸载输...
sybase error status -6
我在insert语句的时候,数据库返回了 <em>error</em> -6这个状态是什么原因。rn求解,
Mysql 导入报错 error code:1166
视图:rncreate or replace view etl_opr_view rn(oprtype,oprtypename ,oprid,<em>code</em>,name,classified,<em>status</em>,projectid rn,projectname,principalid ,principal ,description ,remark,crtuserid ,crtuser rn,crtdate ,modifypersonid,modifyperson,modifydate rn,reqstartdate,reqenddate,planstartdate,planenddate,actualstartdate rn,actualenddate,planwork,actualwork,actualcost,severity,priority,completepercen<em>tr</em>n,filterstartdate, filterenddatern)rnasrnselect 21, '任务', taskid, wbs<em>code</em>, taskname, rn(case when metatype='0' then '任务' when metatype='1' then '里程碑' rnwhen metatype='2' then '阶段' when metatype='3' then '交付物' when rnmetatype='4' then '摘要任务'rnend) , rn(case when actualstartdate='' or actualstartdate is null then '未开始' when actualenddate='' or actualenddate is null then 'rn开始' else '完成'rnend) STATUS, rnprojectid, (select projectname from pj_baseinfo where rnprojectid=tk_baseinfo.projectid), rninchargepersonid, (select username from org_userinfo where rnuserid=tk_baseinfo.inchargepersonid), rn'', '',rn-1,'',null,rnmodifyperson,(select username from org_userinfo where rnuserid=tk_baseinfo.modifyperson), modifydate,rnnull,null,rnplanstartdate, planenddate,rnactualstartdate,actualenddate,rnplanworkload,actualworkload,0,rn'','',completepercent*100rn,planstartdate, planenddatern from tk_baseinfo where delflag=0 and completepercent< 1)) */rnrnError occured at:2014-07-17 10:34:00rnLine no.:29840rnError Code: 1166 - Incorrect column name '(case when metatype='0' then '任务' when metatype='1' then '里程碑' rnwhen metatype='2' then ''rn
pyOpenssl-0.14 安装 报错 command 'gcc' failed with exit status 1
系统 redhat 6rnrn编译安装 pyOpenSSL-0.14rnrn[root@jason pyOpenSSL-0.14]# python setup.py installrnrn<em>报错</em>如下: 看最后的红色标注rnrn……………… 字符限制 省略一些内容rnremoving: _configtest.c _configtest.ornc/_cffi_backend.c:13:17: <em>error</em>: ffi.h: No such file or directoryrnIn file included from c/_cffi_backend.c:43:rnc/malloc_closure.h:33: <em>error</em>: expected specifier-qualifier-list before ‘ffi_closure’rnc/malloc_closure.h: In function ‘more_core’:rnc/malloc_closure.h:69: warning: division by zerornc/malloc_closure.h:96: <em>error</em>: ‘union mmaped_block’ has no member named ‘next’rnc/malloc_closure.h: At top level:rnc/malloc_closure.h:105: <em>error</em>: expected ‘)’ before ‘*’ tokenrnc/malloc_closure.h:113: <em>error</em>: expected ‘=’, ‘,’, ‘;’, ‘asm’ or ‘__at<em>tr</em>ibute__’ before ‘*’ tokenrnc/_cffi_backend.c:209: <em>error</em>: expected specifier-qualifier-list before ‘ffi_cif’rnc/_cffi_backend.c: In function ‘cdataowninggc_dealloc’:rnc/_cffi_backend.c:1521: <em>error</em>: ‘ffi_closure’ undeclared (first use in this function)rnc/_cffi_backend.c:1521: <em>error</em>: (Each undeclared identifier is reported only oncernc/_cffi_backend.c:1521: <em>error</em>: for each function it appears in.)rnc/_cffi_backend.c:1521: <em>error</em>: ‘closure’ undeclared (first use in this function)rnc/_cffi_backend.c:1521: <em>error</em>: expected expression before ‘)’ tokenrnc/_cffi_backend.c:1524: warning: implicit declaration of function ‘cffi_closure_free’rnc/_cffi_backend.c: In function ‘cdataowninggc_<em>tr</em>averse’:rnc/_cffi_backend.c:1536: <em>error</em>: ‘ffi_closure’ undeclared (first use in this function)rnc/_cffi_backend.c:1536: <em>error</em>: ‘closure’ undeclared (first use in this function)rnc/_cffi_backend.c:1536: <em>error</em>: expected expression before ‘)’ tokenrnc/_cffi_backend.c: In function ‘cdataowninggc_clear’:rnc/_cffi_backend.c:1552: <em>error</em>: ‘ffi_closure’ undeclared (first use in this function)rnc/_cffi_backend.c:1552: <em>error</em>: ‘closure’ undeclared (first use in this function)rnc/_cffi_backend.c:1552: <em>error</em>: expected expression before ‘)’ tokenrnc/_cffi_backend.c: In function ‘cdataowning_repr’:rnc/_cffi_backend.c:1676: <em>error</em>: ‘ffi_closure’ undeclared (first use in this function)rnc/_cffi_backend.c:1676: <em>error</em>: expected expression before ‘)’ tokenrnc/_cffi_backend.c: At top level:rnc/_cffi_backend.c:2222: <em>error</em>: expected declaration specifiers or ‘...’ before ‘ffi_abi’rnc/_cffi_backend.c: In function ‘cdata_call’:rnc/_cffi_backend.c:2356: <em>error</em>: ‘ffi_abi’ undeclared (first use in this function)rnc/_cffi_backend.c:2356: <em>error</em>: expected ‘;’ before ‘fabi’rnc/_cffi_backend.c:2398: <em>error</em>: ‘fabi’ undeclared (first use in this function)rnc/_cffi_backend.c:2402: <em>error</em>: too many arguments to function ‘fb_prepare_cif’rnc/_cffi_backend.c:2407: <em>error</em>: ‘cif_description_t’ has no member named ‘exchange_size’rnc/_cffi_backend.c:2417: <em>error</em>: ‘cif_description_t’ has no member named ‘exchange_offset_arg’rnc/_cffi_backend.c:2447: <em>error</em>: ‘cif_description_t’ has no member named ‘exchange_offset_arg’rnc/_cffi_backend.c:2452: warning: implicit declaration of function ‘ffi_call’rnc/_cffi_backend.c:2452: <em>error</em>: ‘cif_description_t’ has no member named ‘cif’rnc/_cffi_backend.c: In function ‘b_new_primitive_type’:rnc/_cffi_backend.c:3356: <em>error</em>: ‘ffi_type’ undeclared (first use in this function)rnc/_cffi_backend.c:3356: <em>error</em>: ‘ffitype’ undeclared (first use in this function)rnc/_cffi_backend.c:3377: <em>error</em>: ‘ffi_type_sint8’ undeclared (first use in this function)rnc/_cffi_backend.c:3378: <em>error</em>: ‘ffi_type_sint16’ undeclared (first use in this function)rnc/_cffi_backend.c:3379: <em>error</em>: ‘ffi_type_sint32’ undeclared (first use in this function)rnc/_cffi_backend.c:3380: <em>error</em>: ‘ffi_type_sint64’ undeclared (first use in this function)rnc/_cffi_backend.c:3386: <em>error</em>: ‘ffi_type_float’ undeclared (first use in this function)rnc/_cffi_backend.c:3388: <em>error</em>: ‘ffi_type_double’ undeclared (first use in this function)rnc/_cffi_backend.c:3390: <em>error</em>: ‘ffi_type_longdouble’ undeclared (first use in this function)rnc/_cffi_backend.c:3396: <em>error</em>: ‘ffi_type_uint8’ undeclared (first use in this function)rnc/_cffi_backend.c:3397: <em>error</em>: ‘ffi_type_uint16’ undeclared (first use in this function)rnc/_cffi_backend.c:3398: <em>error</em>: ‘ffi_type_uint32’ undeclared (first use in this function)rnc/_cffi_backend.c:3399: <em>error</em>: ‘ffi_type_uint64’ undeclared (first use in this function)rnc/_cffi_backend.c: At top level:rnc/_cffi_backend.c:3953: <em>error</em>: expected specifier-qualifier-list before ‘ffi_type’rnc/_cffi_backend.c:3972: <em>error</em>: expected ‘=’, ‘,’, ‘;’, ‘asm’ or ‘__at<em>tr</em>ibute__’ before ‘*’ tokenrnc/_cffi_backend.c: In function ‘fb_build’:rnc/_cffi_backend.c:4103: <em>error</em>: ‘s<em>tr</em>uct funcbuilder_s’ has no member named ‘atypes’rnc/_cffi_backend.c:4103: <em>error</em>: ‘ffi_type’ undeclared (first use in this function)rnc/_cffi_backend.c:4103: <em>error</em>: expected expression before ‘)’ tokenrnc/_cffi_backend.c:4104: <em>error</em>: ‘s<em>tr</em>uct funcbuilder_s’ has no member named ‘nargs’rnc/_cffi_backend.c:4107: <em>error</em>: ‘s<em>tr</em>uct funcbuilder_s’ has no member named ‘rtype’rnc/_cffi_backend.c:4107: warning: implicit declaration of function ‘fb_fill_type’rnc/_cffi_backend.c:4115: <em>error</em>: ‘cif_description_t’ has no member named ‘exchange_offset_arg’rnc/_cffi_backend.c:4118: <em>error</em>: ‘s<em>tr</em>uct funcbuilder_s’ has no member named ‘rtype’rnc/_cffi_backend.c:4119: <em>error</em>: ‘ffi_arg’ undeclared (first use in this function)rnc/_cffi_backend.c:4129: <em>error</em>: ‘atype’ undeclared (first use in this function)rnc/_cffi_backend.c:4142: <em>error</em>: ‘s<em>tr</em>uct funcbuilder_s’ has no member named ‘atypes’rnc/_cffi_backend.c:4143: <em>error</em>: ‘s<em>tr</em>uct funcbuilder_s’ has no member named ‘atypes’rnc/_cffi_backend.c:4146: <em>error</em>: ‘cif_description_t’ has no member named ‘exchange_offset_arg’rnc/_cffi_backend.c:4153: <em>error</em>: ‘cif_description_t’ has no member named ‘exchange_size’rnc/_cffi_backend.c: In function ‘fb_build_name’:rnc/_cffi_backend.c:4175: <em>error</em>: ‘s<em>tr</em>uct funcbuilder_s’ has no member named ‘nargs’rnc/_cffi_backend.c:4184: <em>error</em>: ‘s<em>tr</em>uct funcbuilder_s’ has no member named ‘fct’rnc/_cffi_backend.c:4186: <em>error</em>: ‘s<em>tr</em>uct funcbuilder_s’ has no member named ‘fct’rnc/_cffi_backend.c: In function ‘fb_prepare_ctype’:rnc/_cffi_backend.c:4227: <em>error</em>: ‘s<em>tr</em>uct funcbuilder_s’ has no member named ‘fct’rnc/_cffi_backend.c:4237: <em>error</em>: ‘s<em>tr</em>uct funcbuilder_s’ has no member named ‘fct’rnc/_cffi_backend.c: At top level:rnc/_cffi_backend.c:4257: <em>error</em>: expected declaration specifiers or ‘...’ before ‘ffi_abi’rnc/_cffi_backend.c: In function ‘fb_prepare_cif’:rnc/_cffi_backend.c:4284: warning: implicit declaration of function ‘ffi_prep_cif’rnc/_cffi_backend.c:4284: <em>error</em>: ‘cif_description_t’ has no member named ‘cif’rnc/_cffi_backend.c:4284: <em>error</em>: ‘fabi’ undeclared (first use in this function)rnc/_cffi_backend.c:4284: <em>error</em>: ‘s<em>tr</em>uct funcbuilder_s’ has no member named ‘nargs’rnc/_cffi_backend.c:4285: <em>error</em>: ‘s<em>tr</em>uct funcbuilder_s’ has no member named ‘rtype’rnc/_cffi_backend.c:4285: <em>error</em>: ‘s<em>tr</em>uct funcbuilder_s’ has no member named ‘atypes’rnc/_cffi_backend.c:4285: <em>error</em>: ‘FFI_OK’ undeclared (first use in this function)rnc/_cffi_backend.c: In function ‘b_new_function_type’:rnc/_cffi_backend.c:4302: <em>error</em>: ‘FFI_DEFAULT_ABI’ undeclared (first use in this function)rnc/_cffi_backend.c:4340: <em>error</em>: too many arguments to function ‘fb_prepare_cif’rnc/_cffi_backend.c:4348: <em>error</em>: ‘s<em>tr</em>uct funcbuilder_s’ has no member named ‘nargs’rnc/_cffi_backend.c:4358: <em>error</em>: ‘s<em>tr</em>uct funcbuilder_s’ has no member named ‘nargs’rnc/_cffi_backend.c: In function ‘convert_from_object_fficallback’:rnc/_cffi_backend.c:4382: <em>error</em>: ‘ffi_arg’ undeclared (first use in this function)rnc/_cffi_backend.c: At top level:rnc/_cffi_backend.c:4454: <em>error</em>: expected ‘)’ before ‘*’ tokenrnc/_cffi_backend.c: In function ‘b_callback’:rnc/_cffi_backend.c:4525: <em>error</em>: ‘ffi_closure’ undeclared (first use in this function)rnc/_cffi_backend.c:4525: <em>error</em>: ‘closure’ undeclared (first use in this function)rnc/_cffi_backend.c:4546: <em>error</em>: ‘ffi_arg’ undeclared (first use in this function)rnc/_cffi_backend.c:4564: warning: implicit declaration of function ‘cffi_closure_alloc’rnc/_cffi_backend.c:4581: warning: implicit declaration of function ‘ffi_prep_closure’rnc/_cffi_backend.c:4581: <em>error</em>: ‘cif_description_t’ has no member named ‘cif’rnc/_cffi_backend.c:4582: <em>error</em>: ‘invoke_callback’ undeclared (first use in this function)rnc/_cffi_backend.c:4582: <em>error</em>: ‘FFI_OK’ undeclared (first use in this function)rnc/_cffi_backend.c: In function ‘init_cffi_backend’:rnc/_cffi_backend.c:5511: <em>error</em>: ‘FFI_DEFAULT_ABI’ undeclared (first use in this function)rn[color=#FF0000]<em>error</em>: Setup script exited with <em>error</em>: command 'gcc' <em>failed</em> with exit <em>status</em> 1[/color]rnrnrn我已经安装了 setup.cfg 里 rnrnbuild-requires = lynx openssl-devel python-devel python-sphinxrnrn的这几个软件,还有什么原因?感激不尽!!!rn
SSIS Error Code DTS_E_PRIMEOUTPUTFAILED. error code 0xC0202009
MessagernStarted: 1:06:23 AM Error: 2013-03-19 01:45:32.84 Code: 0xC002F304 Source: Send Mail Of SCTM Sync failure Send Mail Task Description: An <em>error</em> occurred with the following <em>error</em> message: "The specified s<em>tr</em>ing is not in the form required for a subject.". End Error rnrnError: 2013-03-19 01:45:32.86 Code: 0xC0202009 Source: Copy Test Cases To Local OLE DB Source [1] Description: SSIS Error Code DTS_E_OLEDBERROR. An OLE DB <em>error</em> has occurred. Error <em>code</em>: 0x80004005. An OLE DB record is available. Source: "Microsoft SQL Server Native Client 10.0" Hresult: 0x80004005 Description: "Transaction (Process ID 79) was deadlocked on lock resources with another process and has been chosen as the deadlock victim. Rerun the <em>tr</em>ansaction.". End Error rnrnError: 2013-03-19 01:45:32.89 Code: 0xC0047038 Source: Copy Test Cases To Local SSIS.Pipeline Description: [color=#FF0000]SSIS Error Code DTS_E_PRIMEOUTPUTFAILED.[/color] The PrimeOutput method on component "OLE DB Source" (1) returned <em>error</em> <em>code</em> 0xC0202009. The component returned a failure <em>code</em> when the pipeline engine called PrimeOutput(). The meaning of the failure <em>code</em> is defined by the component, but the <em>error</em> is fatal and the pipeline stopped executing. There may be <em>error</em> messages posted before this with more information about the failure. End Error DTExec: The package execution returned DTSER_FAILURE (1). rnrnStarted: 1:06:23 AM Finished: 1:45:41 AM Elapsed: 2357.61 seconds. The package execution <em>failed</em>. The step <em>failed</em>.rnrn偶尔会出现这个错误,不知道为什么?
Something went wrong - -32300 : transport error - HTTP status code was not 200
有谁见过这样的错误信息rnrn我所使用的环境是PHP5,jquery,jquery.form,rn每次的提交表单的时候就会有这错误,不知道是不是JSON的问题,还是什么问题.rn百度和google过了,没有确切的答案.
VUE中关于axios特别说明request failed with status code 404
VUE中关于axios特别说明request <em>failed</em> with <em>status</em> <em>code</em> 404 现场还原 这是在vue项目中,开始模拟数据用的是mock,进行假数据测试 在后台接口开发完毕之后,与真实数据做对接 当时在main.js是这样写的【除了长横线(-------------)的地方,其他地方暂时忽略】   import Vue from 'vue' import...
vue Error: Request failed with status code vue-cli 配置 proxyTable pathRewrite
vue-config-index.js中,proxyTable中的pathRewrite有什么用呢?  首先,在ProxyTable模块中设置了‘/api’,target中设置服务器地址,也就是接口的开头那段地址,例如‘172.0.0.1’,然后我们在调用接口的时候,就可以全局使用‘/api’,这时候‘/api’的作用就相当于‘172.0.0.1’,比如接口的地址是‘172.0.0.1/us...
axios特别说明request failed with status code 404
axios特别说明request <em>failed</em> with <em>status</em> <em>code</em> 404   同时叫后台允许跨域即可 (@CrossOrigin  后台在接口那里就加这点就实现跨域了,66;后台spring boot)
关于axios特别说明request failed with status code 404
以为最近在写项目是出现了这样的错误 样的一个错误 最开始我的解决方法是给他加上一个头如我上篇文档写的 也是可以解决的。 let instance = axios.create({ headers: {'content-type': 'application/x-www-form-urlen<em>code</em>d'}, withCredentials: <em>tr</em>ue }) ex
vue2中使用axios http请求出现的问题解决
使用axios处理post请求时,出现的问题解决默认情况下: axios.post(url, params).then(res => res.data);当url是远程接口链接时,会报404的错误: Uncaught (in promise) Error: Request <em>failed</em> with <em>status</em> <em>code</em> 404因为axios默认的header是: axios.defaults.h
Qt中tr()的作用
函数 <em>tr</em>()全名是QObject::<em>tr</em>(),被它处理的 字符串可以 使用工具提 取出来翻译 成其他语言, 也就是做国际化使用。 只要记住,Qt 的最佳实践:如果你想让你的程序国际化的话,那么,所有用户可见的字符串都要使用 QObject::<em>tr</em>()! 但是,为什么我们没有写 QObject::<em>tr</em>(),而仅仅是 <em>tr</em>()呢?原来,<em>tr</em>()函数是定义在 Object里面的,
an nuknown error occurred while processing the request on the server.the status code
小弟用了微软的atlas控件点击按钮的时候却报这个错误,求大侠们帮忙看一看。
QT tr的疑问
RTrnrn一直以来,我都以为<em>tr</em>("..")的<em>tr</em>是翻译成其他语言的标记,出于习惯,我一般都在字符串中加上它(C++ GUI Programming with Qt4中说的),但昨天我在进行网络编程的时候,不小心写漏了<em>tr</em>,搞到客户端完全显示不出信息(信息中只有英文字符),害我debug了一个多小时。rnrn所以,我想了解一下,<em>tr</em>()到底是用来干什么的,它的原理是什么呢?
log4j:ERROR Failed to rename
各位高手,遇到过这个问题吗?rn结果在我的目录里边生成不料新的日志文件,这个文件被不断的更新。在线等待...rnlog4j:ERROR Failed to rename [..\logger\counter] to [..\logger\counter.2004-01-05]rn
Uncaught (in promise) cancel 怎么解决
-
error = Error: Request failed with status code 402 at createError
vue 前后端分离,调用服务端接口,报402的错; 服务端要求客户端每次请求必须带上deviceId参数,没有携带的请求一律报登录异常的错。 
Error: Uncaught (in promise): 0
Angular中使用 boots<em>tr</em>ap的模态框<em>报错</em>:    Error: Uncaught (in promise): 0点击阴影层时候的方法得写上。 红色部分 this.modalService.open(this.loadNowModal).result.then((result) =&amp;gt; { this.loadNowErrorMsg = ''; ...
ionic Uncaught (in promise): Error: StaticInjectorError[NavController]
在服务(provider)中t引入NavCon<em>tr</em>oller时出现错误:Uncaught (in promise): Error: StaticInjectorError[NavCon<em>tr</em>oller] 默认情况下不能在con<em>tr</em>oller 或者service中使用navcon<em>tr</em>oller或者viewcon<em>tr</em>oller之类的。 其中代码: 一个比较容易解决的方法,
axios发送post请求返回400状态码
今天在用 axios 发送一个跨域的post请求时,遇到了一个坑:Uncaught (in promise) Error: Request <em>failed</em> with <em>status</em> <em>code</em> 400。 前台代码如下: axios({ method: &quot;post&quot;, url: &quot;http://localhost:8080/employee/testpost&quot;, data: {...
爬虫Status Code: 304解决方案
具体网页不公布了: 问题: 打印的结果: print(resp.<em>status</em>_<em>code</em>) print(111,resp.content.de<em>code</em>()) 304 111 这让我很诧异,因为我也是第一次遇见304,不知道如何下手,就百度谷歌搜索结果,看看有没有解决方法: 最后找到了一些304的原理文章 https://blog.csdn.net/soonfly/article/details...
FATAL ERROR - InitDetectCPU Failed
Debug Serial Ini<em>tr</em>nrnSysInit: GDTBase=8103d0e8 IDTBase=8105e860 KData=81065800rnWindows CE Kernel for i486 Built on Jun 24 2004 at 18:23:42rng_pPageDir = 81066000rn RTC - Status Reg B - 0x02rnX86Init done, OEMAddressTable = 80224ff8.rnOEMIoCon<em>tr</em>ol: Unsupported Code 0x101008c - device 0x0101 func 35rnOEMIoCon<em>tr</em>ol: Unsupported Code 0x10100d0 - device 0x0101 func 52rnOEMIoCon<em>tr</em>ol: Unsupported Code 0x10100f8 - device 0x0101 func 62rnAES_AES_Init: context Drivers\Active\09rn AES_AES_Init: returning 0x00000001rnDeviceFolder::LoadDevice!Enumerate Found deprecated load ins<em>tr</em>uctions at (Drivers\BuiltIn\AFD). Driver cannot be unloaded.rn DeviceFolder::LoadDevice!Enumerate Found deprecated load ins<em>tr</em>uctions at (Drivers\BuiltIn\PPP). Driver cannot be unloaded.rn PCIbus!PCIEnum: WARNING: Resource request for device 0:31:1 <em>failed</em>rnLX Graphics: FATAL ERROR - InitDetectCPU Failed => Cpu: 0 Chipset: 0rn Exception 00d Thread=83e63cf0 Proc=43e5d892 'gwes.exe'rnAKY=00000009 PC=03083c0b(ddi_agx.dll+0x00003c0b) ESP=080af440 EA=00000000rnException 00e Thread=83e63cf0 Proc=43e5d892 'gwes.exe'rnAKY=00000009 PC=0003cda0(gwes.exe+0x0002cda0) ESP=080afb64 EA=00000008rnrnrn如何解决这个问题,问题出在哪里呢??
opencv error assertion failed
[img=https://img-bbs.csdn.net/upload/201606/30/1467293007_433512.png][/img]rn该opencv工程做成exe时运行没有问题,但是做成动态库或者静态库调用时候就会出现这个问题,或者直接调用成功的exe也会出错,求大神指点指点
关于Qt jom Error2错误问题
安装了Qt5.5.1-vs2010,vs2010也装了。 所有项目在构建的时候出错:jom: ....Error2 查看了构建套件、编译器都没有问题,对项目执行qmake也没问题。 我怀疑问题是处在路
QT常见错误及解决方法
<em>error</em>: ‘header’ was not declared in this scope 在使用此变量之前没有对其进行定义。 <em>error</em> - RtlWerpReportException <em>failed</em> with <em>status</em> <em>code</em> :-1073741823 这个错误多半是因为一个变量定义好后还没有被初始化,在内存中还没有分配空间,就被拿来使用了。或者一些多线程里或者文件.h定义先后顺序的问...
解决vue工程报错Uncaught (in promise) Error: Request failed with status code 404
今天新加页面后首页查不到数据,<em>报错</em>Uncaught (in promise) Error: Request <em>failed</em> with <em>status</em> <em>code</em> 404 大概意思就是没有获取到后台传过来的数据,一开始以为是后台控制层的问题,找了半天 最后发现是在app/config/index.js里面配置没有配置proxy代理,请求没有从nodejs路由到tomcat 于是加上配置顺利找到数...
关于release版本串口的问题
我想问一下,就是在Qt中debug版的时候运行串口读写程序,可以读和写都可以,但在release版时读接收到的数据是成功的,但一运行到WriteFile()写数据时就出错了, Error - RtlW
org.springframework.boot.SpringApplication - Error handling failed
2018-04-20 13:17:04.603 [main] DEBUG org.springframework.beans.factory.support.DrnefaultListableBeanFactory - Creating shared instance of singleton bean 'org.sprirnngframework.<em>tr</em>ansaction.annotation.ProxyTransactionManagementConfiguration'rn2018-04-20 13:17:04.603 [main] DEBUG org.springframework.beans.factory.support.DrnefaultListableBeanFactory - Creating instance of bean 'org.springframework.<em>tr</em>ansrnaction.annotation.ProxyTransactionManagementConfiguration'rn2018-04-20 13:17:04.603 [main] DEBUG org.springframework.beans.factory.support.DrnefaultListableBeanFactory - Eagerly caching bean 'org.springframework.<em>tr</em>ansactiornn.annotation.ProxyTransactionManagementConfiguration' to allow for resolving po<em>tr</em>nential circular referencesrn2018-04-20 13:17:04.603 [main] DEBUG org.springframework.beans.factory.annotatiornn.InjectionMetadata - Processing injected element of bean 'org.springframework.<em>tr</em>nransaction.annotation.ProxyTransactionManagementConfiguration': AutowiredMethodErnlement for void org.springframework.<em>tr</em>ansaction.annotation.Abs<em>tr</em>actTransactionMarnnagementConfiguration.setConfigurers(java.util.Collection)rn2018-04-20 13:17:04.618 [main] ERROR org.springframework.boot.SpringApplicationrn- Error handling <em>failed</em>rnorg.springframework.beans.factory.BeanCreationException: Error creating bean wi<em>tr</em>nh name 'sqlSessionFactory-yxd' defined in class path resource [config/spring-mybrnatis.xml]: Cannot resolve reference to bean 'datasource-yxd' while setting beanrnproperty 'dataSource'; nested exception is org.springframework.beans.factory.BearnnCreationException: Error creating bean with name 'datasource-yxd' defined in clrnass path resource [config/spring-mybatis.xml]: Initialization of bean <em>failed</em>; nernsted exception is org.springframework.beans.factory.BeanCreationException: Errorrn creating bean with name 'org.springframework.<em>tr</em>ansaction.annotation.ProxyTransarnctionManagementConfiguration': Initialization of bean <em>failed</em>; nested exception irns org.springframework.beans.factory.NoSuchBeanDefinitionException: No bean namedrn 'org.springframework.context.annotation.ConfigurationClassPostProcessor.importRrnegis<em>tr</em>y' is definedrn at org.springframework.beans.factory.support.BeanDefinitionValueResolverrn.resolveReference(BeanDefinitionValueResolver.java:359)rn at org.springframework.beans.factory.support.BeanDefinitionValueResolverrn.resolveValueIfNecessary(BeanDefinitionValueResolver.java:108)rn at org.springframework.beans.factory.support.Abs<em>tr</em>actAutowireCapableBeanrnFactory.applyPropertyValues(Abs<em>tr</em>actAutowireCapableBeanFactory.java:1481)rn at org.springframework.beans.factory.support.Abs<em>tr</em>actAutowireCapableBeanrnFactory.populateBean(Abs<em>tr</em>actAutowireCapableBeanFactory.java:1226)rn at org.springframework.beans.factory.support.Abs<em>tr</em>actAutowireCapableBeanrnFactory.doCreateBean(Abs<em>tr</em>actAutowireCapableBeanFactory.java:543)rn at org.springframework.beans.factory.support.Abs<em>tr</em>actAutowireCapableBeanrnFactory.createBean(Abs<em>tr</em>actAutowireCapableBeanFactory.java:482)
ERROR - Context initialization failed
以下是我配置applicationContext.xml文件,启动服务时出现以下错误,请高手指教:rnERROR - Context initialization <em>failed</em>rnorg.springframework.beans.factory.BeanCreationException: Error creating bean with name 'dataSources' defined in ServletContext resource [/WEB-INF/classes/applicationContext.xml]: Error setting property values; nested exception is org.springframework.beans.PropertyBatchUpdateException; nested PropertyAccessExceptions (1) are:rnPropertyAccessException 1: org.springframework.beans.MethodInvocationException: Property 'driverClassName' threw exception; nested exception is org.springframework.jdbc.CannotGetJdbcConnectionException: Could not load JDBC driver class [com.microsoft.sqlserver.jdbc.SQLServerDriver]; nested exception is java.lang.ClassNotFoundException: com.microsoft.sqlserver.jdbc.SQLServerDriverrnCaused by: rnorg.springframework.beans.PropertyBatchUpdateException; nested PropertyAccessException details (1) are:rnPropertyAccessException 1:rnorg.springframework.beans.MethodInvocationException: Property 'driverClassName' threw exception; nested exception is org.springframework.jdbc.CannotGetJdbcConnectionException: Could not load JDBC driver class [com.microsoft.sqlserver.jdbc.SQLServerDriver]; nested exception is java.lang.ClassNotFoundException: com.microsoft.sqlserver.jdbc.SQLServerDriverrnCaused by: rnorg.springframework.jdbc.CannotGetJdbcConnectionException: Could not load JDBC driver class [com.microsoft.sqlserver.jdbc.SQLServerDriver]; nested exception is java.lang.ClassNotFoundException: com.microsoft.sqlserver.jdbc.SQLServerDriverrnCaused by: rnjava.lang.ClassNotFoundException: com.microsoft.sqlserver.jdbc.SQLServerDriverrn at org.apache.catalina.loader.WebappClassLoader.loadClass(WebappClassLoader.java:1438)rn at org.apache.catalina.loader.WebappClassLoader.loadClass(WebappClassLoader.java:1284)rn at java.lang.ClassLoader.loadClassInternal(ClassLoader.java:320)rn at java.lang.Class.forName0(Native Method)rn at java.lang.Class.forName(Class.java:247)rn at org.springframework.jdbc.datasource.DriverManagerDataSource.setDriverClassName(DriverManagerDataSource.java:146)rn at sun.reflect.NativeMethodAccessorImpl.invoke0(Native Method)rn at sun.reflect.NativeMethodAccessorImpl.invoke(NativeMethodAccessorImpl.java:39)rn at sun.reflect.DelegatingMethodAccessorImpl.invoke(DelegatingMethodAccessorImpl.java:25)rn at java.lang.reflect.Method.invoke(Method.java:597)rn at org.springframework.beans.BeanWrapperImpl.setPropertyValue(BeanWrapperImpl.java:821)rn at org.springframework.beans.BeanWrapperImpl.setPropertyValue(BeanWrapperImpl.java:645)rn at org.springframework.beans.Abs<em>tr</em>actPropertyAccessor.setPropertyValues(Abs<em>tr</em>actPropertyAccessor.java:78)rn at org.springframework.beans.Abs<em>tr</em>actPropertyAccessor.setPropertyValues(Abs<em>tr</em>actPropertyAccessor.java:59)rn at org.springframework.beans.factory.support.Abs<em>tr</em>actAutowireCapableBeanFactory.applyPropertyValues(Abs<em>tr</em>actAutowireCapableBeanFactory.java:1122)rn at org.springframework.beans.factory.support.Abs<em>tr</em>actAutowireCapableBeanFactory.populateBean(Abs<em>tr</em>actAutowireCapableBeanFactory.java:857)rn at org.springframework.beans.factory.support.Abs<em>tr</em>actAutowireCapableBeanFactory.createBean(Abs<em>tr</em>actAutowireCapableBeanFactory.java:423)rn at org.springframework.beans.factory.support.Abs<em>tr</em>actBeanFactory$1.getObject(Abs<em>tr</em>actBeanFactory.java:249)rn at org.springframework.beans.factory.support.DefaultSingletonBeanRegis<em>tr</em>y.getSingleton(DefaultSingletonBeanRegis<em>tr</em>y.java:155)rn at org.springframework.beans.factory.support.Abs<em>tr</em>actBeanFactory.getBean(Abs<em>tr</em>actBeanFactory.java:246)rn at org.springframework.beans.factory.support.Abs<em>tr</em>actBeanFactory.getBean(Abs<em>tr</em>actBeanFactory.java:160)rn at org.springframework.beans.factory.support.DefaultListableBeanFactory.preInstantiateSingletons(DefaultListableBeanFactory.java:291)rn at org.springframework.context.support.Abs<em>tr</em>actApplicationContext.refresh(Abs<em>tr</em>actApplicationContext.java:352)rn at org.springframework.web.s<em>tr</em>uts.ContextLoaderPlugIn.createWebApplicationContext(ContextLoaderPlugIn.java:354)rn at org.springframework.web.s<em>tr</em>uts.ContextLoaderPlugIn.initWebApplicationContext(ContextLoaderPlugIn.java:295)rn
【求助】AT91SAM9261 wince6.0 PING: transmit failed, error code 11010
我做的wince6.0系统,有个怪现象:rn之前还好好的,测试通过的系统,过了几天要用的时候,发现连不上网络,ping的时候<em>报错</em>:rnPING: <em>tr</em>ansmit <em>failed</em>, <em>error</em> <em>code</em> 11010rn我开始以为是baseboard的问题,结果换上别的核心板,网络没问题。rn所以应该是核心板的问题,结果重新烧内核就又好了。rn请高手指点会是什么问题。芯片用是DM9000AEP。rnrn还有类似的问题,之前一切都好的,结果突然我的应用程序自动启动不了。我点击运行也不行。重新烧一下也好了。rnrn还有:偶尔系统会崩溃掉,启动不起来;还有一次,报servicesd.exe出严重错误。rnrn这些是不是都是我的内核的问题?是不是hive文件系统有问题?rn不知道从哪里下手找原因,解决问题。rnrn谢谢。
HTTP Status 500 报错
昨天从书上抄了个JSP文件,昨天调试还没有问题。今天就一直报这个错误。。。查了下把 el-ri.jar jsp-api.jarrn拷过来也不管用。。。我用的是JDK1.6和TOMCAT6.。。。。rn root cause rnjava.lang.NoClassDefFoundError: javax/el/ELResolverrn java.lang.ClassLoader.defineClass1(Native Method)rn java.lang.ClassLoader.defineClass(ClassLoader.java:621)rn java.security.SecureClassLoader.defineClass(SecureClassLoader.java:124)rn java.net.URLClassLoader.defineClass(URLClassLoader.java:260)rn java.net.URLClassLoader.access$000(URLClassLoader.java:56)rn java.net.URLClassLoader$1.run(URLClassLoader.java:195)rn java.security.AccessCon<em>tr</em>oller.doPrivileged(Native Method)rn java.net.URLClassLoader.findClass(URLClassLoader.java:188)rn sun.misc.Launcher$ExtClassLoader.findClass(Launcher.java:229)rn java.lang.ClassLoader.loadClass(ClassLoader.java:307)rn java.lang.ClassLoader.loadClass(ClassLoader.java:300)rn sun.misc.Launcher$AppClassLoader.loadClass(Launcher.java:301)rn java.lang.ClassLoader.loadClass(ClassLoader.java:300)rn java.lang.ClassLoader.loadClass(ClassLoader.java:252)rn java.lang.ClassLoader.loadClassInternal(ClassLoader.java:320)rn org.apache.jasper.runtime.JspFactoryImpl.getJspApplicationContext(JspFactoryImpl.java:200)rn org.apache.jsp.login_jsp._jspInit(login_jsp.java:22)rn org.apache.jasper.runtime.HttpJspBase.init(HttpJspBase.java:52)rn org.apache.jasper.servlet.JspServletWrapper.getServlet(JspServletWrapper.java:159)rn org.apache.jasper.servlet.JspServletWrapper.service(JspServletWrapper.java:329)rn org.apache.jasper.servlet.JspServlet.serviceJspFile(JspServlet.java:342)rn org.apache.jasper.servlet.JspServlet.service(JspServlet.java:267)rn javax.servlet.http.HttpServlet.service(HttpServlet.java:717)rnrn即使我把一个最简单的htm文件,改成JSP文件,也是报这个错误。rnrnrnrnrn
IWEB_GetResponse返回status code:400?
以前没怎么做过网络相关,大家都帮忙看看rnrn向某网站进行POST数据,但需要进行认证,相关代码如下,返回的HTTP STATUS CODE为400,rn查了下RFC1945,貌似entity body和Content-Length的设定有问题的话,会返回400rn但是觉得看上去也没有什么问题。。。rnrn摘自RFC1945rn-----rnIf a requestcontains an entity body and Content-Length is not specified, rnand the server does not recognize or cannot calculate the length rnfrom other fields, then the server should send a 400 (bad request) responsern-----rnrnsample <em>code</em>rn------------rn//POST用IPEEK作成rnISOURCEUTIL_PeekFromMemory(pSourceUtil, pBuff, s<em>tr</em>len(pBuff), ..., &pIPeek);rnrn//HTTP "POST"rnIWEB_GetResponse(pIWeb,(...,"www.xxx.com"rn WEBOPT_METHOD, "POST",rn WEBOPT_HEADER, "Authorization: Basic QWxhZGRpbjtZQ==", //authenticationrn WEBOPT_BODY, pIPeek, //set message to IPeekrn WEBOPT_CONTENTLENGTH, s<em>tr</em>len(pBuff), //length of messagern ...))rn------------rnrn难道说WEBOPT_CONTENTLENGTH的值不能用s<em>tr</em>len(pBuff)?关于WEBOPT_CONTENTLENGTH
windows通过java-sdk调用远程虚拟机上的链码错误,交易失败
-
failed with error code 1">Command "python setup.py egg_info" failed with error code 1
wsgiref ,setuptools 更新 都报这个错误,求救.rnrn[<em>code</em>=python]Collecting wsgirefrn Using cached wsgiref-0.1.2.ziprn Complete output from command python setup.py egg_info:rn Traceback (most recent call last):rn File "", line 1, in rn File "C:\Users\ADMINI~1\AppData\Local\Temp\pip-build-frt4b8tj\wsgiref\seturnp.py", line 5, in rn import ez_setuprn File "C:\Users\ADMINI~1\AppData\Local\Temp\pip-build-frt4b8tj\wsgiref\ez_srnetup\__init__.py", line 170rn print "Setuptools version",version,"or greater has been installed."rn ^rn SyntaxError: Missing parentheses in call to 'print'rnrn ----------------------------------------rnCommand "python setup.py egg_info" <em>failed</em> with <em>error</em> <em>code</em> 1 in C:\Users\ADMINI~1rn\AppData\Local\Temp\pip-build-frt4b8tj\wsgiref\rn[/<em>code</em>]rn
请问这是什么错误啊??The compiler failed with error code 128.
The compiler <em>failed</em> with <em>error</em> <em>code</em> 128.rnrn我的工程本来好好的,不知道为什么今天就出了这个问题,它也不是每个页面都出这个错,只有几个页面出错,其他的页面好好的,然后我又重新编译上传,发现好笑的是以前出错的页面好了,以前好的页面又出这种错误,请问有方法解决吗?rnrnrn
transmit failed,error code 65.....在线等待,十万火急!!!!
各位同仁,我的电脑通过局域网接入internet,今天发现无法上网,ping 127.0.0.1能通,但ping 该机的ip地址结果显示<em>tr</em>ansmit <em>failed</em>,<em>error</em> <em>code</em> 65错误,重新启动后进入带网络连接的安全模式,上网,ping等网络功能一切正常,谁知道,到底是什么问题??rn我已经将网络防火墙卸载了,还是出现同样的问题.
System.Data.OleDb.OleDbException: 'SQLOLEDB' failed with no error message available, result code: E_OUTOFMEMORY(0x8007000E)
数据库和应用服务器都放于同一台服务器,当进行频繁的插入、修改、查询时就会出现如下错误:rnSystem.Data.OleDb.OleDbException: 'SQLOLEDB' <em>failed</em> with no <em>error</em> message available, result <em>code</em>: E_OUTOFMEMORY(0x8007000E) rn每当一出现这个错误,重启IIS后可以正常使用半个小时左右又开始发作。rn谢谢~~~~~
CE 5.0 ping: transmit failed, error code 11010
使用的静态Ip. 可以ping "google.com"等外网.所以网络应该是好的,DNS也是好的. 但是局域网不行,错误信息:rnrnping: <em>tr</em>ansmit <em>failed</em>, <em>error</em> <em>code</em> 11010.rnrn用监控软件看网络传输数据:rnrn31 14:36:37 2013/1/22 7.6310813 192.168.0.171 192.168.0.170 ICMP ICMP:Echo Request Message, From 192.168.0.171 To 192.168.0.170 IPv4:9rn34 14:36:37 2013/1/22 7.6316752 192.168.0.170 192.168.0.171 ICMP ICMP:Echo Reply Message, From 192.168.0.170 To 192.168.0.171 IPv4:9rn52 14:36:39 2013/1/22 8.9771624 192.168.0.171 192.168.0.170 ICMP ICMP:Echo Request Message, From 192.168.0.171 To 192.168.0.170 IPv4:9rn53 14:36:39 2013/1/22 8.9773987 192.168.0.170 192.168.0.171 ICMP ICMP:Echo Reply Message, From 192.168.0.170 To 192.168.0.171 IPv4:9rnrn有响应。其中rn192.168.0.170 是PC. 192.168.0.171 是 CE 5.0设备.rn用hub连接的。
ping命令返回“PING: transmit failed, error code 1450”是什么原因?
机器硬件如下:型号是HP ML350 rnCPU Xeon 3.2G rn硬盘36.4G SCSI *2rn内存512M ECCrn显卡ATI Ragern两块网卡分别是HP NC7761/NC 7771千兆rnrn软件环境是:Windows2000 Server+SP4,并上公网打了所有系统补丁,安装Mcafee10杀毒软件。rnrn系统日志中有如下一些<em>报错</em>内容:rn“服务器无法通过系统非页面共享区来进行分配,因为共享区当前是空的。”rn“awhost32.exe 拒绝了暂停能源的请求”rn请问,为什么会出现ping命令返回“PING: <em>tr</em>ansmit <em>failed</em>, <em>error</em> <em>code</em> 1450”?是什么原因?有什么解决方法?rnrn
ping的提示:transmit failed error code 1314.这是什么意思?
如题,我同学的电脑ping别人的电脑时的提示,我上网找了,就是找不到rn诸位麻烦了!
傅立叶变换的基础知识下载
傅立叶变换是通信相关专业必须掌握的内容,也是硬件设备开发中绕不过去的技术门槛。打牢这方面的基础很有必要。 相关下载链接:[url=//download.csdn.net/download/anta2222/4061996?utm_source=bbsseo]//download.csdn.net/download/anta2222/4061996?utm_source=bbsseo[/url]
sqlite数据库可视化编辑器(不用注册)下载
sqlite数据库可视化编辑器(不用注册),方便携带,使用简单,无需注册 相关下载链接:[url=//download.csdn.net/download/lilei6691/4389001?utm_source=bbsseo]//download.csdn.net/download/lilei6691/4389001?utm_source=bbsseo[/url]
黑色广告公司全站代码下载
黑色广告公司全站代码ASP代码 非常棒的 非常漂亮 非常大气! 下这个没有错! 相关下载链接:[url=//download.csdn.net/download/qq70898/4985951?utm_source=bbsseo]//download.csdn.net/download/qq70898/4985951?utm_source=bbsseo[/url]
我们是很有底线的