用CMake配置项目出错,求指导 [问题点数:200分,无满意结帖,结帖人u012948520]

Bbs5
本版专家分:3567
结帖率 98.88%
Bbs1
本版专家分:5
ubuntu cmake 报找不到CMAKE_CXX_COMPILER 的错误
错误如下 <em>CMake</em> Error in <em>CMake</em>Lists.txt: No CMAKE_CXX_COMPILER could be found. Tell <em>CMake</em> where to find the compiler by setting either the environment variable &quot;CXX&quot; or the <em>CMake</em> cache entry CMA...
NDK开发 从入门到放弃(七:Android Studio 2.2 CMAKE 高效NDK开发)
前言之前,每次需要边写C++代码的时候,我的内心都是拒绝的。 1. 它没有代码提示!!!这意味着我们必须自己手动敲出所有的代码,对于一个新手来说,要一个字母都不错且大小写也要正确,甚至要记得住所有的jni函数等,真是太折磨人了…平时写java代码的时候都是写几个字母会出来一大堆提示然后选择的,这样还有一个好处就是很多时候我们不知道有那些函数,但是我们可以通过obj.,然后就可以看到它有哪些方法函数
CMake error 合集(Configuring incomplete errors occurred!)
其实,每次碰到要安装一些软件啊,通常软件的源码都是c/c++,刚开始LZ不理解,从来都是跟着Readme.txt,一步步安装,如果说一帆风顺的把软件安装好了,也就罢了,很可能不会深究到底cmake . cmake .. make all make -j4 make install上述列出来的到底是什么含义,直接机械式地先安装依赖库,经常用的也就是:sudo apt-get install #bal
在Python27中运行pip install dlib装载库dlib所引起的问题解决
看人脸方面的资料的时候,会发现很多人都会提到dlib这个库,于是就安装尝试下这个库看看它到底有多么的神奇。今天只是初次尝试一下dlib到底怎么用。 可是在安装这个库的时候遇到一堆问题:最初是没有Cmake编译器,这个好解决,cmake都是自动安装<em>配置</em>的。最大的问题如下所出现的,没有发现boost库:   -- Could NOT find Boost 于是乎,编译Boost库成了首要问题。
cmake+CMakeLists的学习
一、我们想来看一个最简单的例子:1.新建一个src文件夹,在src文件夹下新建一个main.cpp以及一个<em>CMake</em>Lists.txt,然后分别添加如下内容:main.cpp#include &amp;lt;QtCore/QCoreApplication&amp;gt; #include &amp;lt;QtCore/QDebug&amp;gt; int main(int argc, char** argv) { QCo...
VS2015+Cmake安装OpenPose库遇到:error MSB3073: 命令“setlocal.... "
解决方法:以管理员身份运行Vs即可。应该是因为在Cmake GUI中CMAKE_INSTALL_PREFIX指定为C盘目录,install编译生成时需要权限。 另一问题:Cmake GUI的源码及二进制生成路径设置 另外在使用Cmake GUI生成Vs2015的解决方案过程中,对于源码目录和目标二进制的目录应设置为如下方式: 而不应该: 因为这个简单<em>配置</em>问题,程序运行时相关的相...
CMake编译Opencv出现问题:error configuration process, project files may be invalid
<em>CMake</em>编译Opencv出现问题:error configuration process, project files may be invalid1.问题描述在进行Opencv3.2.0+opencv_contrib+VS2015的<em>配置</em>时,在使用Cmake进行编译过程中出现报错,截图如下:2.问题原因出现该问题的原因大多数是因为Opencv与opencv_contrib的版本不匹配,所以出现这...
cmake+vs
cmake+vs是完美组合 转载于:https://www.cnblogs.com/hustdc/p/10143664.html
Cmake : Error in configuration process ,project files may be invalid
Cmake出现以下错误,说明你的文件路径有问题,检查自己的文件路径。
android studio 使用CMAKE
原文地址 前言 之前,每次需要边写C++代码的时候,我的内心都是拒绝的。  1. 它没有代码提示!!!这意味着我们必须自己手动敲出所有的代码,对于一个新手来说,要一个字母都不错且大小写也要正确,甚至要记得住所有的jni函数等,真是太折磨人了…平时写Java代码的时候都是写几个字母会出来一大堆提示然后选择的,这样还有一个好处就是很多时候我们不知道有那些函数,但是我们可以通过obj.
解决办法:CMake编译时出现“error in configuration process project files may be invalid”
无论是<em>CMake</em>2.84 还是当前最新的<em>CMake</em>2.87都可能会出现这种错:   查遍国内外的网上都没有给出可行办法,结果还是自己解决了 现把<em>出错</em>原因和解决办法如下: <em>出错</em>原因:因是英文版本,通常安装没有看说明,按默认的安装而"下一步"再下一步,结果是在安装中要选择你所使用的编程系统的,如:Vs2008,vs2010等,如果当前安装的默认值不是你当前用的版本就且在使用时不注意
安装Android studio时配置CMAKE出错 解决方案CMake Error: CMAKE_C_COMPILER not set, after EnableLanguage
错误信息如下: 解决方案一: 在build.gradle文件中添加ndk块如下: 解决方案二: 升级你的ndk版本到最新 然后在build.gradle文件中添加如下代码块: ...
Mac配置Opencv时出现cmake错误
在<em>配置</em>mac的opencv环境时可以采用以下步骤摘自(http://www.cnblogs.com/repeae/p/3348777.html): 一、编译OpenCV 要在Mac OS上使用OpenCV,需要自己编译源代码。操作过程如下: 1)从http://www.cmake.org下载cmake 2.8安装包。 2)安装cmake 2.8。 3)从http://opencv.org
Cmake编译工程时出错
1:include_directories given empty-string as include directory. cmake语句:include_directories("${GENERA
Cmake + VS2013编译opencv
下载之后,使用cmake转为vs解决方案的时候,<em>配置</em>OPENCV_EXTRA_MODULES_PATH=&lt;path to opencv_contrib/modules/&gt;,然后才能使用extra的模块 转载于:https://www.cnblogs.com/Martianhh/p/7737211.html...
编译ROS包出现错误 提示:invoking "make cmake_check_build_system" failed
问题原因:不同包里不允许有重名的节点解决方案:编辑重复的package文件夹里的<em>CMake</em>Lists.txt文件,对涉及到节点名称的代码进行修改调试过程:逐行分析问题代码,问题的BUG基本都能找到原因,记住一定要从第一个ERROR开始修复,有时候出现了一堆BUG,其实都是第一个BUG引起的贴上问题代码:-- Using CATKIN_DEVEL_PREFIX: /home/jier/dev/cat...
CMake 编译 ‘‘error in configuration process project files may be invalid”
<em>出错</em>时提示如下: No CMAKE_C_COMPILER could be found No CMAKE_CXX_COMPILER could be found 出现这个问题是因为我使用的VS 2013的安装路径含中文。卸载VS2013重新安装时路径不要选择中文就可以解决这个问题。...
OS + CentOS cmake
s Linux编译安装cmake最新版本 https://blog.51cto.com/sadoc/1910753 https://cmake.org/download/ https://github.com/Kitware/<em>CMake</em>/releases/download/v3.14.3/cmake-3.14.3.tar.gz yum安装的版本过于低,一般都是2.8版本.需要安装gccg...
No CMAKE_CXX_COMPILER could be found.
简介用cmake生成编译工程时候报这样的错误,原因是<em>配置</em>错误导致cmake找不到对应的编译器解决方法 “File”-“delete Cache” 删除缓存后重新<em>配置</em> <em>配置</em>编译器,选择本机已经安装的编译器,cmake会自动检查,出现configuring done说明<em>配置</em>成功 -点击”generate“ 生成工程文件
CMake 语法 - 详解 CMakeLists.txt
关于 《Android 开发者需要知道的 Linux 知识》与 《从 Linux 内核的角度来看 Binder 驱动》两篇文章被锁定,官方申诉也未给予回复,大家可以看这里: https://blog.csdn.net/z240336124/article/details/89451641 https://blog.csdn.net/z240336124/article/details/901373...
Cmake安装时出现的问题
<em>CMake</em> Error at 3rdparty/ippicv/downloader.cmake:69 (file): file problem creating directory: C:/Progr
clion配置的错误原因?
-
Cmake 配置问题
出现以下问题: 之前一直是报undefined reference to __print_Log 打印log的类找不到。因为Cmake<em>配置</em>错误,不知道之前的错误是什么样子了。 最终的<em>配置</em>在后面。Error:FAILURE: Build failed with an exception.* What went wrong: Execution failed for task ':app:exter
cmake常见错误
错误: D:\Program_Filesx86\Microsoft Visual Studio 14.0\VC\INCLUDE\cmath(17): error C2061: syntax error: identifier 'noexcept' D:\Program_Filesx86\Microsoft Visual Studio 14.0\VC\INCLUDE\cmath(17): er...
cmake 运行时出现问题解决办法
2019独角兽企业重金招聘Python工程师标准&gt;&gt;&gt; ...
将cmake设置为cmd中的命令
安装好cmake之后将cmake.exe所在路径添加到环境变量,即可在cmd中实现cmake命令!
CMake错误No CMAKE_CXX_COMPILER could be found.
No CMAKE_CXX_COMPILER could be found
visual studio2010问题导致CMake执行例子时出错Error in configuration process,project files may be invalid
Error in configuration process,project files may be invalid >LINK : fatal error LNK1123: failure during conversion to COFF: file invalid or corrupt
CMake编译Qt项目遇到的问题
在github 上下载了一个名为robomongo的<em>项目</em>源码,提示使用cmake编译工程。 根目录如下 cmake目录: 用cmake编译,提示错误,找不到FindQt5Core.cmake. 错误提
clion编辑器设置,使用,方便打代码for acmer操作
问题:1.有哪些clion社区、<em>求</em>助渠道help没:这是https://www.jetbrains.com/help/clion/2017.1/meet-clion.html?utm_medium=h
configure_file路径疑惑
configure_file(&amp;lt;input&amp;gt; &amp;lt;output&amp;gt; [COPYONLY] [ESCAPE_QUOTES] [@ONLY] [NEWLINE_STYLE [UNIX|DOS|WIN32|LF|CRLF] ]) 我遇到的是 configure_file(config/config.in ${CMAK...
cmake出错显示编译器不支持c++11,怎么办?
-
OpenCV3.2 Cmake生成 VS2015工程文件时出现问题解决方式
最近开始学习Opencv,在用cmake<em>配置</em>opencv时出现了很多的问题,每次报错都如下图,查了很多资料,看了很多博客,最后所有的原因都是因为文件下载失败,在下方红色字体处找到下载失败的文件,和应该要存放的路径(当时忘记截图了,红色字体报错处找),手动下载放入正确路径,再次点击configure,最终configure done,没有红色字体出现就可以点击generate,即可生成成功,下方附我
cmake报Modules directory not found in错误解决方案
问题 最近编译一个新<em>项目</em>,要<em>求</em>cmake版本大于VERSION 3.5.1 本机是VERSION 2.8.12, 于是直接到cmake官网下载最新版本: https://cmake.org/download/ 编译完直接把cp 1bin/cmake /usr/bin/覆盖原来的cmake版本, 但,悲剧发生了,运行直接报错错误: [root@GD-DEV scripts]# ...
Cmake--Error in configuration process, project files maybe invalid
之前用Cmake在电脑上编译过OpenCV的源码, 好久不用了,今天又用Cmake来编译一个开源的程序, 结果显示:Error in configuration process, project files maybe invalid。 固执的认为不可能是系统的问题,但是试了很多次,也查找了很多自己以前<em>配置</em>的方法, 结果还是以失败告终。最后还是得查看错误提示: 查看错误内容提示为:LI
cmake配置OpenCV时出错怎么解决?
Selecting Windows SDK version 10.0.15063.0 to target Windows 10.0.17134. The CXX compiler identifica
CMake Error at CMakeLists.txt:5 (PROJECT): The CMAKE_C_COMPILER: cl is not a full path
报错: - Building for: NMake Makefiles -- The C compiler identification is unknown -- The CXX compiler identification is unknown <em>CMake</em> Error at <em>CMake</em>Lists.txt:5 (PROJECT): The CMAKE_C_COMPILER: c...
clion配置 cmake时出错 使用cygwin
如图报错为 C:\Users\瀛欎紵娴‐.CLion2017.2\system\cygwin_cmake\bin\cmake.exe -DCMAKE_BUILD_TYPE=Debug -G "Cod
Cmake使用中常见问题及其解决方法
Cmake使用总结 Cmake中常见问题:## 标题 ## 1. 下载问题。经常需要从国外下载第三方包,由于网络问题可能会下载失败!建议开启VPN进行下载,或者从其他下载源下载后进行手动解压并放到指定路径下。 2. 路径问题。Cmake中往往需要填写路径,但是许多人填写的路径极其不规范,比如路径“C:\Program Files (x86)\新建文件夹 (2)”,这个路径会有三个问题:第
Cmake Error遇到的问题及解决
qt_build 在网上看了好多解决办法,好多说添加路径的,但是都没有解决我的问题,看到有教程说在src路径下 catkin_create_qt_pkg testgui,也报错了, 需要先install, $ sudo apt-get install ros-indigo-qt-ros 之后没有qt_build那个报错了,但有了新的报错,见2 之前的报错如下: <em>CMake</em> Error at /...
新手-常见问题-解-Error configuring application listener of class ...
Myeclipse<em>项目</em>,部署正常,tomcat启动报错: 1、 8:54:23 下午 org.apache.catalina.core.StandardContext listenerStart 严重
CMake编译时报错 is not full path什么的
根本没windows-86_64这个目录 只有windows目录 所以查看ndk目录里的ndk-bundle\build\cmake里的android.toolchain.cmake文件中的windows-x86_64的字眼,改为windows即可
cmake报错No CMAKE_C_COMPILER could be found该怎么解决?
-
Unknown CMake command "ocv_define_module"
在编译新版的OpenCV 4.0的opencv_contrib时候,到编译那一步,忽然间遇到问题 <em>CMake</em>的命令行<em>出错</em>,应该不是我的问题,上网查了很多帖子,最后发现是最开始在github上下载opencv_contrib的时候,选错了版本,记得2016年的时候,编译OpenCV3.0的opencv_contrib的时候并没有这一步操作,现在需要勾选版本 问题解决 ...
ERROR: Error occurred while communicating with CMake server.
  遇到此错误的原因是cmake服务器协议版本不匹配; 解决方案:   1:直接更新android studio看能否解决;   2:如果解决不了,那么将androidstudio,ndk ,cmake,gradle全部更换为最新的,在根目录的gradle.build中更换gradle版本号;如果还报错提升根目录下的gradle版本号; buildscript { ....
Cmake 编译配置失败
<em>配置</em>选项 选择的  VS 12 2013 The C compiler identification is MSVC 18.0.21005.1 The CXX compiler identification is MSVC 18.0.21005.1 Check for working C compiler: C:/Program Files (x8
android studio 用cmake编译报错
android studio错误信息: Build command failed. Error while executing process D:\Cpanfile\androidStudioSDK\cmake\3.6.4111459\bin\cmake.exe with arguments {-HF:\AndroidWorkSpace\**********\jni -BF:\Android...
cmake配置opencv的时候出现的错误及解决方法
cmake <em>配置</em>opencv的时候出现的错误: -- Detected version of GNU GCC: 54 (504) -- Found ZLIB: /usr/lib/i386-linux-gnu/libz.so (found suitable version &amp;quot;1.2.8&amp;quot;, minimum required is &amp;quot;1.2.3&amp;quot;) -- Could NOT find TIFF (m...
Cmake最怕见到的错误,Configuring incomplete errors occurred!
安装gnuraido ,开源软件无线电的开发环境,按照手册上一步一步的装,装到gnuradio时,cmake总是报错,”Configuring incomplete errors occurred!“下面是让我看两个文件 ,我对linux基本就是新手状态,最怕这个,上次也出过这个问题,好像重做了个系统稀里糊涂好了,这次可不能再这样了,一个前辈说过一句话,该摔的跟头一个也不能少,我不能让它摔两回。我...
AndroidStudio编译出现 CMake Error: CMake was unable to find a build program corresponding to \"Ninja\"...
2019独角兽企业重金招聘Python工程师标准&gt;&gt;&gt; ...
Android studio 同步工程失败:External Native Build Issues: Error configuring
  android studio 创建工程,勾选include c++ support,工程创建后,目录如下: 但gradle同步工程失败,提示 External Native Build Issues: Error configuring。 (在app目录下的build.gradle里去掉: externalNativeBuild { cmake { pat...
用cmake编译Qt项目,报出错误,解决??
今天在网上下载个开源<em>项目</em>,然后在linux环境下用cmake编译,报出以下错误: QtCore could not be found there. Qt is NOT installed correc
ubuntu 16.04 安装 openCV 3.2 --对该问题的处理CMake Error at cmake/OpenCVModule.cmake:295 (message)
第一次在CSND上写文章,针对的即是openCV安装过程中的Error。 自己在安装openCV的过程中出现了cmake:295这个错误,但是,看了CSND上很多很多的安装openCV的文章,安装过程都很类似,就是没有提到出现这个问题该怎么解决! 而且别人的安装过程就是那么顺利?怎么可能呢?ubuntu安装过程一般都不顺利...... 下面这三篇文章给了我很大的帮助,真的特别感谢!也感谢CS...
【mysql报错】安装时--编译前配置参数时报错Configuring incomplete, errors occurred!CMakeOutput.log 和 CMakeError.log
-- Configuring incomplete, errors occurred!See also &quot;/usr/local/src/mysql-5.5.33/<em>CMake</em>Files/<em>CMake</em>Output.log&quot;.See also &quot;/usr/local/src/mysql-5.5.33/<em>CMake</em>Files/<em>CMake</em>Error.log&quot;.解决方法:个人感觉比较诡异,在网上查了片刻,有的是需...
win10 64位+python安装dlib
系统:win10 64位 python 64位 安装dlib时出现以下情况: Collecting dlib Using cached dlib-19.4.0.tar.gz Building whee
CMake入门使用(一)安装及HelloWorld的构建
<em>CMake</em>安装及helloworld工程
CMake出现问题(在安装opencv时)
我按照http://blog.csdn.net/msq19895070/article/details/24477575 这篇博客进行交叉编译opencv,前边安装各种依赖库的时候都没有问题,就是在进
cmake错误的解决
cmake build时出现错误:van@ubuntu:~/workspace$ cmake -DCMAKE_INSTALL_PREFIX=/usr .. Inconsistency detected by ld.so: dl-version.c: 224:_dl_check_map_versions: Assertion `needed != ((void *)0)' failed! 逛遍stac
vs2015用cmake编译opencv问题总结
直接用cmake点击configure会出现以下错误: The CXX compiler identification is unknown The C compiler identification is unknown <em>CMake</em> Error at <em>CMake</em>Lists.txt:93 (project): No CMAKE_CXX_COMPILER could be found.
opencv3.3 build on centos
#!/usr/bin/env bash       # #   # # Install main dependencies on CentOS:   # # Python 3.4.5, <em>CMake</em> 3.10.0, OpenCV 3.3.1   # # Author Andrii Lundiak
Qt+cmake编译并配置OpenCV问题
Qt+cmake编译并<em>配置</em>OpenCV错误记录 每次一到30%~40%左右就显示下面错误 F:/Qt5.12/Tools/mingw730_64/bin/…/lib/gcc/x86_64-w64-mingw32/7.3.0/…/…/…/…/x86_64-w64-mingw32/bin/ld.exe: i386 architecture of input file `<em>CMake</em>Files\openc...
[PandoraBox SDK]交叉编译libpcap提示configure: error: C compiler cannot create executables错误
./configure --host=mipsel-openwrt-linux --with-pcap=linux checking build system type... x86_64-unknown-linux-gnu checking host system type... mipsel-openwrt-linux-gnu checking target system type... mipsel-openw
cmake + VS2013 + OpenCV3.0配置, 第一步configure错误,急!
顽疾!望有经验的朋友给予指点。 cmake使用最新的3.9.0有问题,后又试过3.8.2和3.2.0,出现相同错误。话不多说直接上图 errorlog错误信息如下: Compiling the CXX
cmake编译问题解决
2 安装cmake软件包 yum install cmake 3 create account of mysql groupadd mysql            useradd -g mysql mysql            autoreconf --force --install libtoolize --automake --force automake --forc
Android Studi3.1.4利用cmake搭建jni-Configure Error
Cause: executing external native build for cmake E:\AndroidProject\AndroidTest2\app\<em>CMake</em>Lists.txt 一直出现configure Error 然后 反复 rebuild project,终于有反应了 <em>CMake</em> Error: <em>CMake</em> was unable to find a build prog...
CMake error: error in configuration process, project files may be invalid
很奇怪按照别人的安装步骤,竟然出现了问题,(好吧,其实我在安装的过程中,我在打字,不知道,按错按钮没) 可以查看Cmake 中具体的错误: 是说找不到boost的路径,当时我就重新安装了一下,用的是【1】boostpro,结果还是产生错误,后来查看了一下要编译程序的<em>CMake</em>List.txt文件找不到这个BOOST_ROOT的定义,不知道这个定义是不是应该在安装boost的过程
android studio 使用cmake支持C++出现无法sync cmake error的问题
问题错误信息External Native Build Issues Build command failed. Error while executing '/root/Android/Sdk/cmake/3.6.3155560/bin/cmake' with arguments {-H/root/AndroidStudioProjects/AccessQRat/app -B/root/Andro
no cmake c_compiler could be found问题解决方法
运行cmake,cmd后缀的文件的时候,只要用到c_compiler一定会提示找不到。 网上所有的的方法都试过,均失败。 原来问题出在中文名称上,我原来把VS2015的路径放在D盘的新建文件夹下,我把VS2015卸载后(这里也有问题,2015卸载不干净,第二次装的时候默认地址改不了。 参考https://tieba.baidu.com/p/3954135214:事先下载好vs2015的ISO
"No CMAKE_C_COMPILER could be found,链接错误,找不到ucrtd.lib”问题,VS2017
参考:Problems generating solution for VS 2017 with <em>CMake</em> (https://stackoverflow.com/questions/42701019/problems-generating-solution-for-vs-2017-with-cmake) 问题:用cmake编译时,显示No CMAKE_C_COMPLIER could be...
No CMAKE_C_COMPILER could be found 几种原因及解决办法
在使用<em>CMake</em>-gui将cmake文件生成visual studio <em>项目</em>文件时,出现了以下错误:No CMAKE_C_COMPILER could be found原因是<em>CMake</em>没有找到对应的编译器。网上查到的部分原因加上我自己遇到的问题有:1.Visual Studio 的安装路径里含有中文路径。因为<em>CMake</em>无法识别中文路径,解决该问题就是重新安装Visual Studio,注意安装在非...
使用cmake重新编译opencv配置出错
因为要使用CUDA+opencv 在使用cmake3.4.3以及最新版编译opencv的时候<em>配置</em>总<em>出错</em> 错误提醒一直是 <em>CMake</em> Error at <em>CMake</em>Lists.txt:93 (projec
visual studio 2012 下配置OPENcv3.1 和CMAKE问题总结
visual studio 2012 下<em>配置</em>OPENcv3.1 和CMAKE问题总结
cmake编译错误,将警告视为错误的解决方法
原博客地址:https://blog.csdn.net/maxsky/article/details/50849219解释一下途中框起来的部分,第一个框其实就是失败的关键,解决方法很简单既然他提示了“警告被视为错误”,那么在 VS 里确有这一个设置项的,关掉就好(针对 VS 工程<em>项目</em>)当然这里因为我们用的是命令行编译,在 VS 里可没法设置,我们只需要在 Makefile 里改一下编译参数即可再来...
opencv配置时cmake失败
cmake时出现 -- Detected version of GNU GCC: 54 (504) -- Found ZLIB: /usr/lib/i386-linux-gnu/libz.so (found suitable version "1.2.8", minimum required is "1.2.3") -- Could NOT find TIFF (missing: TIFF_
用anaconda安装dlib库(python—opencv)
安装dlib库真是一步三跪啊。。。   网上有各种帖子,各种方法,试过好几种,终于安装成功了。后文有对不同方法的使用报告。   笔记本:win7 32位,之间装过annaconda,通过annaconda装了python2.7安装visual studio2010  后面安装boost库需要vs来编译,并且指定vs只能用2014年之前的版本,13的也不行。vs2010可以去 http://ww
cmake编译出现error in configuration process,project files may be invalid
转自http://blog.csdn.net/sduvec/article/details/50084963 在编译opencv3.0时遇到问题,如题。 通过重新下载并替换ippicv_windows_20141027.zip解决。 下载该文件后,将其拷贝到。。\Opencv3.0\OpenCV\sources\3rdparty\ippicv\downloads\windows-
Android Studio 构建C++工程编译无法通过,好像是CMakeList.text的问题,有谁遇到过么
错误日志 External Native Build Issues Build command failed. Error while executing 'D:\sdk\cmake\3.6.3155
新手使用,应该很简单,有经验的朋友麻烦指点一下。
我编译OpenBLAS时出现的问题。 按照这个说明一步一步的操作。 https://github.com/xianyi/OpenBLAS/wiki/How-to-use-OpenBLAS-in-Mic
Linux下编译安装WizNote
下载WizNote的源代码 创建目录 安装git工具 下载源代码 Linux下编译为知云笔记 安装QT 安装cmake 安装zlib 编译源代码 常见错误 No CMAKE_CXX_COMPILER could be found 常见错误Failed to find GLglh in usrincludelibdrm 常见错误Failed to find GLglh 常见错误QLocalSocket
[亲身体验]从此windows编译caffe不再陌生 (win10 + Anaconda python3.5 + cuda 8.0)
Topic---Windows 10 上装caffe(确切说是借助VS和cmake编译出python中可以import的caffe包)   背景介绍 https://github.com/BVLC/caffe/tree/windows 首先按照所说预装了VS2015,cmake和cuda8.0。 但是我在安装VS2015的时候忘记安装Visual C++,这导致了第一步的问题; 默认使...
cmake 学习笔记(一)
最大的Qt4程序群(KDE4)采用cmake作为构建系统 Qt4的python绑定(pyside)采用了cmake作为构建系统 开源的图像处理库 opencv 采用cmake 作为构建系统 ... 看来不学习一下cmake是不行了,一点一点来吧,找个最简单的C程序,慢慢复杂化,试试看: 例子一 单个源文件 main.c 例子二 ==&amp;gt;分...
【OpenCV入门教程之七】 玩转OpenCV源代码:生成OpenCV工程解决方案与OpenCV源码编译
本系列文章由@浅墨_毛星云 出品,转载请注明出处。   文章链接: http://blog.csdn.net/poem_qianmo/article/details/21974023 作者:毛星云(浅墨)    邮箱: happylifemxy@163.com  写作当前博文时配套使用的OpenCV版本: 2.4.8
vs2008编译opencv,不能copy CMakeVSMacros2.vsmacros
由于学习opencv,要查看源码文件,所以要先对opencv进行编译,可悲的是<em>出错</em>了 “不能copy <em>CMake</em>VSMacros2.vsmacros” 通过上网查找资料,之所以出现这种情况,是因为cmake不兼容中文。 解决办法: 以VS2008编译环境为例首先打开VS2008,打开"Tool"菜单-&gt;"Option..."-&gt;"projects and solutions...
ubuntu下安装opencv,cmake出错,解决方法
ubuntu opencv安装时,cmake -- Configuring incomplete, errors occurred!<em>CMake</em>Output.log
cmake 出现的错误即解决办法
编译时出现如下错误:given no  RUNTIME DESTINATION 解决方法: 修改cmake文件,加入标记的语句: 再次进行 cmake ..  就可以通过编译
Cmake编译 VTK时出现问题:error configuration process, project files may be invalid的解决方法
在搭建vtk的基本环境之后,接下来就是学习过程了。但是自己在第一个例子就出现了一堆问题,这里贴出来解决之道,先填一波坑再说。 1. 问题介绍 我是按照:东灵VTK教程系列导航 学习的。 按照上面的介绍,首先编写第一个cmake编译vtk的例子: 首先是cmake代码: cmake_minimum_required(VERSION2.8) project(TestVTKInstall) f...
安装opencv3编译cmake错误:Configuring incomplete, errors occurred
如下问题: -- Configuring incomplete, errors occurred! See also &quot;/home/dafangwang/Documents/gym_gazebo/opencv/build/<em>CMake</em>Files/<em>CMake</em>Output.log&quot;. See also &quot;/home/dafangwang/Documents/gym_gazebo/opencv/buil...
配置Cmake的时候出错了,大神帮忙CMake Error at D:/Cmake/CMake 2.8/share/cmake-2.8/Modules/CM
<em>CMake</em> Error at D:/Cmake/<em>CMake</em> 2.8/share/cmake-2.8/Modules/<em>CMake</em>TestCXXCompiler.cmake:54 (message): T
使用cmake生成OpenCV源代码工程的解决方案时遇到报错
使用的版本opencv-3.0.0.exe,cmake-3.9.1-win32-x86.exe,vs2015.<em>求</em>大神帮我看看怎么解决,网上看了一堆方法都没解决。 <em>CMake</em> Deprecation W
CMakeLists.txt编译不正确
以下是运行时报错: terminate called after throwing an instance of 'std::system_error' what(): Enable multithr
CMake在安装了VS2015和VS2012的时候,选择VS2012作为编译器
https://zhidao.baidu.com/question/1514102332484372700.html cmake .\Vs2012 -G "Visual Studio 11 2012"
CMake入门指南
转自http://www.cnblogs.com/sinojelly/archive/2010/05/22/1741337.html<em>CMake</em>是一个比make更高级的编译<em>配置</em>工具,它可以根据不同平台、不同的编译器,生成相应的Makefile或者vcproj<em>项目</em>。通过编写<em>CMake</em>Lists.txt,可以控制生成的Makefile,从而控制编译过程。<em>CMake</em>自动生成的Makefile不仅可以通过make命令构建<em>项目</em>生成目标文件,还支持安装(make install)、测试安装的程序是否能正确执行
ROS编译出错
<em>CMake</em> Warning at /opt/ros/indigo/share/catkin/cmake/catkinConfig.cmake:76 (find_package): Could not find a package configuration file provided by "ecl_exceptions" with any of the following names:
使用cmake find_package找不到opencv
对cmake的使用不是很熟悉,遇到这个问题为自己简单记录一下。错误如下:<em>CMake</em> Error at <em>CMake</em>Lists.txt:39 (find_package):  By not providing &quot;FindOpenCV.cmake&quot; in CMAKE_MODULE_PATH this project has  asked <em>CMake</em> to find a package configura...
cmake安装遇到问题总结
推荐cmake安装文章点击打开链接以及opencv例子执行。 1、qmake: could not exec '/usr/lib/x86_64-linux-gnu/qt4/bin/qmake': No such file or directory    解决:安装:sudo apt-get install qt-sdk(470M,so heavy)          but some p
openCV2.4.12+vs2008+cmake配置出错及解决方案
openCV2.4.12+vs2008+cmake<em>配置</em><em>出错</em>及解决方案
程序员实用工具网站
目录 1、搜索引擎 2、PPT 3、图片操作 4、文件共享 5、应届生招聘 6、程序员面试题库 7、办公、开发软件 8、高清图片、视频素材网站 9、<em>项目</em>开源 10、在线工具宝典大全 程序员开发需要具备良好的信息检索能力,为了备忘(收藏夹真是满了),将开发过程中常用的网站进行整理。 1、搜索引擎 1.1、秘迹搜索 一款无敌有良心、无敌安全的搜索引擎,不会收集私人信息,保...
C#网络编程(接收文件)下载
c语言网络编程:C#网络编程(接收文件),这个是介绍网络编程,介绍的很好! 相关下载链接:[url=//download.csdn.net/download/yaochuancun/3349337?utm_source=bbsseo]//download.csdn.net/download/yaochuancun/3349337?utm_source=bbsseo[/url]
连接数据库的日记本项目下载
数据库连接,日记本程序,包含所有与源码,不涉及商业,欢迎共同交流学习 相关下载链接:[url=//download.csdn.net/download/u014227255/7402297?utm_source=bbsseo]//download.csdn.net/download/u014227255/7402297?utm_source=bbsseo[/url]
三本算法类的数据下载
算法导论_原书第3版_CHS.pdf,数据结构与算法:java语言描述.pdf,大话数据结构.pdf 相关下载链接:[url=//download.csdn.net/download/shouchanyue4634/10753072?utm_source=bbsseo]//download.csdn.net/download/shouchanyue4634/10753072?utm_source=bbsseo[/url]
相关热词 c#线程阻塞的方法 c#获取文件所在路径 c#mysql添加删除 c# 分段处理 大文件 c#list 头加元素 c# textbox密码 c# 循环 时间间隔 c#判断访问设备 c# sso开源框 c#dataset增加列
我们是很有底线的