ld:library not found for -lrt [问题点数:20分,无满意结帖,结帖人xiao969856]

Bbs1
本版专家分:0
结帖率 96.43%
Mac OS X 下命令行编译错误: ld: library not found for -lcrt1.10.6.o
在 Mac OS X 的 10.8.3 的版本中,使用命令行运行 configure 时,生成下面的错误: WenBi-MacBook:tcpdump-4.4.0 wenbi$ ./configure checking bui<em>ld</em> system type... x86_64-apple-darwin12.3.0 checking host system type.
ld: library not found for -lXXXXX 编译问题的解决方法
<em>ld</em>: <em>library</em> not <em>found</em> for -lXXXXX   的解决方法     团队开发的时候每次更新后都有可能碰到各种各样的问题,昨天同事对项目结构做了些修改,更新后编译就遇到下面的情况:     <em>ld</em>: <em>library</em> not <em>found</em> for -lAFNetworking  这个错误是说编译时找不到AFNetworking这个链接库,但是我在项目代码中找到对引用
library not found: -lrt
<em>library</em> not <em>found</em>: -<em>lrt</em> 这个包在哪里啊?谢谢各位!
ld: library not found for 问题总结
<em>ld</em>: <em>library</em> not <em>found</em> for这类问题是文件没找到或者编译框架的问题。 1. 首先检查Frameworks这个目录下面,看看那些事由于iOS SDK版本引起的问题,列如:xcode7之前库文件后缀是dylib而之后就变成了tbd。这可能就需要删除原来的重新导入库。 2. 还是在Bui<em>ld</em>Settings下,查看Valid Architectures这里的问题,有几个常...
mac下tpcc-mysql make时报错 library not found for -l-lrt
-
Linux下简单的c/c++编程
上一篇文章中我们已经介绍了GUN、GCC、G++等一些重要的概念,现在应该开始动手实践了!开发工具的安装环境 Distributions版本:CentOS 6.7 Linux内核片:2.6.32-573.3.1.el6.i686一般Linux安装完之后默认就已经安装了GCC(GNU Compiler Collection),你可以查看一下gcc和g++的版本号检查gcc和g++是否已经安装。
[在线等]ld: fatal: library -lapple-c: not found
我执行如下命令时rnrnCC -DSOLARIS -ptr../../obj -xarch=v9 -xarch=v9 -DXALAN_INMEM_MSG_LOADER -L../../lib -L/export/home/apple/apple12g/xalan/lib -lapple-c -mt -lm -L/export/home/apple/apple12g -L/export/home/apple/apple12g/lib -L/export/home/apple/apple12g/data -lpthread -L/usr/local/SUNWspro/lib -L/usr/ccs/lib -lc -lgen -L/export/home/apple/apple12g/lib -lsocket -ltxml -L../../lib -lxalanMsg ../../obj/XalanExe.o -o ../../bin/Xalanrnrn遇到这么个错误rn<em>ld</em>: fatal: <em>library</em> -lapple-c: not <em>found</em>rnrn奇了怪了,这个库libapple-c.so明明就是有的啊,而且我执行的命令中也有-L/export/home/apple/apple12g/xalan/librnrn$ ls /export/home/apple/apple12g/xalan/lib/libapple-c.sorn/export/home/apple/apple12g/xalan/lib/libapple-c.sorn$ ls ../../lib/libapple-c.sorn../../lib/libapple-c.sornrn我又试了试export LD_LIBRARY_PATH=/export/home/apple/apple12g/xalan/lib:$LD_LIBRARY_PATH, 还是不行rnrn忘了说,我是solaris平台,有人遇到这种情况吗?rn真心谢了。。
*** Working zlib library and headers not found ***
在windows 下用msys+mingw编译glib源码, ./configure后出现如下信息rn$ ./configurernchecking for a BSD-compatible install... /bin/install -crnchecking whether bui<em>ld</em> environment is sane... yesrnchecking for a thread-safe mkdir -p... /bin/mkdir -prn...rnchecking for ZLIB... norn...rnchecking for inflate in -lz... nornconfigure: error: *** Working zlib <em>library</em> and headers not <em>found</em> ***rnrn报的error应该是zlib库没有找rn然后我就下载了zlib的源码 zlib-1.2.3.tar.gz http://cdnetworks-kr-2.dl.sourceforge.net/project/libpng/zlib/1.2.3/zlib-1.2.3.tar.gzrn解压后把win32目录下的Makefile.gcc 复制到父目录中rn编译 rn ./configure 正常rnmake -f Makefile.gcc 正常rnls如下:rnAdministrator@20120104-2028 /d/zlibrn$ lsrnChangeLog configure gzio.o libzdll.a uncompr.ornFAQ contrib infback.c make_vms.com win32rnINDEX crc32.c infback.o minigzip.c zconf.hrnMakefile crc32.h inffast.c minigzip.exe zconf.in.hrnMakefile.gcc crc32.o inffast.h minigzip.o zlib.3rnMakefile.in deflate.c inffast.o minigzip_d.exe zlib.hrnREADME deflate.h inffixed.h msdos zlib1.dllrnadler32.c deflate.o inflate.c o<em>ld</em> zlibrc.ornadler32.o example.c inflate.h projects ztest2080.exernalgorithm.txt example.exe inflate.o qnx zutil.crnamiga example.o inftrees.c trees.c zutil.hrnas400 example_d.exe inftrees.h trees.h zutil.orncompress.c examples inftrees.o trees.orncompress.o gzio.c libz.a uncompr.crnrnrn然后我再到glib目录里去编译glib还是报*** Working zlib <em>library</em> and headers not <em>found</em> ***rn怎么才能在不改glib的 Makefile去编译呢 rn我还尝试了如下几个方法rn把zlib目录里的*.h 和*.dll *.exe *.a复制到了system32里 相应的也复制到了mingw include 和lib 里rn都不能解决rnrn为什么非得在Windows 里编译呢,,主要是我的笔记本一装Linux 就会被热的死机,AMD+ATI本本的悲哀
No tag library could be found with this URI
我用weblogic部署的项目,用到标签库,但提示:rnweblogic.servlet.jsp.CompilationException: Failed to compile JSP /el.jsprnel.jsp:2:4: No tag <em>library</em> cou<em>ld</em> be <em>found</em> with this URI. Possible causes cou<em>ld</em> be that the URI is incorrect, or that there were errors during parsing of the .t<em>ld</em> file.rnrn ^----^rnel.jsp:2:4: No tag <em>library</em> cou<em>ld</em> be <em>found</em> with this URI. Possible causes cou<em>ld</em> be that the URI is incorrect, or that there were errors during parsing of the .t<em>ld</em> file.rnrn ^----^rnrn at weblogic.servlet.jsp.JavelinxJSPStub.reportCompilationErrorIfNeccessary(JavelinxJSPStub.java:226)rn at weblogic.servlet.jsp.JavelinxJSPStub.compilePage(JavelinxJSPStub.java:162)rn at weblogic.servlet.jsp.JspStub.prepareServlet(JspStub.java:246)rn at weblogic.servlet.jsp.JspStub.prepareServlet(JspStub.java:191)rn at weblogic.servlet.internal.ServletStubImpl.execute(ServletStubImpl.java:235)rn Truncated. see log file for complete stacktracern>rn其中点击:JavelinxJSPStub.java:226、JavelinxJSPStub.java:162、JspStub.java:246、JspStub.java:191、ServletStubImpl.java:235。提示:Source not <em>found</em> for weblogic.servlet.jsp.[color=#FF6600]*[/color]
ld: Can't find library for -lCbsSysClass
那位高手帮忙看看,告诉我那个地方出错就行了,谢谢啦:rnrn硬件平台:HP-UX CRMCSAPP1 B.11.31 U ia64 (ta)rnrn错误:rnaCC public_oper_comm_def_obd_c.o public_user_def_obd_c.o public_oper_nserv_def_obd_c.o public_oper_user_def_obd_c.o public_nserv_def_obd_c.o public_oper_cust_def_obd_c.o public_cust_def_obd_c.o public_acct_def_obd_c.o public_pmgr_obd_c.o busirptmgnt_obd_c.o busipublic_obd_c.o UserMsc_db_obd_c.o ../public/__public/pub_string.o ../public/__public/c_app_error_log.o ../public/__public/c_app_log.o ../public/__public/c_application.o ../public/__public/c_exception.o ../public/__public/c_file_stream.o ../public/__public/c_foxdbf.o ../public/__public/c_ini_file.o ../public/__public/c_list.o ../public/__public/c_list_file.o ../public/__public/c_string.o ../public/__public/c_string_list.o ../public/__public/c_system.o ../public/__public/c_time.o ../public/__public/c_time_cost.o ../public/__public/pub_dir_file.o ../public/__public/app_config.o ../public/__public/c_encryption.o ../public/__public/pub_info_bus.o ../public/__public/c_mzcompress.o ../public/__public/c_mzcompress_bitio.o ../public/__public/c_mzcompress_lzw15v.o ../public/__public_net/c_thread_serv_socket.o ../public/__public_net/c_custom_uni_socket.o ../public/__public_net/c_server_thread_pool.o ../public/__public_net/c_simple_event.o ../public/__public_net/c_thread.o ../public/__public_net/c_critical_section.o payment_write.o c_kf_config.o c_write_billfile.o +Z +DD64 -Wl,+s -AA -mt -w -DORBNEWTHROW= -D_KERNEL_THREADS -DBITS64 +DD64 -D_REENTRANT -D_THREAD_SAFE -DPTHREADS -DTHREAD -D_RWSTD_MULTI_THREAD -DBIT64 -DHPUX -DOPENBOSS -DV20 -DNEIMENG -DHPUX_11 -DHPUX_aCC -DINCLUDE_FSTREAM -D_VIS_LONG_LONG -D_VIS_LONG_DOUBLE -D_VIS_UNICODE -D_VIS_STREAM_WCHAR -D_VIS_NO_IOSTREAM_WCHAR -D_VIS_STD -DOTL_ORA10G_R2 -DDB_TYPE_ORA -DOTL_DESTRUCTORS_DO_NOT_THROW -DOTL_STL -DTHREAD -DVisiBroker +DD64 -DOBD_DLL_CALL -DOBD_OPEN_BROKER_CALL -D__TEST__ -D__PAUL_TEST__ -D__MULTI_THREAD__ -D__TH_UNIX__ -D__TSET_SOCK__ -DOBD_C_USE_DYNAMIC_INTF -DAIX_BITS64 -Wl,+s -AA -mt +DD64 -L/oracle/app/oracle/product/10.2.0/client_1/lib -L/borland/broker/lib -L. -L/data1/compiler/lib -L/data1/compiler/lib_bes -lCbsSysClass -lOpenBuffer -lObSvrCtrl -lclntsh -lorb64_r -lvdlog64_r -lvport64_r -llmgr64 -lcosnm64_r -lcosev64_r -o __payment_write.binrn<em>ld</em>: Can't find <em>library</em> for -lCbsSysClassrnFatal error.rngmake: *** [__payment_write.bin] Error 1rnrn在/data1/compiler/lib目录下有这个库CbsSysClass,像不明白啊。
ls -lrt : command not found,执行命令总是报找不到
今天在 Linux 环境中,将环境变量配置错误了,导致所有的命令都没法操作 当我输入 ls -<em>lrt</em> 命令时,都报错 command not <em>found</em> 原因是:环境变量PATH被修改了,且修改失败 解决办法: 执行命令 export PATH=/bin:/usr/bin:$PATH ...
ld: library not found for -lXXXXX 编译问题的三个解决方法
<em>ld</em>: <em>library</em> not <em>found</em> for -lXXXXX   的解决方法     团队开发的时候每次更新后都有可能碰到各种各样的问题,昨天同事对项目结构做了些修改,更新后编译就遇到下面的情况:     <em>ld</em>: <em>library</em> not <em>found</em> for -lAFNetworking  这个错误是说编译时找不到AFNetworking这个链接库,但是我在项目代码中找到对引用
完美解决:"library not found for - "
分析原因,解决问题在Xcode编译的时候,可能会遇到报这个错误"<em>library</em> not <em>found</em> for - ",这是为什么呢?由于我们在项目中使用了一些第三方的库,如百度的静态库。当Xcode在编译的时候却找不到这个库,所以我们要让Xcode知道这个库文件在哪里,这样在编译的时候就可以轻松的找到库了。解决方法: 获取 库文件所在的文件路径 ,添加到Target的Bui<em>ld</em> Settings界面
ld: library not found for 解决
iOS 在导入其他三方库的时候,导入百度的静态库,报错<em>ld</em>: <em>library</em> not <em>found</em> for 图片.png 解决方法 在Bui<em>ld</em> Setting 中 Library Search Paths 中将三方的文件夹路径添加上即可 图片.png 参考链接:http://blog.csdn.net/xingxing513234072/article/details/29367247
library not found for - "解决办法">"library not found for - "解决办法
<em>library</em> not <em>found</em> for -
Xcode多target下配置Pods文件以及产生的编译错误:ld: library not found for -lPods
近期一个项目因为要分裂出一个新项目,新项目因为和原项目很类似就是用了多Target模式。起因项目要使用百度定位,为了方便我使用pod添加,很快在ATarget下就完成了开发,但是在切换到BTarget下运行成却出现了错误,说是找不到百度SDK,这就郁闷了,我根据错误在网上查找寻找答案。多target下配置Pods文件很显然这个问题已经有同学遇到过了,我参考了这位同学的博客,利用pod的abstra...
## iOS开发踩坑的第一步之Xcode配置问题(1) 关于ld: library not found for -l xxx 的问题处理方法
iOS开发踩坑的第一步之Xcode配置问题(1) 关于<em>ld</em>: <em>library</em> not <em>found</em> for -l xxx 的问题处理方法 最近在处理公司老代码的时候遇到了两个app需要去使用cocoapods管理框架的问题,它上一任的开发者已经离开多时,留给我阅览代码的时间也不多所以就急急忙忙的将它之前手动添加的框架进行了删除,并使用cocoapods安装下载了我们常用的几个(af,sd,mjref...
编译向:vlFeat 编译的时候出现 ld: library not found for -lgcc_s.10.4 问题及解决
case1: <em>ld</em>: <em>library</em> not <em>found</em> for -lgcc_s.10.4 clang: error: linker command failed with exit code 1 (use -v to see invocation) make: *** [bin/maci64/libvl.dylib] Error 1 解决方法参考链接: http://bugsfixes.b...
在xcode下用openssl写dh密钥交换,遇到“ld: library not found for -lcrypto”问题(已解决)
今天下午用xcode写一个特别简单的diffie-hellman密钥交换代码,参考了一堆资料,排除了逻辑和语法的错误以后依然编译不过,还有一个问题,问题截图如下: 一直提示 “<em>ld</em>: <em>library</em> not <em>found</em> for -lcrypto”  & “Linker command failed with exit code 1” 然后就在Google搜,在http://www.cn
LRT 测试(可使用)
是一个工具包,LOADRnuuer使用的测试包
ld: library not found for -l...." 问题的解决">"ld: library not found for -l...." 问题的解决
本文转载自:http://javaxxz.com/thread-367798-1-2.html 现象: 在编译工程时,有时会遇到类似“<em>ld</em>: <em>library</em> not <em>found</em> for -l....”的错误提示。 原因: 通常这是由于工程在编译时找不到需要的链接库而导致的。 解决方法: 一般可以通过如下方法解决,在工程的Target中选中要执行编译的某个target,然后“get info”,打...
iOS 项目报错 ld: library not found for -lxxx
iOS 项目报错  <em>ld</em>: <em>library</em> not <em>found</em> for -lxxx 如果你的项目编译或者运行出现这种错误,不要疑惑,不用四处寻找解决方法,完全可以肯定的是你的项目中缺少了.a文件(这个原因:就是你的项目在提交SVN时,没有把.a文件提交上去,导致项目在拉取时没有相应的.a文件,所以项目运行时就会出现这种错误提示)如何提交.a文件,请查看我的另一篇博客!可以在项目中去查找一下.a文件...
ld: library not found for -lgcc_s.10.5错误的解决
升级至Xcode 3.2.6,编译时出现“<em>ld</em>: <em>library</em> not <em>found</em> for -lgcc_s.10.5”错误,将Edit Project Settings中的Project Format修改为Xcode3.1-compatible。 这样可以在上真机编译和运行,但无法在模拟器上编译,修改n多bui<em>ld</em>设置,错误依旧。 Googling,有人说是没有安装Unix开发包,但我明明装了的...
ld: library not found for -lAFNetworking
解决方案: 项目工程中Target下面的Bui<em>ld</em> Active Architecuture Only 设置为NO 其次,由于项目不支持arm64 ,所以把Valid Architectures 设置为armv7 armv7s 同时pod工程下面 右侧的设置和工程设置一致就可以 最主要的就是项目工程和pod工程中,
解决library not found for -lPods-AFNetworking问题
使用了Cocoa Pod , 在编译的时候,出现 <em>library</em> not <em>found</em> for -lPods-AFNetworking  clang: error: linker command failed with exit code 1 (use -v to see invocation) 这样的问题, 可能的解决办法: 设定bui<em>ld</em> settings里面的other link fla
似然比检验 LRT
似然比检验(likelihood ratio test,LRT)是一种检验参数能否反映真实约束的方法(分布或模型的某参数等于 是否为真实约束)。似然比检验的思想是:“如果参数约束是有效的,那么加上这样的约束不应该引起似然函数最大值的大幅度降低。也就是说似然比检验的实质是在比较有约束条件下的似然函数最大值与无约束条件下似然函数最大值。” 可以看出,似然比检验是一种通用的检验方法(比 检验、...
%Ld与%ld的区别
/*不匹配的浮点转换*/rn# include rnint main()rn long n3=c;rn long n4=1234567890;rnrn printf("\n%<em>ld</em>,%<em>ld</em>",n3,n4); /* 第7行*/rnrn输出结果是:rn2000000000 1234567890rnrn但如果把第七行的小写字母l改为大写字母L,程序编译运行无任何错误,但输出结果为:rn-27648 30517rn这是为何?
使用ndk 运行的时候library not found
我根据网上的方法配制好了eclipse然后也生成了so文件rn我运行的是NDK的hello-jni的例子rn打包后打开那个apk 里面也有so文件 打包进去的是libhello-jni.sorn代码我也进行了修改 改成了rnstatic rn System.loadLibrary("libhello-jni.so");rn 把"hello-jni.lib"加上了 "lib"rnrn但是用模拟器运行的时候就崩溃了 那个例子使用的SDK是2.2的rn有谁遇到过这个问题啊?帮帮忙 谢谢了rn我是在windows7平台下开发。rnrn错误日志rn04-13 02:41:43.662: ERROR/Zygote(33): setreuid() failed. errno: 2rn04-13 02:41:51.282: ERROR/Zygote(33): setreuid() failed. errno: 17rn04-13 02:41:52.522: ERROR/BatteryService(59): usbOnlinePath not <em>found</em>rn04-13 02:41:52.522: ERROR/BatteryService(59): batteryVoltagePath not <em>found</em>rn04-13 02:41:52.522: ERROR/BatteryService(59): batteryTemperaturePath not <em>found</em>rn04-13 02:41:52.542: ERROR/SurfaceFlinger(59): Cou<em>ld</em>n't open /sys/power/wait_for_fb_sleep or /sys/power/wait_for_fb_wakern04-13 02:41:59.422: ERROR/EventHub(59): cou<em>ld</em> not get driver version for /dev/input/mouse0, Not a typewriterrn04-13 02:41:59.422: ERROR/EventHub(59): cou<em>ld</em> not get driver version for /dev/input/mice, Not a typewriterrn04-13 02:41:59.692: ERROR/System(59): Failure starting core servicern04-13 02:41:59.692: ERROR/System(59): java.lang.SecurityExceptionrn04-13 02:41:59.692: ERROR/System(59): at android.os.BinderProxy.transact(Native Method)rn04-13 02:41:59.692: ERROR/System(59): at android.os.ServiceManagerProxy.addService(ServiceManagerNative.java:146)rn04-13 02:41:59.692: ERROR/System(59): at android.os.ServiceManager.addService(ServiceManager.java:72)rn04-13 02:41:59.692: ERROR/System(59): at com.android.server.ServerThread.run(SystemServer.java:184)rn04-13 02:42:00.562: ERROR/SoundPool(59): error loading /system/media/audio/ui/Effect_Tick.oggrn04-13 02:42:00.572: ERROR/SoundPool(59): error loading /system/media/audio/ui/KeypressStandard.oggrn04-13 02:42:00.572: ERROR/SoundPool(59): error loading /system/media/audio/ui/KeypressSpacebar.oggrn04-13 02:42:00.572: ERROR/SoundPool(59): error loading /system/media/audio/ui/KeypressDelete.oggrn04-13 02:42:00.572: ERROR/SoundPool(59): error loading /system/media/audio/ui/KeypressReturn.oggrn04-13 02:42:03.413: ERROR/ThrottleService(59): Cou<em>ld</em> not open GPS configuration file /etc/gps.confrn04-13 02:42:04.922: ERROR/logwrapper(144): executing /system/bin/tc failed: No such file or directoryrn04-13 02:42:05.022: ERROR/logwrapper(145): executing /system/bin/tc failed: No such file or directoryrn04-13 02:42:05.042: ERROR/logwrapper(146): executing /system/bin/tc failed: No such file or directoryrn04-13 02:42:20.249: ERROR/HierarchicalStateMachine(59): TetherMaster - unhandledMessage: msg.what=3rn04-13 03:23:34.869: ERROR/AndroidRuntime(276): FATAL EXCEPTION: mainrn04-13 03:23:34.869: ERROR/AndroidRuntime(276): java.lang.ExceptionInInitializerErrorrn04-13 03:23:34.869: ERROR/AndroidRuntime(276): at java.lang.Class.newInstanceImpl(Native Method)rn04-13 03:23:34.869: ERROR/AndroidRuntime(276): at java.lang.Class.newInstance(Class.java:1429)rn04-13 03:23:34.869: ERROR/AndroidRuntime(276): at android.app.Instrumentation.newActivity(Instrumentation.java:1021)rn04-13 03:23:34.869: ERROR/AndroidRuntime(276): at android.app.ActivityThread.performLaunchActivity(ActivityThread.java:2577)rn04-13 03:23:34.869: ERROR/AndroidRuntime(276): at android.app.ActivityThread.handleLaunchActivity(ActivityThread.java:2679)rn04-13 03:23:34.869: ERROR/AndroidRuntime(276): at android.app.ActivityThread.access$2300(ActivityThread.java:125)rn04-13 03:23:34.869: ERROR/AndroidRuntime(276): at android.app.ActivityThread$H.handleMessage(ActivityThread.java:2033)rn04-13 03:23:34.869: ERROR/AndroidRuntime(276): at android.os.Handler.dispatchMessage(Handler.java:99)rn04-13 03:23:34.869: ERROR/AndroidRuntime(276): at android.os.Looper.loop(Looper.java:123)rn04-13 03:23:34.869: ERROR/AndroidRuntime(276): at android.app.ActivityThread.main(ActivityThread.java:4627)rn04-13 03:23:34.869: ERROR/AndroidRuntime(276): at java.lang.reflect.Method.invokeNative(Native Method)rn04-13 03:23:34.869: ERROR/AndroidRuntime(276): at java.lang.reflect.Method.invoke(Method.java:521)rn04-13 03:23:34.869: ERROR/AndroidRuntime(276): at com.android.internal.os.ZygoteInit$MethodAndArgsCaller.run(ZygoteInit.java:868)rn04-13 03:23:34.869: ERROR/AndroidRuntime(276): at com.android.internal.os.ZygoteInit.main(ZygoteInit.java:626)rn04-13 03:23:34.869: ERROR/AndroidRuntime(276): at dalvik.system.NativeStart.main(Native Method)rn04-13 03:23:34.869: ERROR/AndroidRuntime(276): Caused by: java.lang.UnsatisfiedLinkError: Library libhello-jni not <em>found</em>rn04-13 03:23:34.869: ERROR/AndroidRuntime(276): at java.lang.Runtime.loadLibrary(Runtime.java:461)rn04-13 03:23:34.869: ERROR/AndroidRuntime(276): at java.lang.System.loadLibrary(System.java:557)rn04-13 03:23:34.869: ERROR/AndroidRuntime(276): at com.example.hellojni.HelloJni.(HelloJni.java:64)rn04-13 03:23:34.869: ERROR/AndroidRuntime(276): ... 15 morern04-13 04:55:16.259: ERROR/AndroidRuntime(306): FATAL EXCEPTION: mainrn04-13 04:55:16.259: ERROR/AndroidRuntime(306): java.lang.ExceptionInInitializerErrorrn04-13 04:55:16.259: ERROR/AndroidRuntime(306): at java.lang.Class.newInstanceImpl(Native Method)rn04-13 04:55:16.259: ERROR/AndroidRuntime(306): at java.lang.Class.newInstance(Class.java:1429)rn04-13 04:55:16.259: ERROR/AndroidRuntime(306): at android.app.Instrumentation.newActivity(Instrumentation.java:1021)rn04-13 04:55:16.259: ERROR/AndroidRuntime(306): at android.app.ActivityThread.performLaunchActivity(ActivityThread.java:2577)rn04-13 04:55:16.259: ERROR/AndroidRuntime(306): at android.app.ActivityThread.handleLaunchActivity(ActivityThread.java:2679)rn04-13 04:55:16.259: ERROR/AndroidRuntime(306): at android.app.ActivityThread.access$2300(ActivityThread.java:125)rn04-13 04:55:16.259: ERROR/AndroidRuntime(306): at android.app.ActivityThread$H.handleMessage(ActivityThread.java:2033)rn04-13 04:55:16.259: ERROR/AndroidRuntime(306): at android.os.Handler.dispatchMessage(Handler.java:99)rn04-13 04:55:16.259: ERROR/AndroidRuntime(306): at android.os.Looper.loop(Looper.java:123)rn04-13 04:55:16.259: ERROR/AndroidRuntime(306): at android.app.ActivityThread.main(ActivityThread.java:4627)rn04-13 04:55:16.259: ERROR/AndroidRuntime(306): at java.lang.reflect.Method.invokeNative(Native Method)rn04-13 04:55:16.259: ERROR/AndroidRuntime(306): at java.lang.reflect.Method.invoke(Method.java:521)rn04-13 04:55:16.259: ERROR/AndroidRuntime(306): at com.android.internal.os.ZygoteInit$MethodAndArgsCaller.run(ZygoteInit.java:868)rn04-13 04:55:16.259: ERROR/AndroidRuntime(306): at com.android.internal.os.ZygoteInit.main(ZygoteInit.java:626)rn04-13 04:55:16.259: ERROR/AndroidRuntime(306): at dalvik.system.NativeStart.main(Native Method)rn04-13 04:55:16.259: ERROR/AndroidRuntime(306): Caused by: java.lang.UnsatisfiedLinkError: Library ./lib/armeabi/libhello-jni not <em>found</em>rn04-13 04:55:16.259: ERROR/AndroidRuntime(306): at java.lang.Runtime.loadLibrary(Runtime.java:461)rn04-13 04:55:16.259: ERROR/AndroidRuntime(306): at java.lang.System.loadLibrary(System.java:557)rn04-13 04:55:16.259: ERROR/AndroidRuntime(306): at com.example.hellojni.HelloJni.(HelloJni.java:64)rn04-13 04:55:16.259: ERROR/AndroidRuntime(306): ... 15 morern04-13 04:57:39.959: ERROR/AndroidRuntime(338): FATAL EXCEPTION: mainrn04-13 04:57:39.959: ERROR/AndroidRuntime(338): java.lang.ExceptionInInitializerErrorrn04-13 04:57:39.959: ERROR/AndroidRuntime(338): at java.lang.Class.newInstanceImpl(Native Method)rn04-13 04:57:39.959: ERROR/AndroidRuntime(338): at java.lang.Class.newInstance(Class.java:1429)rn04-13 04:57:39.959: ERROR/AndroidRuntime(338): at android.app.Instrumentation.newActivity(Instrumentation.java:1021)rn04-13 04:57:39.959: ERROR/AndroidRuntime(338): at android.app.ActivityThread.performLaunchActivity(ActivityThread.java:2577)rn04-13 04:57:39.959: ERROR/AndroidRuntime(338): at android.app.ActivityThread.handleLaunchActivity(ActivityThread.java:2679)rn04-13 04:57:39.959: ERROR/AndroidRuntime(338): at android.app.ActivityThread.access$2300(ActivityThread.java:125)rn04-13 04:57:39.959: ERROR/AndroidRuntime(338): at android.app.ActivityThread$H.handleMessage(ActivityThread.java:2033)rn04-13 04:57:39.959: ERROR/AndroidRuntime(338): at android.os.Handler.dispatchMessage(Handler.java:99)rn04-13 04:57:39.959: ERROR/AndroidRuntime(338): at android.os.Looper.loop(Looper.java:123)rn04-13 04:57:39.959: ERROR/AndroidRuntime(338): at android.app.ActivityThread.main(ActivityThread.java:4627)rn04-13 04:57:39.959: ERROR/AndroidRuntime(338): at java.lang.reflect.Method.invokeNative(Native Method)rn04-13 04:57:39.959: ERROR/AndroidRuntime(338): at java.lang.reflect.Method.invoke(Method.java:521)rn04-13 04:57:39.959: ERROR/AndroidRuntime(338): at com.android.internal.os.ZygoteInit$MethodAndArgsCaller.run(ZygoteInit.java:868)rn04-13 04:57:39.959: ERROR/AndroidRuntime(338): at com.android.internal.os.ZygoteInit.main(ZygoteInit.java:626)rn04-13 04:57:39.959: ERROR/AndroidRuntime(338): at dalvik.system.NativeStart.main(Native Method)rn04-13 04:57:39.959: ERROR/AndroidRuntime(338): Caused by: java.lang.UnsatisfiedLinkError: Library ./lib/armeabi/libhello-jni.so not <em>found</em>rn04-13 04:57:39.959: ERROR/AndroidRuntime(338): at java.lang.Runtime.loadLibrary(Runtime.java:461)rn04-13 04:57:39.959: ERROR/AndroidRuntime(338): at java.lang.System.loadLibrary(System.java:557)rn04-13 04:57:39.959: ERROR/AndroidRuntime(338): at com.example.hellojni.HelloJni.(HelloJni.java:64)rn04-13 04:57:39.959: ERROR/AndroidRuntime(338): ... 15 morern
found问题资源">融云即时通讯library "libsqlite.so" not found问题资源
适配Android7.0问题,不加如该文件会话列表页面发送消息会失败以及显示不了发送的消息
found">load_library(linker.cpp:759): library "libmaliinstr.so" not found
E/linker (18234): load_<em>library</em>(linker.cpp:759): <em>library</em> "libmaliinstr.so" not <em>found</em>rnrn在手机上运行的时候出现这个错误rn请问怎么回事呢rn谢谢
解决 ld: library not found for -lPods的问题
最近计划把公司的项目重构一下,第一步就是引入CocoaPods(以下简称pods)来管理第三方库。但是这第一步就不是太顺利。 首先建好Podfile,并在命令行中输入pod install,结果报以下错误 [!] The XXX target overrides the 'OTHER_LDFLAGS' bui<em>ld</em> setting defined in 'Pods/Target Suppor...
IOS如何解决 ld: library not found for -lAFNetworking
问题描述:在导入新项目编译,发现出现<em>ld</em>: <em>library</em> not <em>found</em> for -lAFNetworking的错误,无法完成编译。 问题分析:根据经验,应该是PODS出问题,果然该项目通过CocoaPods引用了IAFnetworking的库。 解决方案:接来下重新更新项目的pods,打开终端,在项目文件夹目录(就是podfile所在目录)输入pod install。 重新编译,问题
ld: library not found for -lXXXXX 的解决方法
团队开发的时候每次更新后都有可能碰到各种各样的问题,昨天同事对项目结构做了些修改,更新后编译就遇到下面的情况:<em>ld</em>: <em>library</em> not <em>found</em> for -lAFNetworking 这个错误是说编译时找不到AFNetworking这个链接库,但是我在项目代码中找到对引用的地方,没有其他异常。有两种解决方法。方法一:点击 XCode 工程文件,在 Bui<em>ld</em> Phases 中查看 “ Li
废弃第三方库导致的library not found for -lXXXXX(linker command failed ) 完美解决方法
编译错误是让人头疼错误,它没有指向具体代码而是指向第三方库的编译错误。有的库可能我们以前使用,现在不再使用,把它删除了或通过Podfile文件修改重新更新了,但是它还是给我们捣乱。通常是对它没有删除干净引起了。通常有四种解决方案: 方法一:点击 XCode 工程文件,在 Bui<em>ld</em> Phases 中查看 “ Link binary With Libraries” 如果不出所料,你应该能发现有一...
升级到XCode 10.0 原来的程序报错误:library not found for -lstdc++.6.0.9
升级到XCode 10.0 原来的程序报错误如下: <em>ld</em>: <em>library</em> not <em>found</em> for -lstdc++.6.0.9 clang: error: linker command failed with exit code 1 (use -v to see invocation) 解决方法: 1、找到error,然后单击右键,选择弹出框中的Reveal in Log查看错误,发...
found">融云、环信dlopen failed: library "libsqlite.so" not found
看字面是找不到libsqlite.so 因为我用的是融云,其实类似的第三方的IM基本都用这玩意,比如还有个环信,也是 我百度许久后发现是因为7.0为了安全性,禁止访问系统内容,恰巧这货又是系统里的,所以就找不到了,将此资源放到项目中完美解决
交叉编译gdb遇到no termcap library found的解决方法
configure: error: no termcap <em>library</em> <em>found</em> make[1]: *** [configure-gdb] Error 1 make[1]: Leaving directory `/home/doctmp/part1/lesson1/ARM-tools/arm-linux-gdb-7.5/gdb-7.5' make: *** [all] Error 2
cocoapods报错library not found for -l+第三方库名称
使用cocoapods导入了AFNetworking, 然后把项目移动到其他地方编译运行就报错,说找不到AFNetworking ...有遇到过的童鞋没
configure:error:Valid xpm library not found
我在虚拟机环境下,练习一下tarball类型的软件安装,我在执行configure的时候 最后不能创建makefile文件,结果显示configure: error: Valid xpm <em>library</em> not <em>found</em>,我想问一下是我的电脑上面没安装xpm <em>library</em>吗?我该怎么解决?谢谢!!
解决android 模拟器 BMapApiEngine_xxx library not found! 错误
NULL 博文链接:https://jyao.iteye.com/blog/2003714
解决Xcode编译错误 ld: library not found for -lcrt1.3.1.o
解决Xcode编译错误 <em>ld</em>: <em>library</em> not <em>found</em> for -lcrt1.3.1.o
library not found for -lpng
-
(原创)ld: library not found for -lXXXXX 编译问题的解决方法
<em>ld</em>: <em>library</em> not <em>found</em> for -lXXXXX   的解决方法     团队开发的时候每次更新后都有可能碰到各种各样的问题,昨天同事对项目结构做了些修改,更新后编译就遇到下面的情况:     <em>ld</em>: <em>library</em> not <em>found</em> for -lAFNetworking  这个错误是说编译时找不到AFNetworking这个链接库,但是我在项目代码中找到对引用的地方,...
Mac安装zimg路之杀怪
MACOSX_DEPLOYMENT_TARGET=10.14 make
LD教程 LD教学 Loadrunner
LD教程 对于lrunner进行了全面的解析 参数化 集合点 检查点的描述
using ld (gnu ld manual)
<em>ld</em> combines a number of object and archive files, relocates their data and ties up symbol references. Usually the last step in compiling a program is to run <em>ld</em>.
mac php brew install ld:symbol(s) not found for architecture x86_64
brew install php56rn==> Installing php56 from josegonzalez/homebrew-phprn==> Downloading https://www.php.net/get/php-5.6.4.tar.bz2/from/this/mirrorrnAlready downloaded: /Library/Caches/Homebrew/php56-5.6.4rn==> Patchingrn==> ./configure --prefix=/usr/local/Cellar/php56/5.6.4 --localstatedir=/usr/local/var --sysconfdir=/usr/local/etc/php/5.6 --with-config-file-rn==> makern ...rn<em>ld</em>: symbol(s) not <em>found</em> for architecture x86_64rnclang: error: linker command failed with exit code 1 (use -v to see invocation)rnmake: *** [libs/libphp5.bundle] Error 1rnmake: *** Waiting for unfinished jobs....rnrnREAD THIS: http://git.io/brew-troubleshootingrnIf reporting this issue please do so at (not Homebrew/homebrew):rn https://github.com/josegonzalez/homebrew-php/issuesrnrn求助:有人知道怎么回事吗?
关于添加私有库后ld: framework not found 的问题
问题:在添加私有库后已经在Bulid setting的framework search中添加了私有库的寻找路径$(PROJECT_DIR)/Pro_Name仍然显示<em>ld</em>: framework not <em>found</em>。
LD资料
LD资料
Building Boost for Android with error “cannot find -lrt
编辑tools/bui<em>ld</em>/src/tools/gcc.jam rule setup-threading ( targets * : sources * : properties * ){ local threading = [ feature.get-values threading : $(properties) ] ; if $(threading) = multi { ...
Xcode10升级项目报错library not found for -lstdc++.6.0.9
在升级Xcode10后运行项目会发出报了一个错“<em>library</em> not <em>found</em> for -libstdc++.6.0.9”,很简单,就是因为xocde10后这个libstd++.6.0.9库已经不用了。只需要打开tagets-&amp;gt;Bui<em>ld</em> Phases -&amp;gt;Link Binary With Libraries下找到这个库删除就OK了。...
xcode10报错: library not found for -lstdc++.6.0.9
升级xcode10, 运行项目报错 <em>library</em> not <em>found</em> for -lstdc++.6.0.9 原因 -lstdc++ 这个库,5年前已经废弃掉了。xcode10 更是删除了这个库,所以第三方有引用到这个库的,会导致报错。 解决方法 1.等三方库修改。 2.找到xcode10之前的版本的库文件,并粘贴到xcode10 对应的目录。操作如下: 下载库文件 ,并把该库文件放到目录./Ap...
ld: library no found for -lstdc++.6.0.9错误解决方案
今天升级xcode 10.0发现项目报错如下图   这是因为iOS12.0中采用libc++代替lstdc++的动态库,我们可以在target-bui<em>ld</em> Phases-Link Binary With Libraries中将libstdc++.6.0.9.tbd移除掉就可以了   注:有的项目可能在link Binary With Libraries中没有引入6.0.9还会出现报错情...
library not found for -lstdc++.6.0.9
解决方案 : 真机 /Applications/Xcode.app/Contents/Developer/Platforms/iPhoneOS.platform/Developer/SDKs/iPhoneOS.sdk/usr/lib/ 模拟器 /Applications/Xcode.app/Contents/Developer/Platforms/iPhoneSimulator.platf...
ld中文手册
<em>ld</em>是连接程序的工具,好多诡异的错误就是因为编译而引起。所以有必要掌握<em>ld</em>的相关知识,欢迎下载
ld之杂记
1. .a和.o的区别 a=archive 存档文件 o=object 对象文件 简单说.a就是将一个或多个.o封装在了一起变成了存档文件,方法为: ar rcs libxxx.a xxx1.o xxx2.o xxx3.o 但是在使用.o和.a编译生成可执行二进制文件时,他们之间是有差别的 .o中的所有内容都会被直接编译进二进制文件中 .a中的只有被用到的.o才会被编译进
ld链接脚本
学习<em>ld</em>链接脚本的最好书籍,有理论,有实践代码,看完了,你就完全会了
LD链接脚本
由vmlinux-&amp;gt;Zimage: http://blog.chinaunix.net/uid-2630593-id-2530229.html 1. 依据arch/arm/kernel/vmlinux.<em>ld</em>s 生成linux内核源码根目录下的vmlinux,这个vmlinux属于未压缩,带调试信息、符号表的最初的内核,大小约23MB; arm-linux-gnu-<em>ld</em> -EL -p --n...
LDA算法
LDA算法,最后面为什么特征值最大就是所求的情形。 这个严格的证明还没想通。 第一个链接里的是看到的最通俗易懂的入门。 点击打开链接 http://blog.csdn.net/ffeng271/article/details/7353834 http://blog.csdn.net/v_july_v/article/details/41209515
library not found for -lstdc++.
关于ios:<em>library</em> not <em>found</em> for -lstdc++.6.0.9,lstdc.6找不到的原因和解决办法 最近在学习ios遇见这么个问题,为什么会突然找不到原因,通过网上查资料以及Google查询和询问前辈可以得知在Xcode10后lstcd已经被移除了,如果想继续使用得去原来的Xcode低版本找lstdc相应的文件转移到Xcode10,网上办法都是一样但是都参差不齐,可以先...
library not found for -libstdc++.6.0.9
报错原因 Xcode升级到Xcode10.0后,由于去掉陈旧的libstdc++库替换为libc++,libc++相对是苹果最新版的C++库,经过优化并全面支持C++11 解决办法 下载libstdc++库,下载链接,提取码arms 将 libstdc++、libstdc++.6、libstdc++6.0.9拷贝到Xcode的如下目录: 1.真机环境:/Applications/Xco...
Xcode10 library not found for -lstdc++ 找不到问题
在Xcode9上正常编译的项目,在Xcode10上编译可能会遇到如下错误: <em>library</em> not <em>found</em> for -lstdc++.6.0.9 <em>library</em> not <em>found</em> for -lstdc++.6 <em>library</em> not <em>found</em> for -lstdc++ 这是因为Xcode10彻底废弃了libstdc++,相关的库文件libstdc++.6.0.9.dylib、libs...
报错:library not found for -l XXX
  如果是pod导入第三方库,查看项目里是否少了xcworkspace文件: xcworkspace.jpeg   如果缺少该文件就把它添加上,添加方法:关闭Xcode,编辑好Podfile文件,终端cd到工程目录,用pod install 命令重新安装,成功后再打开Xcode编译项目。 在XCode 工程文件,在 Bui<em>ld</em> Phases 中查看 “ Link binary ...
ld参数
-m emulation Emulate the emulation linker. You can list the available emulations with the --verbose or -V options.   If the -m option is not used, the emulation is taken from the &quot;LDEMULATION&quot; envi...
ld -Ttext
我在linux kernel makefile中看到 link 选项 -Ttext 100000, 这个是什么意思? 谢谢
ld命令
<em>ld</em> 用于把目标代码文件连接为可执行文件或者库文件 参数 -b: 指定目标代码输入文件的格式 -Bstatic: 只使用静态库 -Bdynamic: 只使用动态库 -Bsymbolic: 把引用捆绑到共享库中的全局符号 -c: 从指定的命令文件读取命令 --cref: 创建跨引用表 -d: 设置空格给通用符号,即使指定了可重定位输出 -defsym: ...
Using ld GNU ld 官方手册
Using <em>ld</em> GNU <em>ld</em> 官方手册 了解GNU LD的最佳读物
ld概览
<em>ld</em> 链接器的功能是将一个可执行程序所需的目标文件和库最终整合为一体。一个程序通常包含传统的三个段:.text、 .data和 .bss 段。实际上,在目标文件和库被整合成一个可执行文件之前,通常各目标文件和库中也包含这三个段。不难想象链接器的功能就是将这些段进行合并。这之间有个非常重要的工作——重定位。1、重定位当一个源文件被编译为目标文件时,目标文件只记录了程序中的符号和各符号在段中的相对位置...
ld: library not found for -lautotrack clang: error: linker command failed with exit code 1 (use -v t
           一般情况下,出现<em>library</em> not <em>found</em> for -XXX clang: error: linker command failed with exit code 1 (use -v t  原因有可能是:             Linked Frameworks and Libraries 中没有添加相应的第三方库文件的 .a文件 或者 .framework 文件...
ios pods引入第三方库 报错:ld: library not found for -lxxxx
ios pods引入第三方库 报错:<em>ld</em>: <em>library</em> not <em>found</em> for -lxxxx 这种错误网上给出了太多的解决方法,这里只说一下我是怎么解决的,希望你能用这种方式处理好自己的错误。 找到target(指定项目) -&amp;gt; bui<em>ld</em> Settings -&amp;gt; Library Search Paths , 填写提示找不到的按个库的路径。 路径填写方式:&quot;${PODS_C...
String LD
DescriptionnnString<em>ld</em> (left delete) is a function that gets a string and deletes its leftmost character (for instance String<em>ld</em>(“acm”) returns “cm”). nnYou are given a list of distinct words, and at each step, we apply string<em>ld</em> on every word in the list. Write a program that determines the number of steps that can be applied until at least one of the conditions become true: nn1) A word becomes empty string, or n2) a duplicate word is generated. nnFor example, having the list of words aab, abac, and caac, applying the function on the input for the first time results in ab, bac, and aac. For the second time, we get b, ac, and ac. Since in the second step, we have two ac strings, the condition 2 is true, and the output of your program shou<em>ld</em> be 1. Note that we do not count the last step that has resulted in duplicate string. More examples are <em>found</em> in the sample input and output section.nInputnnThere are multiple test cases in the input. The first line of each test case is n (1 <= 100), the number of words. nEach of the next n lines contains a string of at most 100 lower case characters. nThe input terminates with a line containing 0.nOutputnnFor each test case, write a single line containing the maximum number of string<em>ld</em> we can call.nSample Inputnn4naabanaacanbaabcdndcban3naaanbbbbncccccn0nSample Outputnn1n2
Clion添加Posix消息队列的-lrt连接
在CMakelist.txt中添加: find_<em>library</em>(LIBRT rt) if(LIBRT) target_link_libraries(targetname ${LIBRT}) endif() 其中,targetname是需要构建的项目名称。添加后,点击bui<em>ld</em>,之后就可以正常运行 ...
cocoapods 配置私有库遇到的library not found for -l编译报错问题
cocoapods 配置私有库遇到的<em>library</em> not <em>found</em> for -l 的编译错误问题我遇到的问题是,内部私有库pod下来之后,debug模式下一直报错,工程跑不起来,必须切换成release模式程序才能正常跑,后来经过查找问题,跟网上其他的错误解决问题方法基本一致,解决如下:
library not found for -l第三方库名 编译问题的解决方法
<em>ld</em>: <em>library</em> not <em>found</em> for -l第三方库名  这个错误是说编译时找不到第三方库。方法一:点击 XCode 工程文件,在 Bui<em>ld</em> Phases 中查看 “ Link binary With Libraries”  如果不出所料,你应该能发现有一到数个的条目是用红色字体来显示的。 说明这些被工程引用的这些文件,其物理文件已经不处于之前所记录的地方了。 这种情况下,右键点击红...
tomcat 启动报APR based Apache Tomcat Native library not found
NULL 博文链接:https://never-forget.iteye.com/blog/1827823
修改工程名称编译时报ld: library not found for -lPods-lXXX解决办法
给原来的工程重新修改下名字,编译报错: <em>ld</em>: <em>library</em> not <em>found</em> for -lPods-YXFDCategories clang: error: linker command failed with exit code 1 (use -v to see invocation) 找到工程中的主TARGETS-&amp;amp;gt;Bui<em>ld</em> Phases-&amp;amp;gt;Link Binary Wi...
错误 ld: library not found for -lPods
<em>ld</em>: <em>library</em> not <em>found</em> for -lPods-XXXX clang: error: linker command failed with exit code 1 (use -v to see invocation) 在将工程放到git上管理时 然后克隆下来 再打开工程可能会出现上面的问题 解决办法: 在 Bui<em>ld</em> Phase 下的 Link Binary With Lib...
vcx library not found!修改类后时出现问题
我想改一下父类为_form,类_Table.vcx中的子类_filterdialog,想在_filterdialog在里面添加一个 'And'按钮及代码。结果改完后就出现了,运行时点击筛选时出现vcx <em>library</em> not <em>found</em>!我再重新添加类_table.vcx也不好用!
交叉编译gdb,并解决no termcap library found的方法
交叉编译8.0版本之前的gdb(编译gdb-8.0没有出现这个问题)时总是出现no termcap <em>library</em> <em>found</em>,网上提供了很多不同的办法,这里参考hi3516的开发环境提供的解决方案,在编译gdb之前,先编译ncurese便不会再报这个错误了。编译之后把ncursese编译得到的lib全部拷贝到交叉编译时的暂存环境目录,我这里是放在了staging_dir/usr/lib,再编译
vcx library not found!为什么没有回答我的问题?各位
我想改一下类_filterdialog(父类为_form,类_Table.vcx),想在_filterdialog在里面添加一个 'And'按钮及代码。结果改完后就出现了,运行时点击筛选按钮时出现vcx <em>library</em> not <em>found</em>!我在项目中再重新添加类_table.vcx也不好用!rnrn
configure: error: Standard C math library -lm not found
Ubuntu8.10下rnrn安装一个软件时出现了这样的错误信息:rnrnconfigure: error: Standard C math <em>library</em> -lm not <em>found</em>rnrn怎么解决?rnrn为什么说找不到Standard C math <em>library</em>,而我的/usr/include下确实存在math.h呀?rnrn谢谢!rn
ld: library not found for -lXXX 错误解决方法
1.2.3. 此方法为参考, 根本解决方法在上面
Xcode10:library not found for -lstdc++.6.0.9 临时解决
下载 stdc++.6.0.9 提取自Xcode9 stdc++.6.0.9 在终端输入以下命令打开lib库目录 open /Applications/Xcode.app/Contents/Developer/Platforms/iPhoneOS.platform/Developer/SDKs/iPhoneOS.sdk/usr/lib 把刚刚下载的zip文件解压 获取到 libstdc++.6....
iOS经典错误library not found for -lXXX
开发中经常会和ibrary not <em>found</em> for -xxx打交道,尤其是我们从远程仓库或者github clone下来一个项目,编译很有可能报这个错误。如下图: 报错信息 <em>library</em> not <em>found</em> for -lXXX 属于iOS经典错误之一。下面我们通过复现这个错误的方式来说明这个错误的解决方法。其中l是lib(<em>library</em>)的意思。 首先声明,我的工程中引用了
iOS开发中解决报错之library not found for -lAFNetworking
简书地址:https://www.jianshu.com/p/e36fe721913f
glib arm-linux交叉编译不通过,提示*** Working zlib library and headers not found ***
glib arm-linux交叉编译不通过,提示*** Working zlib <em>library</em> and headers not <em>found</em> ***rnrn我已经交叉编译了zlib 1.2.5rn有人说这是没有zlib-devel的原因rn我从网上下了zlib-devel,但是不知道怎么交叉编译,没有configure。rnrn请那位知道的大虾指导一下。
存儲管理LRT,OPTFIFO算法
操作系统虚拟存储管理,FIFO,OPT,LRT算法。 通过随机数产生一个指令序列,共320条指令。 页面大小为1K; 用户内存容量为4页到32页; 用户虚存容量为32K。
-lz -lrt -lm -lc都是什么库
m 我知道这个库代表什么,z,c代表什么库,可以的话,再多列几个你知道的库,多多宜善!
电子商务电子商务市场营销策划培训下载
电子商务电子商务市场营销策划培训 电子商务电子商务市场营销策划培训 电子商务电子商务市场营销策划培训 相关下载链接:[url=//download.csdn.net/download/chenlongailaoda/2190995?utm_source=bbsseo]//download.csdn.net/download/chenlongailaoda/2190995?utm_source=bbsseo[/url]
Android音乐播放器 源码下载
Android音乐播放器 源码,简易的音乐播放器。可是实现 播放 暂停 下一曲 前一曲等功能。仅用于初级开发学习交流。 相关下载链接:[url=//download.csdn.net/download/liangjinliang0103/4492815?utm_source=bbsseo]//download.csdn.net/download/liangjinliang0103/4492815?utm_source=bbsseo[/url]
SVN服务器+客户端+MyEclipse插件的安装和使用简介下载
1. SVN服务器+客户端+MyEclipse插件的安装和使用简介文档 2. SVN服务器端和客户端的软件 3. MyEclipse SVN插件 相关下载链接:[url=//download.csdn.net/download/victor_lance/8136243?utm_source=bbsseo]//download.csdn.net/download/victor_lance/8136243?utm_source=bbsseo[/url]
相关热词 c++和c#哪个就业率高 c# 批量动态创建控件 c# 模块和程序集的区别 c# gmap 截图 c# 验证码图片生成类 c# 再次尝试 连接失败 c#开发编写规范 c# 压缩图片好麻烦 c#计算数组中的平均值 c#获取路由参数
我们是很有底线的