linux 系统安装gnuradio 过程在 make test 阶段出现如下错误,请求帮助 [问题点数:40分]

Bbs1
本版专家分:0
结帖率 0%
Bbs1
本版专家分:0
GNURadio中的错误及解决方发
1、buffer相关的<em>错误</em>之一                 <em>错误</em>信息: gr::vmcircbuf_sysv_shm: shmget(1): 无效的参数 gr::vmcircbuf_sysv_shm: shmget(1): 无效的参数 gr::vmcircbuf_sysv_shm: shmget(1): 无效的参数 gr::buffer::allocate_buffer: faile
GNU RADIO 入门中的一个错误
原<em>错误</em>: 改错:
重装gnuradio遇到一点问题
我用手提用的是ubuntu系统 我按照<em>gnuradio</em>的官方网站上安装<em>gnuradio</em>以后,发现找不到<em>gnuradio</em>-companion   后来我在台式机上找到旧版本的<em>gnuradio</em>-companion的目录 在手提上在找到的时候,发现那个目录里边的<em>gnuradio</em>-companion名字变成了grc。。。。   后来我在命令行输入 grc回车后,那个图形界面出来了。。。。。。。   自由软
make test 报错
<em>make</em> <em>test</em> 有出错 <em>make</em> <em>test</em> 有报错: Build complete. Don’t forget to run ‘<em>make</em> <em>test</em>’. +———————————————————–+ | ! ERROR ! | | The <em>test</em>-suite requires that proc_open() is available. | | Please check if yo
centos 安装gnu radio 通过yum install gnuradio找不到安装包解决方法
centos 安装gnu radio,官方建议通过yum install <em>gnuradio</em>安装,但直接运行提示Error: Nothing to do 解决方法: 需要先安装扩展源EPEL。 EPEL(http://fedoraproject.org/wiki/EPEL) 是由 Fedora 社区打造,为 RHEL 及衍生发行版如 CentOS、Scientific Linux 等提供高质量...
GNU Radio教程(一)
GNU Radio是一个设计框架,用户可以用来设计、模拟和部署的真实高效无线电系统。这是一个高度模块化,自带flowgraph流程图,集成处理各种信号的库,可以很方便的将各个模块结合到一起来处理复杂的信号。 GNU Radio已经被广泛应用于无线电世界,可以用电脑软件处理包括音频处理、移动通信、卫星跟踪、雷达系统、GSM网络、数字信号广播等等。
基于linux平台的GnuRadio+USRP环境搭建
(Ubuntu下安装<em>gnuradio</em>+uhd的方法) 1.更新软件源:$sudo apt-get update 2.安装c<em>make</em>: $ sudo apt-get install c<em>make</em> (注意:GNU Radio 仅提供了对 USRP1 和 USRP2 的硬件驱动,且在 GNU Radio 3.5.0 和以后的版本中,不再提供对 USRP 的驱动,所以可以安装3.4.2之前版本就不需要
openLTE编译cmake时出错,not found gnuradio
在安装openLTE时,因为我是在ubuntu软件中心一键安装的<em>gnuradio</em>,编译openLTE时c<em>make</em> ../出错,<em>如下</em>: stwen@stwen-H81M-CT:~/openLTE/openlte_v00-18-04/build$ c<em>make</em> ../ -- Build type not specified: defaulting to release. -- Boost vers
linux-test测试
<em>test</em> 测试 三种基本格式 <em>test</em> -f file -a -d folder && echo 1|| echo 0 [ -f file -a -d folder ] && echo 1|| echo 0 [[ -f file && -d folder]]&&echo 1 || echo 0  注释:该种格式-a ,-o对应 &&和|| #以上三种格式都是测试file文件,和folde
Linux cmake安装,配置以及测试
安装 c<em>make</em>-3.2.2.tar.gz 解压:tar zxvf c<em>make</em>-3.2.2.tar.gz 得到 c<em>make</em>-3.2.2 进入c<em>make</em>-3.2.2:cd c<em>make</em>-3.2.2 ./bootstrap --prefix=/home/root/c<em>make</em>-build-3.2.2  #prefix后跟安装目录 <em>make</em> <em>make</em> install 配置 vi /
linux下Makefile用法(基础)
掌握<em>make</em>的用法,Makefile的内容,能在<em>linux</em>下C++编程。
Linux下Google Test(GTest)测试环境搭建步骤
原文地址:http://www.<em>linux</em>idc.com/Linux/2015-05/116894.htm GTest简介GTest测试环境搭建 Step 1:下载GTESTStep 2:认识文件夹Step 3:清除不需要的文件Step 4:改写Makefile文件Step 5:添加自己的测试函数 GTest简介 g<em>test</em>是一个跨平台(Liunx、Ma
Linux 下 Make 命令
Linux 下 <em>make</em> 命令是系统管理员和程序员用的最频繁的命令之一。管理员用它通过命令行来编译和安装很多开源的工具,程序员用它来管理他们大型复杂的项目编译问题。本文我们将用一些实例来讨论 <em>make</em> 命令背后的工作机制。 Make 如何工作的 对于不知道背后机理的人来说,<em>make</em> 命令像命令行参数一样接收目标。这些目标通常存放在以 “Makefile” 来命名的特殊文件中,同时文件也
安装GNUradio步骤
在VMwark上安装GNUradio和UHD的步骤
makefile test
<em>make</em> file 用用用,<em>make</em> file 说说说, <em>make</em> file 看看看。
qt环境安装
自己的安装笔记,<em>make</em><em>阶段</em>,<em>出现</em>一下<em>错误</em> /usr/bin/ld: cannot find -lXrender collect2: ld returned 1 exit status <em>make</em>[1]: *** [../../../../lib/libQtWebKit.so.4.7.3] <em>错误</em> 1 <em>make</em>[1]: Leaving directory,自己遇到的问题都解决的,ubuntu 12.04系统。
gnuradio入门
<em>gnuradio</em>的入门教程,包含了<em>gnuradio</em>和usrp的使用方法,<em>帮助</em>大家入门
vc6.0在win7下的安装方法
vc的一些在win7<em>系统安装</em>的方法及<em>出现</em><em>错误</em>后的解决
gnuradio安装指南——详解ubuntu16.04下使用脚本安装gnuradio&uhd全过程
全程记录在ubuntu16.04下使用脚本从源文件安装<em>gnuradio</em>的<em>过程</em>,测试成果,给出终端输出信息,供新手参考。
安装redis服务器时,执行sudo make test出现错误
You need tcl 8.5 or newer in order to run the Redis <em>test</em> Makefile:225: recipe for target ‘<em>test</em>’ failed <em>make</em>: * [<em>test</em>] Error 1 提示需要安装tcl,解决方法<em>如下</em> wget http://downloads.sourceforge.net/tcl/tcl8.6.1-s...
Linux下 config/configure/Configure、makemake test/make check、sudo make install 的作用
这些都是典型的使用GNU的AUTOCONF和AUTOMAKE产生的程序的安装步骤config/configure/Configure这个是用来检测你的安装平台的目标特征的。比如它会检测你是不是有CC或GCC,并不是需要CC或GCC,它是个shell脚本这一步一般用来生成 Makefile,为下一步的编译做准备,你可以通过在 configure 后加上参数来对安装进行控制,比如:./configur...
Linux下make命令
Linux 下 <em>make</em> 命令是系统管理员和程序员用的最频繁的命令之一。管理员用它通过命令行来编译和安装很多开源的工具,程序员用它来管理他们大型复杂的项目编译问题。本文我们将用一些实例来讨论 <em>make</em> 命令背后的工作机制。Make 如何工作的对于不知道背后机理的人来说,<em>make</em> 命令像命令行参数一样接收目标。这些目标通常存放在以 “Makefile” 来命名的特殊文件中,同时文件也包含与目标相对应...
linux下的Make命令
Linux 下 <em>make</em> 命令是系统管理员和程序员用的最频繁的命令之一。管理员用它通过命令行来编译和安装很多开源的工具,程序员用它来管理他们大型复杂的项目编译问题。本文我们将用一些实例来讨论 <em>make</em> 命令背后的工作机制。 Make 如何工作的 对于不知道背后机理的人来说,<em>make</em> 命令像命令行参数一样接收目标。这些目标通常存放在以 “Makefile” 来命名的特殊文件中,同时文件也包含与目...
linux下安装googletest
1、到https://github.com/google/google<em>test</em>下载最新的google<em>test</em>,点击download zip; 2、unzip master.zip 3、cd进入解压的目录; 4、./travis.sh,再c<em>make</em> ./CMakeLists.txt ; 5、生成了Makefile,<em>make</em>,<em>make</em> install;
Linux安装Redis后,make test出现You need tcl 8.5 or newer in order to run the Redis test”问题
1 安装之后,进入Redis根目录下的src下,输入<em>make</em> <em>test</em>,<em>出现</em> [root@localhost src]# <em>make</em> <em>test</em> You need tcl 8.5 or newer in order to run the Redis <em>test</em> <em>make</em>: *** [<em>test</em>] Error 1 2 解决的方法:       输入以下的命令 wget http://downlo...
Linux下Make编译结果输出到文件
Linux下Make编译结果输出到文件。
linux驱动编译时make -C M= 解释
Makefile为, PWD = $(shell pwd) KERNEL_SRC = /usr/src/<em>linux</em>-source-2.6.15/   obj-m := <em>test</em>.o module-objs := <em>test</em>.o   all:        $(MAKE) -C $(KERNEL_SRC) M=$(PWD) modules        clean:
安装Ubuntu系统环境搭建和安装GNU Radio安装
安装Ubuntu系统环境搭建和安装GNU Radio安装
自己抓的DHCP四个阶段的包
自己用抓包工具抓的DHCP4个<em>阶段</em>的包,包括<em>请求</em>,提供,选择,确认四个<em>阶段</em>。里面有详细的注解,是初学者学习DHCP的很好的材料。
本人菜鸟,编译Linux内核时出现如下错误!!请求帮助
在进行<em>linux</em> 内核编译的时候,<em>出现</em>了<em>如下</em><em>错误</em>,<em>请求</em><em>帮助</em>。。rnrn[color=#FF0000]$ sudo <em>make</em> mrproperrn/usr/src/<em>linux</em>-headers-2.6.32-32/drivers/staging/rt3090/Makefile:3: drivers/staging/rt3090/config.mk: 没有那个文件或目录rn<em>make</em>[3]: *** 没有规则可以创建目标“drivers/staging/rt3090/config.mk”。 停止。rn<em>make</em>[2]: *** [drivers/staging/rt3090] <em>错误</em> 2rn<em>make</em>[1]: *** [drivers/staging] <em>错误</em> 2rn<em>make</em>: *** [_clean_drivers] <em>错误</em> 2[/color]rnrn请各位大侠给解答!!谢谢rn
lua5.3.tar.gz
lua脚本语言。版本5.3.5。安装方法: tar -zxvf lua-5.3.5.tar.gz cd lua-5.3.5 <em>make</em> <em>linux</em> <em>test</em> <em>make</em> install
如何恢复设备硬件出现致命错误,导致请求失败F盘的资料
磁盘打不开设备硬件<em>出现</em>致命<em>错误</em>,导致<em>请求</em>失败,是因为这个I盘的文件系统内部结构损坏导致的。要恢复里面的数据就必须要注意,这个盘不能格式化,否则数据会进一步损坏。具体的恢复方法看正文
Linux下的make命令使用心得
本文译至:http://d.hatena.ne.jp/embedded/20140829/p1 为了使<em>make</em>命令执行并行处理,-j 选项可以用来指定作业数。 $ <em>make</em> -j4  作业数是在编译的时候指定主机的CPU个数,所以在脚本中写成一个常量很糟糕。(特别是把编译脚本给其他人的时候。)并行处理的作业数和编译的效率直接相关,所以需要设置合适的作业数量。 昨天的文章中在
tomcat显示如下错误请求帮助
HTTP Status 500 - rnrn--------------------------------------------------------------------------------rnrntype Exception reportrnrnmessage rnrndescription The server encountered an internal error () that prevented it from fulfilling this request.rnrnexception rnrnorg.apache.jasper.JasperException: Unable to compile class for JSPrnrnNo Java compiler was found to compile the generated source for the JSP. rnThis can usually be solved by copying manually $JAVA_HOME/lib/tools.jar from the JDK rnto the common/lib directory of the Tomcat server, followed by a Tomcat restart. rnIf using an alternate Java compiler, please check its installation and access path.rnrn org.apache.jasper.compiler.DefaultErrorHandler.javacError(DefaultErrorHandler.java:128)rn org.apache.jasper.compiler.ErrorDispatcher.javacError(ErrorDispatcher.java:351)rn org.apache.jasper.compiler.Compiler.generateClass(Compiler.java:413)rn org.apache.jasper.compiler.Compiler.compile(Compiler.java:453)rn org.apache.jasper.compiler.Compiler.compile(Compiler.java:437)rn org.apache.jasper.JspCompilationContext.compile(JspCompilationContext.java:555)rn org.apache.jasper.servlet.JspServletWrapper.service(JspServletWrapper.java:291)rn org.apache.jasper.servlet.JspServlet.serviceJspFile(JspServlet.java:301)rn org.apache.jasper.servlet.JspServlet.service(JspServlet.java:248)rn javax.servlet.http.HttpServlet.service(HttpServlet.java:856)rnrn我已经把tools.jar放在环境变量里面了,还把它复制到tomcat\common\lib目录下,可还是不行,<em>请求</em>得到大家的<em>帮助</em>
Linux server installation
Linux <em>系统安装</em>,Linux <em>系统安装</em>,Linux <em>系统安装</em>,Linux <em>系统安装</em>
IP处理模块test阶段
IP处理模块<em>test</em><em>阶段</em>IP处理模块<em>test</em><em>阶段</em>IP处理模块<em>test</em><em>阶段</em>IP处理模块<em>test</em><em>阶段</em>IP处理模块<em>test</em><em>阶段</em>IP处理模块<em>test</em><em>阶段</em>IP处理模块<em>test</em><em>阶段</em>IP处理模块<em>test</em><em>阶段</em>IP处理模块<em>test</em><em>阶段</em>
ACE在linuxmake一直出现错误
<em>make</em>[1]: Entering directory `/home/coreland/Desktop/ACE_wrappers/apps/gperf'rnrnGNU<em>make</em>file: /home/coreland/Desktop/ACE_wrappers/apps/gperf/GNU<em>make</em>file.gperf_docs MAKEFLAGS=wrnrn<em>make</em>[1]: Leaving directory `/home/coreland/Desktop/ACE_wrappers/apps/gperf'rn<em>make</em>[1]: Entering directory `/home/coreland/Desktop/ACE_wrappers/apps/gperf/src'rnrnGNU<em>make</em>file: /home/coreland/Desktop/ACE_wrappers/apps/gperf/src/GNU<em>make</em>file.gperf MAKEFLAGS=wrnrn<em>make</em>[1]: Leaving directory `/home/coreland/Desktop/ACE_wrappers/apps/gperf/src'rn<em>make</em>[1]: Entering directory `/home/coreland/Desktop/ACE_wrappers/apps/gperf/<em>test</em>s'rnrnGNU<em>make</em>file: /home/coreland/Desktop/ACE_wrappers/apps/gperf/<em>test</em>s/GNU<em>make</em>file.cppinset MAKEFLAGS=wrnrn../../../bin/ace_gperf -a -D cpp.gperf > cpp.cpprn17 input keysigs have identical hash values, examine output carefully...rnGPERF: Automatically changing to -S1 switch optionrng++ -fvisibility=hidden -fvisibility-inlines-hidden -DACE_GCC_HAS_TEMPLATE_INSTANTIATION_VISIBILITY_ATTRS=1 -O3 -ggdb -pthread -Wall -W -Wpointer-arith -pipe -D_GNU_SOURCE -I/home/coreland/Desktop/ACE_wrappers -D__ACE_INLINE__ -I../../.. -c -o .obj/cpp.o cpp.cpprncpp.cpp:42: <em>错误</em>:缺少结尾的 " 字符rncpp.cpp:43: <em>错误</em>:缺少结尾的 " 字符rncpp.cpp:44: <em>错误</em>:缺少结尾的 " 字符rncpp.cpp:45: <em>错误</em>:缺少结尾的 " 字符rncpp.cpp:46: <em>错误</em>:缺少结尾的 " 字符rncpp.cpp:47: <em>错误</em>:缺少结尾的 " 字符rncpp.cpp:48: <em>错误</em>:缺少结尾的 " 字符rncpp.cpp:49: <em>错误</em>:缺少结尾的 " 字符rncpp.cpp:50: <em>错误</em>:缺少结尾的 " 字符rncpp.cpp:51: <em>错误</em>:缺少结尾的 " 字符rncpp.cpp:52: <em>错误</em>:缺少结尾的 " 字符rncpp.cpp:53: <em>错误</em>:缺少结尾的 " 字符rncpp.cpp:54: <em>错误</em>:缺少结尾的 " 字符rncpp.cpp:55: <em>错误</em>:缺少结尾的 " 字符rncpp.cpp:56: <em>错误</em>:缺少结尾的 " 字符rncpp.cpp:57: <em>错误</em>:缺少结尾的 " 字符rncpp.cpp:58: <em>错误</em>:缺少结尾的 " 字符rncpp.cpp:59: <em>错误</em>:缺少结尾的 " 字符rncpp.cpp:60: <em>错误</em>:缺少结尾的 " 字符rncpp.cpp:61: <em>错误</em>:缺少结尾的 " 字符rncpp.cpp:62: <em>错误</em>:缺少结尾的 " 字符rncpp.cpp:63: <em>错误</em>:缺少结尾的 " 字符rncpp.cpp:64: <em>错误</em>:缺少结尾的 " 字符rncpp.cpp:65: <em>错误</em>:缺少结尾的 " 字符rncpp.cpp:66: <em>错误</em>:缺少结尾的 " 字符rncpp.cpp:67: <em>错误</em>:缺少结尾的 " 字符rncpp.cpp:68: <em>错误</em>:缺少结尾的 " 字符rncpp.cpp:69: <em>错误</em>:缺少结尾的 " 字符rncpp.cpp:70: <em>错误</em>:缺少结尾的 " 字符rncpp.cpp:71: <em>错误</em>:缺少结尾的 " 字符rncpp.cpp:72: <em>错误</em>:缺少结尾的 " 字符rncpp.cpp:73: <em>错误</em>:缺少结尾的 " 字符rncpp.cpp:74: <em>错误</em>:缺少结尾的 " 字符rncpp.cpp:75: <em>错误</em>:缺少结尾的 " 字符rncpp.cpp:76: <em>错误</em>:缺少结尾的 " 字符rncpp.cpp:77: <em>错误</em>:缺少结尾的 " 字符rncpp.cpp:78: <em>错误</em>:缺少结尾的 " 字符rncpp.cpp:79: <em>错误</em>:缺少结尾的 " 字符rncpp.cpp:80: <em>错误</em>:缺少结尾的 " 字符rncpp.cpp:81: <em>错误</em>:缺少结尾的 " 字符rncpp.cpp:82: <em>错误</em>:缺少结尾的 " 字符rncpp.cpp:83: <em>错误</em>:缺少结尾的 " 字符rncpp.cpp:84: <em>错误</em>:缺少结尾的 " 字符rncpp.cpp:85: <em>错误</em>:缺少结尾的 " 字符rncpp.cpp:86: <em>错误</em>:缺少结尾的 " 字符rncpp.cpp:87: <em>错误</em>:缺少结尾的 " 字符rncpp.cpp:88: <em>错误</em>:缺少结尾的 " 字符rncpp.cpp:89: <em>错误</em>:缺少结尾的 " 字符rncpp.cpp:90: <em>错误</em>:缺少结尾的 " 字符rncpp.cpp:91: <em>错误</em>:缺少结尾的 " 字符rncpp.cpp:92: <em>错误</em>:缺少结尾的 " 字符rncpp.cpp:93: <em>错误</em>:缺少结尾的 " 字符rncpp.cpp:94: <em>错误</em>:缺少结尾的 " 字符rncpp.cpp:95: <em>错误</em>:缺少结尾的 " 字符rncpp.cpp:96: <em>错误</em>:缺少结尾的 " 字符rncpp.cpp:97: <em>错误</em>:缺少结尾的 " 字符rncpp.cpp:98: <em>错误</em>:缺少结尾的 " 字符rncpp.cpp:99: <em>错误</em>:缺少结尾的 " 字符rncpp.cpp:100: <em>错误</em>:缺少结尾的 " 字符rncpp.cpp:101: <em>错误</em>:缺少结尾的 " 字符rncpp.cpp:102: <em>错误</em>:缺少结尾的 " 字符rncpp.cpp:103: <em>错误</em>:缺少结尾的 " 字符rncpp.cpp:104: <em>错误</em>:缺少结尾的 " 字符rncpp.cpp:105: <em>错误</em>:缺少结尾的 " 字符rncpp.cpp:106: <em>错误</em>:缺少结尾的 " 字符rncpp.cpp:107: <em>错误</em>:缺少结尾的 " 字符rncpp.cpp:108: <em>错误</em>:缺少结尾的 " 字符rncpp.cpp:109: <em>错误</em>:缺少结尾的 " 字符rncpp.cpp:110: <em>错误</em>:缺少结尾的 " 字符rncpp.cpp:111: <em>错误</em>:缺少结尾的 " 字符rncpp.cpp:112: <em>错误</em>:缺少结尾的 " 字符rncpp.cpp:113: <em>错误</em>:缺少结尾的 " 字符rncpp.cpp:114: <em>错误</em>:缺少结尾的 " 字符rncpp.cpp:115: <em>错误</em>:缺少结尾的 " 字符rncpp.cpp:116: <em>错误</em>:缺少结尾的 " 字符rncpp.cpp:117: <em>错误</em>:缺少结尾的 " 字符rncpp.cpp:118: <em>错误</em>:缺少结尾的 " 字符rncpp.cpp:119: <em>错误</em>:缺少结尾的 " 字符rncpp.cpp:120: <em>错误</em>:缺少结尾的 " 字符rncpp.cpp:121: <em>错误</em>:缺少结尾的 " 字符rncpp.cpp:122: <em>错误</em>:缺少结尾的 " 字符rncpp.cpp:123: <em>错误</em>:缺少结尾的 " 字符rncpp.cpp:124: <em>错误</em>:缺少结尾的 " 字符rncpp.cpp:125: <em>错误</em>:缺少结尾的 " 字符rncpp.cpp:126: <em>错误</em>:缺少结尾的 " 字符rncpp.cpp:127: <em>错误</em>:缺少结尾的 " 字符rncpp.cpp:128: <em>错误</em>:缺少结尾的 " 字符rncpp.cpp:129: <em>错误</em>:缺少结尾的 " 字符rncpp.cpp:130: <em>错误</em>:缺少结尾的 " 字符rncpp.cpp:131: <em>错误</em>:缺少结尾的 " 字符rncpp.cpp:132: <em>错误</em>:缺少结尾的 " 字符rncpp.cpp:133: <em>错误</em>:缺少结尾的 " 字符rncpp.cpp:134: <em>错误</em>:缺少结尾的 " 字符rncpp.cpp:135: <em>错误</em>:缺少结尾的 " 字符rncpp.cpp:136: <em>错误</em>:缺少结尾的 " 字符rncpp.cpp:137: <em>错误</em>:缺少结尾的 " 字符rncpp.cpp:138: <em>错误</em>:缺少结尾的 " 字符rncpp.cpp:139: <em>错误</em>:缺少结尾的 " 字符rncpp.cpp:140: <em>错误</em>:缺少结尾的 " 字符rncpp.cpp:141: <em>错误</em>:缺少结尾的 " 字符rncpp.cpp:142: <em>错误</em>:缺少结尾的 " 字符rncpp.cpp:143: <em>错误</em>:缺少结尾的 " 字符rncpp.cpp:144: <em>错误</em>:缺少结尾的 " 字符rncpp.cpp:145: <em>错误</em>:缺少结尾的 " 字符rncpp.cpp:146: <em>错误</em>:缺少结尾的 " 字符rncpp.cpp:147: <em>错误</em>:缺少结尾的 " 字符rncpp.cpp:148: <em>错误</em>:缺少结尾的 " 字符rncpp.cpp:149: <em>错误</em>:缺少结尾的 " 字符rncpp.cpp:150: <em>错误</em>:缺少结尾的 " 字符rncpp.cpp:151: <em>错误</em>:缺少结尾的 " 字符rncpp.cpp:152: <em>错误</em>:缺少结尾的 " 字符rncpp.cpp:153: <em>错误</em>:缺少结尾的 " 字符rncpp.cpp:154: <em>错误</em>:缺少结尾的 " 字符rncpp.cpp:155: <em>错误</em>:缺少结尾的 " 字符rncpp.cpp:156: <em>错误</em>:缺少结尾的 " 字符rncpp.cpp:157: <em>错误</em>:缺少结尾的 " 字符rncpp.cpp:158: <em>错误</em>:缺少结尾的 " 字符rncpp.cpp:159: <em>错误</em>:缺少结尾的 " 字符rncpp.cpp:160: <em>错误</em>:缺少结尾的 " 字符rncpp.cpp:161: <em>错误</em>:缺少结尾的 " 字符rncpp.cpp:162: <em>错误</em>:缺少结尾的 " 字符rncpp.cpp:163: <em>错误</em>:缺少结尾的 " 字符rncpp.cpp:164: <em>错误</em>:缺少结尾的 " 字符rncpp.cpp:165: <em>错误</em>:缺少结尾的 " 字符rncpp.cpp:166: <em>错误</em>:缺少结尾的 " 字符rncpp.cpp:167: <em>错误</em>:缺少结尾的 " 字符rncpp.cpp:168: <em>错误</em>:缺少结尾的 " 字符rncpp.cpp:169: <em>错误</em>:缺少结尾的 " 字符rncpp.cpp:170: <em>错误</em>:缺少结尾的 " 字符rncpp.cpp:171: <em>错误</em>:缺少结尾的 " 字符rncpp.cpp:172: <em>错误</em>:缺少结尾的 " 字符rncpp.cpp:173: <em>错误</em>:缺少结尾的 " 字符rncpp.cpp:174: <em>错误</em>:缺少结尾的 " 字符rncpp.cpp:175: <em>错误</em>:缺少结尾的 " 字符rncpp.cpp:176: <em>错误</em>:缺少结尾的 " 字符rncpp.cpp:177: <em>错误</em>:缺少结尾的 " 字符rncpp.cpp:178: <em>错误</em>:缺少结尾的 " 字符rncpp.cpp:179: <em>错误</em>:缺少结尾的 " 字符rncpp.cpp:180: <em>错误</em>:缺少结尾的 " 字符rncpp.cpp:181: <em>错误</em>:缺少结尾的 " 字符rncpp.cpp:182: <em>错误</em>:缺少结尾的 " 字符rncpp.cpp:183: <em>错误</em>:缺少结尾的 " 字符rncpp.cpp:184: <em>错误</em>:缺少结尾的 " 字符rncpp.cpp:185: <em>错误</em>:缺少结尾的 " 字符rncpp.cpp:186: <em>错误</em>:缺少结尾的 " 字符rncpp.cpp:187: <em>错误</em>:缺少结尾的 " 字符rn<em>make</em>[1]: *** [.obj/cpp.o] <em>错误</em> 1rn<em>make</em>[1]: Leaving directory `/home/coreland/Desktop/ACE_wrappers/apps/gperf/<em>test</em>s'rn<em>make</em>: *** [cppinset] <em>错误</em> 2rnrnrnrn<em>make</em>ACE_wrappers/apps/gperf'下文件总是失败,删除目录下cpp.cpp重新<em>make</em>也失败,libACE.so移动到usr/lib也没用,求大神帮忙解决...
Linux与Oracle系统安装指导
Linux与Oracle<em>系统安装</em>指导Linux与Oracle<em>系统安装</em>指导Linux与Oracle<em>系统安装</em>指导Linux与Oracle<em>系统安装</em>指导Linux与Oracle<em>系统安装</em>指导Linux与Oracle<em>系统安装</em>指导Linux与Oracle<em>系统安装</em>指导Linux与Oracle<em>系统安装</em>指导Linux与Oracle<em>系统安装</em>指导Linux与Oracle<em>系统安装</em>指导Linux与Oracle<em>系统安装</em>指导Linux与Oracle<em>系统安装</em>指导Linux与Oracle<em>系统安装</em>指导Linux与Oracle<em>系统安装</em>指导Linux与Oracle<em>系统安装</em>指导Linux与Oracle<em>系统安装</em>指导Linux与Oracle<em>系统安装</em>指导
linux系统的安装和卸载
<em>linux</em>的<em>系统安装</em>和卸载的详细<em>过程</em>,有助于初学者的学习。
disksim3.0+flashsim,以及相关安装包
基于disksim3.0的flashsim模拟器,还包括环境配置<em>过程</em>中的相关安装包
Building GNURadio on Ubuntu Linux
Building GNURadio on Ubuntu Linux,从<em>gnuradio</em>网站上打印下来的,资源不够好,方便一些不能翻墙的同学吧!
项目软件开发过程的几十种文档
从项目申请成功一直到项目验收的所有文档,包括项目计划<em>阶段</em>,系统分析与设计<em>阶段</em>,软件编码与测试<em>阶段</em>,<em>系统安装</em>与调试<em>阶段</em>,系统运行<em>阶段</em>,项目跟踪和监督<em>过程</em>,质量保证<em>过程</em>,配置管理<em>过程</em>,评审<em>过程</em>和需求管理<em>过程</em>等,几十种文档。
USRP平台实现802.11
在GNURadio及USRP平台上实现802.11简单通信<em>过程</em>
解决 错误使用 mcc Test checkout of feature 'Compiler' failed.
解决matlab编译可执行文件<em>过程</em>中的<em>错误</em>,(应该是破解不完全) <em>错误</em>使用 mcc Test checkout of feature 'Compiler' failed.
linuxmake出现错误
我在ubuntu下<em>make</em>的时候<em>出现</em><em>错误</em>啊!一个led的驱动程序,<em>make</em>file<em>如下</em>:rnrnifneq ($(KERNELRELEASE),)rnrnobj-m :=EmbedSky_gpio.ornrnelsernrnKBUILD := /lib/modules/2.6.35-22-generic/buildrnrnmodules:rnrn <em>make</em> -C $(KBUILD) M=$(shell pwd) modules ARCH=arm COMPILE=arm-<em>linux</em>-rnrnclean:rnrn rm -f *.o *~ core .depend .*.cmd *.ko *.mod.crnrn rm -rf .tmp_versionsrnrnendifrnrn可是我<em>make</em>的时候总是<em>出现</em>这样的<em>错误</em>:rnroot@ubuntu:/usr/<em>test</em># <em>make</em>rn<em>make</em> -C /lib/modules/2.6.35-22-generic/build M=/usr/<em>test</em> modulesrn<em>make</em>[1]: Entering directory `/usr/src/<em>linux</em>-headers-2.6.35-22-generic'rn CC [M] /usr/<em>test</em>/EmbedSky_gpio.orn/usr/<em>test</em>/EmbedSky_gpio.c:11: fatal error: mach/regs-gpio.h: No such file or directoryrncompilation terminated.rn<em>make</em>[2]: *** [/usr/<em>test</em>/EmbedSky_gpio.o] Error 1rn<em>make</em>[1]: *** [_module_/usr/<em>test</em>] Error 2rn<em>make</em>[1]: Leaving directory `/usr/src/<em>linux</em>-headers-2.6.35-22-generic'rn<em>make</em>: *** [modules] Error 2rn 请问是为什么啊?
qibuild make ,出现错误
D:\VS2017\安装\VC\Tools\MSVC\14.10.25017\include\cmath(471): error C3646: “noexcept”: 未知重写说明符 [D:\NAO_C\n................rnrn编译器我选的是2010,IDE 选的是 VS,<em>错误</em>提示为什么会<em>出现</em> vs2017 ?rn请各位大佬指点。[img=http://forum.csdn.net/PointForum/ui/scripts/csdn/Plugin/001/face/9.gif][/img]
t1lib-5.1.2.tar.gz
64位centOS7中,安装php5.5.14之前,必备的扩展库,已经经过测试没有问题,供大家下载。
TestHttpPost(http get和post请求测试)
用来测试webapi接口,get和post<em>请求</em>测试,用来测试webapi接口,get和post<em>请求</em>测试,
解决matlab 2014b的Test checkout of feature 'Compiler' failed
解决matlab 2014b的Test checkout of feature 'Compiler' failed. 以上<em>错误</em>据说是因为2014b破解不完全引起的。
解决ubuntu 下opencv与cuda冲突的问题
[modules/gpu/CMakeFiles/cuda_compile.dir/src/nvidia/core/cuda_compile_generated_NCVPyramid.cu.o] Error 1 [modules/gpu/CMakeFiles/opencv_gpu.dir/all] Error 2
Redhat安装参考文档
之前没有<em>系统安装</em>过Linux,本日志只作为自己安装RedHat Linux的<em>过程</em>记录。
git Android内核出现错误请求帮助
我在Ubuntu9.10下用git clone http://android.git.kernel.org/kernel/common.git来下载内核,下载一会就<em>出现</em>以下<em>错误</em>:rnwalk 7c465a3e14d6ec18c6c8c38c471d0631abeae41arnwalk 00dc766f6644f2d1b0b05b80112bb4f94339e168rnwalk 132305ed227e69bd7498c8a30d40a338a23a4afernGetting pack list for http://android.git.kernel.org/pu ... alds/<em>linux</em>-2.6.git/rnerror: Unable to find 5dc01c595e6c6ec9ccda4f6f69c131c0dd945f8c under http://android.git.kernel.org/kernel/common.gitrnCannot obtain needed object 5dc01c595e6c6ec9ccda4f6f69c131c0dd945f8crnwhile processing commit 132305ed227e69bd7498c8a30d40a338a23a4afe.rnfatal: Fetch failed.rnrn请高手们<em>帮助</em>。。
JAVA 绘图文件
有<em>错误</em><em>请求</em>高手<em>帮助</em>修改
CVS提交出现错误请求帮助
rn 我觉得我都设置好了,自己机器上都可以,可是放到别的机器上,为什么Lock service就启动不起来了rn 从别的机器可以连接上去,可是提交的时候<em>出现</em><em>如下</em><em>错误</em>提示:rnrn cvs [server aborted]: Cannot access /CVSROOT: No such file or directoryrncvs [import aborted]: error reading from serverrnrn 目录没设置<em>错误</em>啊,/CVSRoot是别名rn 我用的是2.0.51版本,因为这样才能让eclipse连接rn 请问有什么解决方案,我用cvsnt,系统win2000rn
gnuradio+usrp平台的研究及多种调制方式的实现
<em>gnuradio</em>+usrp平台的研究及多种调制方式的实现
HTTP请求的全过程
当我们开始在浏览器中输入网址的时候,浏览器其实就已经在智能的匹配可能得 url 了,他会从历史记录,书签等地方,找到已经输入的字符串可能对应的 url,然后给出智能提示,让你可以补全url地址。对于 google的chrome 的浏览器,他甚至会直接从缓存中把网页展示出来,就是说,你还没有按下 enter,页面就出来了。
oracle error find
数据库安装时会产生<em>如下</em>的<em>错误</em> 安装时<em>出现</em>乱码
linux下c语言写的俄罗斯方块
不到500行的代码实现俄罗斯方块,请在<em>linux</em>环境下,先执行<em>make</em>,然后./<em>test</em>运行
make出现错误:*** No rule to make target `'????
在Linux(RedHat 9)下安装一个软件OpenPBS,configure后,在<em>make</em>时<em>出现</em>下面的<em>错误</em>:rn<em>make</em>[4]: *** No rule to <em>make</em> target `', needed by `attr_atomic.o'. Stop.rn不知何解?全部屏幕信息<em>如下</em>,请高手帮忙分析一下,高分相赠。rnrn--------------------------------------------------------------rn<em>make</em>[1]: Entering directory `/work/OpenPBS_2_3_16/doc'rn<em>make</em>[1]: `soelim' is up to date.rn<em>make</em>[1]: Leaving directory `/work/OpenPBS_2_3_16/doc'rnMaking all in srcrn<em>make</em>[1]: Entering directory `/work/OpenPBS_2_3_16/src'rnMaking all in includern<em>make</em>[2]: Entering directory `/work/OpenPBS_2_3_16/src/include'rn<em>make</em>[2]: Leaving directory `/work/OpenPBS_2_3_16/src/include'rnMaking all in librn<em>make</em>[2]: Entering directory `/work/OpenPBS_2_3_16/src/lib'rnMaking all in Libattrrn<em>make</em>[3]: Entering directory `/work/OpenPBS_2_3_16/src/lib/Libattr'rngenerating dependenciesrn<em>make</em>depend-sh: processing ./attr_atomic.crn<em>make</em>depend-sh: processing ./attr_fn_acl.crn<em>make</em>depend-sh: processing ./attr_fn_arst.crn<em>make</em>depend-sh: processing ./attr_fn_b.crn<em>make</em>depend-sh: processing ./attr_fn_c.crn<em>make</em>depend-sh: processing ./attr_fn_hold.crn<em>make</em>depend-sh: processing ./attr_fn_intr.crn<em>make</em>depend-sh: processing ./attr_fn_l.crn<em>make</em>depend-sh: processing ./attr_fn_ll.crn<em>make</em>depend-sh: processing ./attr_fn_resc.crn<em>make</em>depend-sh: processing ./attr_fn_size.crn<em>make</em>depend-sh: processing ./attr_fn_str.crn<em>make</em>depend-sh: processing ./attr_fn_time.crn<em>make</em>depend-sh: processing ./attr_fn_unkn.crn<em>make</em>depend-sh: processing ./attr_func.crn<em>make</em>depend-sh: processing ./attr_node_func.crn<em>make</em>depend-sh: processing ./Long_.crn<em>make</em>depend-sh: processing ./LTostr.crn<em>make</em>depend-sh: processing ./uLTostr.crn<em>make</em>depend-sh: processing ./strToL.crn<em>make</em>depend-sh: processing ./strTouL.crn<em>make</em>[4]: Entering directory `/work/OpenPBS_2_3_16/src/lib/Libattr'rn<em>make</em>[4]: *** No rule to <em>make</em> target `', needed by `attr_atomic.o'. Stop.rn<em>make</em>[4]: Leaving directory `/work/OpenPBS_2_3_16/src/lib/Libattr'rn<em>make</em>[3]: *** [all] Error 2rn<em>make</em>[3]: Leaving directory `/work/OpenPBS_2_3_16/src/lib/Libattr'rn<em>make</em>[2]: *** [all] Error 2rn<em>make</em>[2]: Leaving directory `/work/OpenPBS_2_3_16/src/lib'rn<em>make</em>[1]: *** [all] Error 2rn<em>make</em>[1]: Leaving directory `/work/OpenPBS_2_3_16/src'rn<em>make</em>: *** [all] Error 2rn
linux 进不了了,请求帮助
我装的是7.2,上次我非法关机,结果我现在系统都进不去了,系统提示:ext3文件系统装载不了。我在rescue模式下进入shell命令环境下,发现/etc/mtab中没有装载ext3文件系统的语句。哪位高手知道如何进入<em>linux</em>?
Linux新手请求帮助!
大家好,我是Linux新手,以前常听人说该系统是大型的系统,对其了解更始孤陋寡闻,现在很有兴趣想了解一下,但是从开始就不知道怎么去做.rn1、不知道该从哪里下载Linux操作系统rn2、下载的版本对于初学者来说哪一个版本适合rn3、我现在的电脑安装是WIN2003系统,我想再安装一个Linux系统,不知道怎么安装双系统(即安装环境和条件)rn4、请大家<em>帮助</em>提供一些适合初学者学习的资料参考rnrn在此谢谢<em>帮助</em>我的所有兄弟姐妹~~
matlab2014a打包错误,Test checkout of feature 'Compiler' failed
matlab2014a打包<em>错误</em>,Test checkout of feature 'Compiler' failed;这个问题的关键在于之前的文件安装有问题,所以需要将一些文件进行替换,替换完成便可以完美使用。本代码并非自己所写,看应该有人需要,因为直接送给大家。
linux下的i2c-test
<em>linux</em>下的i2c测试程序,仅作参考之用。
出现编译错误!!!请求帮助!!
triangle fatal error LNK1201: 写入程序数据库“c:\Documents and Settings\luanhx03\My Documents\Visual Studio Projects\triangle\Debug\triangle.pdb”时出错;请检查是否是磁盘空间不足、路径无效或权限不够rn这个<em>错误</em>怎么改正阿?
Linux的出错
Linux 的<em>系统安装</em><em>过程</em>中有的时候容易出错,所以把小的<em>错误</em>归类了一下!
VCS不能启动解决办法--VCS ERROR V-16-1-10600 Cannot connect to VCS engine
VCS双机启动的时候可能<em>出现</em><em>如下</em><em>错误</em>:VCS ERROR V-16-1-10600 Cannot connect to VCS engine 该文档是我在解决该<em>错误</em>的方法,希望能<em>帮助</em>到有需要的朋友!
c++testlinux环境的使用
c++<em>test</em>在<em>linux</em>环境的使用;详细步骤,很好的教程
错误一堆堆,请求帮助
本来不喜欢作伸手党的,但是这些<em>错误</em>是在是找不到原因.rn网上找了找 也没啥答案.rn应该都是些语法<em>错误</em>,请帮忙改正一下吧.rnrn[color=#FF0000]net.h[/color]rn#ifndef NET_Hrn#define NET_Hrn#include rn#include rn#include rn#include rn#include rn#include rn#include rnrnclass cThreadPoll:public QThreadrnrn //Q_OBJECTrnrnpublic:rn cThreadPoll(cServer *oSerSck)rn rn sck = oSerSck->nextPendingConnection();rn this->start();rn rnprivate:rn QTcpSocket *sck;rn void run()rn rn while(1)rn rn std::cout << "thread is running!!" << std::endl;rn this->sleep(1);rn rn rn;rnrnclass cServer:public QObject,QTcpServerrnrn Q_OBJECTrnrnpublic:rn cServer(int port, int max_num)rn rn setMaxPendingConnections(max_num);rn if(!listen(QHostAddress::Any, port))rn std::cout << "端口:"<< port << "开始监听失败" << std::endl;rn elsern std::cout << "开始监听"<< serverAddress().toString().toStdString()rn << " 端口:"<< portrn << "的TCP连接,最大可响应连接:" << max_numrn << std::endl;rnrn this->connect(this, SIGNAL(newConnection()), this, SLOT(acpt_connection()));rn rn ~cServer()rnprivate slots:rn void acpt_connection()rn rn new cThreadPoll(this);rn rn;rnrn#endif // NET_Hrnrnrn[color=#FF0000]main.cpp[/color]rnrn#include rn#include "net.h"rnrnint main(int argc, char *argv[])rnrn QCoreApplication a(argc, argv);rn cServer aa(52302,100);rn return a.exec();rnrnrn
不明错误 请求帮助
Struts Problem Report rnStruts has detected an unhandled exception: rnrnMessages: rnFile: com/qtoc/base/action/master/unit/SpUnitTypeManageAction.java rnLine number: 84 rnrnrn-------------------------------------------------------------------------------- rnrnStacktraces rnjava.lang.NullPointerException rn com.qtoc.base.action.master.unit.SpUnitTypeManageAction.editUI(SpUnitTypeManageAction.java:84) rn sun.reflect.NativeMethodAccessorImpl.invoke0(Native Method) rn sun.reflect.NativeMethodAccessorImpl.invoke(NativeMethodAccessorImpl.java:39) rn sun.reflect.DelegatingMethodAccessorImpl.invoke(DelegatingMethodAccessorImpl.java:25) rn java.lang.reflect.Method.invoke(Method.java:597) rn com.opensymphony.xwork2.DefaultActionInvocation.invokeAction(DefaultActionInvocation.java:441) rn com.opensymphony.xwork2.DefaultActionInvocation.invokeActionOnly(DefaultActionInvocation.java:280) rn com.opensymphony.xwork2.DefaultActionInvocation.invoke(DefaultActionInvocation.java:243) rn com.opensymphony.xwork2.interceptor.DefaultWorkflowInterceptor.doIntercept(DefaultWorkflowInterceptor.java:165) rn com.opensymphony.xwork2.interceptor.MethodFilterInterceptor.intercept(MethodFilterInterceptor.java:87) rn com.opensymphony.xwork2.DefaultActionInvocation.invoke(DefaultActionInvocation.java:237) rn com.opensymphony.xwork2.validator.ValidationInterceptor.doIntercept(ValidationInterceptor.java:252) rn org.apache.struts2.interceptor.validation.AnnotationValidationInterceptor.doIntercept(AnnotationValidationInterceptor.java:68) rn com.opensymphony.xwork2.interceptor.MethodFilterInterceptor.intercept(MethodFilterInterceptor.java:87) rn com.opensymphony.xwork2.DefaultActionInvocation.invoke(DefaultActionInvocation.java:237) rn com.opensymphony.xwork2.interceptor.ConversionErrorInterceptor.intercept(ConversionErrorInterceptor.java:122) rn com.opensymphony.xwork2.DefaultActionInvocation.invoke(DefaultActionInvocation.java:237) rn com.opensymphony.xwork2.interceptor.ParametersInterceptor.doIntercept(ParametersInterceptor.java:195) rn com.opensymphony.xwork2.interceptor.MethodFilterInterceptor.intercept(MethodFilterInterceptor.java:87) rn com.opensymphony.xwork2.DefaultActionInvocation.invoke(DefaultActionInvocation.java:237) rn com.opensymphony.xwork2.interceptor.ParametersInterceptor.doIntercept(ParametersInterceptor.java:195) rn com.opensymphony.xwork2.interceptor.MethodFilterInterceptor.intercept(MethodFilterInterceptor.java:87) rn com.opensymphony.xwork2.DefaultActionInvocation.invoke(DefaultActionInvocation.java:237) rn com.opensymphony.xwork2.interceptor.StaticParametersInterceptor.intercept(StaticParametersInterceptor.java:179) rn com.opensymphony.xwork2.DefaultActionInvocation.invoke(DefaultActionInvocation.java:237) rn org.apache.struts2.interceptor.MultiselectInterceptor.intercept(MultiselectInterceptor.java:75) rn com.opensymphony.xwork2.DefaultActionInvocation.invoke(DefaultActionInvocation.java:237) rn org.apache.struts2.interceptor.CheckboxInterceptor.intercept(CheckboxInterceptor.java:94) rn com.opensymphony.xwork2.DefaultActionInvocation.invoke(DefaultActionInvocation.java:237) rn org.apache.struts2.interceptor.FileUploadInterceptor.intercept(FileUploadInterceptor.java:235) rn com.opensymphony.xwork2.DefaultActionInvocation.invoke(DefaultActionInvocation.java:237) rn com.opensymphony.xwork2.interceptor.ModelDrivenInterceptor.intercept(ModelDrivenInterceptor.java:89) rn com.opensymphony.xwork2.DefaultActionInvocation.invoke(DefaultActionInvocation.java:237) rn com.opensymphony.xwork2.interceptor.ScopedModelDrivenInterceptor.intercept(ScopedModelDrivenInterceptor.java:130) rn com.opensymphony.xwork2.DefaultActionInvocation.invoke(DefaultActionInvocation.java:237) rn org.apache.struts2.interceptor.debugging.DebuggingInterceptor.intercept(DebuggingInterceptor.java:267) rn com.opensymphony.xwork2.DefaultActionInvocation.invoke(DefaultActionInvocation.java:237) rn com.opensymphony.xwork2.interceptor.ChainingInterceptor.intercept(ChainingInterceptor.java:126) rn com.opensymphony.xwork2.DefaultActionInvocation.invoke(DefaultActionInvocation.java:237) rn com.opensymphony.xwork2.interceptor.PrepareInterceptor.doIntercept(PrepareInterceptor.java:138) rn com.opensymphony.xwork2.interceptor.MethodFilterInterceptor.intercept(MethodFilterInterceptor.java:87) rn com.opensymphony.xwork2.DefaultActionInvocation.invoke(DefaultActionInvocation.java:237) rn com.opensymphony.xwork2.interceptor.I18nInterceptor.intercept(I18nInterceptor.java:165) rn com.opensymphony.xwork2.DefaultActionInvocation.invoke(DefaultActionInvocation.java:237) rn org.apache.struts2.interceptor.ServletConfigInterceptor.intercept(ServletConfigInterceptor.java:164) rn com.opensymphony.xwork2.DefaultActionInvocation.invoke(DefaultActionInvocation.java:237) rn com.opensymphony.xwork2.interceptor.AliasInterceptor.intercept(AliasInterceptor.java:179) rn com.opensymphony.xwork2.DefaultActionInvocation.invoke(DefaultActionInvocation.java:237) rn com.opensymphony.xwork2.interceptor.ExceptionMappingInterceptor.intercept(ExceptionMappingInterceptor.java:176) rn com.opensymphony.xwork2.DefaultActionInvocation.invoke(DefaultActionInvocation.java:237) rn org.apache.struts2.impl.StrutsActionProxy.execute(StrutsActionProxy.java:52) rn org.apache.struts2.dispatcher.Dispatcher.serviceAction(Dispatcher.java:488) rn org.apache.struts2.dispatcher.ng.ExecuteOperations.executeAction(ExecuteOperations.java:77) rn org.apache.struts2.dispatcher.ng.filter.StrutsPrepareAndExecuteFilter.doFilter(StrutsPrepareAndExecuteFilter.java:91) rn org.apache.catalina.core.ApplicationFilterChain.internalDoFilter(ApplicationFilterChain.java:235) rn org.apache.catalina.core.ApplicationFilterChain.doFilter(ApplicationFilterChain.java:206) rn org.springframework.web.filter.CharacterEncodingFilter.doFilterInternal(CharacterEncodingFilter.java:88) rn org.springframework.web.filter.OncePerRequestFilter.doFilter(OncePerRequestFilter.java:76) rn org.apache.catalina.core.ApplicationFilterChain.internalDoFilter(ApplicationFilterChain.java:235) rn org.apache.catalina.core.ApplicationFilterChain.doFilter(ApplicationFilterChain.java:206) rn org.apache.catalina.core.StandardWrapperValve.invoke(StandardWrapperValve.java:233) rn org.apache.catalina.core.StandardContextValve.invoke(StandardContextValve.java:191) rn org.apache.catalina.core.StandardHostValve.invoke(StandardHostValve.java:127) rn org.apache.catalina.valves.ErrorReportValve.invoke(ErrorReportValve.java:102) rn org.apache.catalina.core.StandardEngineValve.invoke(StandardEngineValve.java:109) rn org.apache.catalina.connector.CoyoteAdapter.service(CoyoteAdapter.java:298) rn org.apache.coyote.http11.Http11Processor.process(Http11Processor.java:852) rn org.apache.coyote.http11.Http11Protocol$Http11ConnectionHandler.process(Http11Protocol.java:588) rn org.apache.tomcat.util.net.JIoEndpoint$Worker.run(JIoEndpoint.java:489) rn java.lang.Thread.run(Thread.java:619) rn rnrn-------------------------------------------------------------------------------- rnrnYou are seeing this page because development mode is enabled. Development mode, or devMode, enables extra debugging behaviors and reports to assist developers. To disable this mode, set: rnrn struts.devMode=false rnrnin your WEB-INF/classes/struts.properties file. rn———————————————————————————————— rn这是调用的方法 rnpublic String editUI() throws Exception rnSpUnitType spUnitType = spUnitTypeService.find(getCode()); rnthis.setCode(spUnitType.getCode()); rnthis.setNameEnglish(spUnitType.getNameEnglish()); rnthis.setNameChinese(spUnitType.getNameChinese()); rnthis.setShortName(spUnitType.getShortName()); rnthis.setSpValidStatusId(spUnitType.getSpValidStatusId()); rnthis.setDeleteFlag(spUnitType.getDeleteFlag()); rnthis.setCreator(spUnitType.getCreator()); rnthis.setCreateDate(spUnitType.getCreateDate()); rnreturn SUCCESS; rn rn
导入错误,请求帮助!
消息rn<em>错误</em> 0xc02020a1: 数据流任务: 数据转换失败。列“纳税人中文名称”的数据转换返回状态值 4 和状态文本“文本被截断,或者一个或多个字符在目标代码页中没有匹配项。”。rn (SQL Server 导入和导出向导)rn rn<em>错误</em> 0xc020902a: 数据流任务: “输出列“纳税人中文名称”(14)”由于发生截断而失败,而且针对“输出列“纳税人中文名称”(14)”的截断行处理设置指定截断时出错。在指定组件的指定对象上<em>出现</em>截断<em>错误</em>。rn (SQL Server 导入和导出向导)rn rn<em>错误</em> 0xc0202092: 数据流任务: 处理文件“K:\2008年纳税鉴定(企业).txt”的数据行 1247 时出错。rn (SQL Server 导入和导出向导)rn rn<em>错误</em> 0xc0047038: 数据流任务: SSIS <em>错误</em>代码 DTS_E_PRIMEOUTPUTFAILED。组件“源 - 2008年纳税鉴定(企业)_txt”(1) 的 PrimeOutput 方法返回了<em>错误</em>代码 0xC0202092。管道引擎调用 PrimeOutput() 时该组件返回了一个失败代码。虽然该失败代码只与该组件有关,但这个<em>错误</em>是致命的,管道已停止执行。可能在此之前已经发出<em>错误</em>消息,提供了有关失败的详细信息。rn (SQL Server 导入和导出向导)rn rn<em>错误</em> 0xc0047021: 数据流任务: SSIS <em>错误</em>代码 DTS_E_THREADFAILED。 线程“SourceThread0”已退出,<em>错误</em>代码为 0xC0047038。可能在此之前已经发出<em>错误</em>消息,提供了有关线程退出原因的详细信息。rn (SQL Server 导入和导出向导)rn rn<em>错误</em> 0xc0047039: 数据流任务: SSIS <em>错误</em>代码 DTS_E_THREADCANCELLED。线程“WorkThread0”接收到关闭信号,正在终止。原因是用户<em>请求</em>了关闭,或另一线程中的<em>错误</em>导致该管道关闭。可能在此之前已经发出<em>错误</em>消息,提供了有关取消线程的原因的详细信息。rn (SQL Server 导入和导出向导)rn rn<em>错误</em> 0xc0047021: 数据流任务: SSIS <em>错误</em>代码 DTS_E_THREADFAILED。 线程“WorkThread0”已退出,<em>错误</em>代码为 0xC0047039。可能在此之前已经发出<em>错误</em>消息,提供了有关线程退出原因的详细信息。rn (SQL Server 导入和导出向导)rnrn这个<em>错误</em>是怎么回事啊,SP2补丁已打!rn
请求帮助!反序列化错误
一个继承DATATABLE的类反序列化时错,提示:未找到反序列化类型对象的构造函数。rn
vs.net错误请求帮助!!!!
我的vs.net调试不了。net程序,但是我的iis可以支持aspx,真郁闷,请高手<em>帮助</em>!rn编译<em>错误</em> rn说明: 在编译向该<em>请求</em>提供服务所需资源的<em>过程</em>中<em>出现</em><em>错误</em>。请检查下列特定<em>错误</em>详细信息并适当地修改源代码。 rnrn编译器<em>错误</em>信息: CS1595: 已在多处定义“System.Runtime.CompilerServices.CompilerGlobalScopeAttribute”;使用“C:\winnt\microsoft.net\framework\v1.0.3705\mscorlib.dll”中的定义rnrn源<em>错误</em>:rnrn rnrn行 25: rn行 26: rn行 27: [System.Runtime.CompilerServices.CompilerGlobalScopeAttribute()]rn行 28: public class Global_asax : WebTest.Global rn行 29: rn rn
数据更新错误,请求帮助
在sql server存放数据用以下代码 rnstrsql="select * from 新闻表 order by 新闻编号"rnrs.open strsql,cn,3,3rndim idrnid=rs("新闻编号")rnid=id+1rnrs.AddNewrnrs("新闻编号")=idrnrs.updatarnrs.closern<em>出现</em>了以下<em>错误</em>!rnADODB.Recordset <em>错误</em> '800a0cb3' rnrn当前记录集不支持更新。这可能是提供程序的限制,也可能是选定锁定类型的限制。 rnrn/news/mysavearticle.asp,行33 rn
linux 下安装mysql出现如下错误
……rnledir/mysqld --basedir=$MY_BASEDIR_VERSION --datadir=$DATADIR --skip-lockin rn> g "$@" >>$err_log 2>&1> rn……rnmysqld daemon endedrn请都高手是怎么一回事呢?rn
redis-tcl8.6.7
在安装redis时,若编译<em>过程</em>中报错 You need tcl 8.5 or newer in order to run the Redis <em>test</em> <em>make</em>: * [<em>test</em>] <em>错误</em> 1 此时需要安装tcl
ghost系统安装iis出现错误
因为没有光盘,在网上下载了iis5.1包.rn安装时,在浏览第二个文件的时候,总是出来:rn 正常运行windows所需的文件已被替换成无法识别的版本。要保持系统的稳定,windows必须还原这些文件的原有版本。rnrn 现在插入您的windows XP professinal Service Pack 2rnrn 点击"取消",继续安装完成.可是iis的默认首页打不开.rn请问这怎么解决????rnrn
如何在Gnuradio中创建模块完整版
教你如何开发一个GNU Radio模块,How to write a block,中英文参考资料整合。
程序设计基础.
程序调试是自己寻找和排错的<em>过程</em> 调试<em>过程</em>包括三个步骤:发现<em>错误</em>、分离<em>错误</em>、校正<em>错误</em>,这一<em>过程</em>将贯穿于从编程<em>阶段</em>到运行<em>阶段</em> 程序中<em>出现</em>的<em>错误</em>可以分为三类:编译<em>错误</em>、运行<em>错误</em>和逻辑<em>错误</em>。 编译<em>错误</em>是由结构不正确的代码造成的 运行<em>错误</em>是因一条语句试图执行一个不可能执行的操作 当程序没有按预定的方式运行则发生了逻辑<em>错误</em>
linux make命令
关于<em>linux</em>编程的<em>make</em>命令,手把手教你
nmap 5.21 for linux
nmap 5.21 for <em>linux</em> <em>linux</em>下的端口扫描工具 这个是需要编译版本 按照<em>如下</em>步骤编译安装 ./configure <em>make</em> <em>make</em> install
阶段小测试-机试题答案RegistAndLogin.rar
北大青鸟ACCP6.0 S1数据库考试答案及试题
foxpro 中文帮助
VFP中文<em>帮助</em>,修正了以前的一些<em>错误</em>。如<em>出现</em><em>错误</em>后,单击<em>帮助</em>可定位到<em>帮助</em>。
TCP测试工具(TCP Test Tool)
常用的TCP_IP,UDP_IP测试软件,很好用!
整合框架错误解决方案
整合框架<em>错误</em>大多是包的冲突、多包、少包等情况,然后<em>出现</em>不同的<em>错误</em>,现在把一般常<em>出现</em>的<em>错误</em>总结<em>如下</em>
安装liunx rpc服务是在make步骤出现错误 如下
[code=text]rm -f rstat.hrnrpcgen -h -o rstat.h rstat.xrn<em>make</em> all-amrn<em>make</em>[1]: Entering directory `/usr/rpc.rstatd-4.0.1'rnif gcc -DHAVE_CONFIG_H -I. -I. -I. -g -O2 -MT rup.o -MD -MP -MF ".deps/rup.Tpo" -c -o rup.o rup.c; \rn then mv -f ".deps/rup.Tpo" ".deps/rup.Po"; else rm -f ".deps/rup.Tpo"; exit 1; firnrn/usr/rpc.rstatd-4.0.1/rup.c:226: undefined reference to `xdr_void'rn/usr/rpc.rstatd-4.0.1/rup.c:226: undefined reference to `clnt_broadcast'rnrup.o: In function `broadcast_v5':rn/usr/rpc.rstatd-4.0.1/rup.c:212: undefined reference to `xdr_void'rn/usr/rpc.rstatd-4.0.1/rup.c:212: undefined reference to `clnt_broadcast'rnrup.o: In function `pointopoint_v3':rn/usr/rpc.rstatd-4.0.1/rup.c:286: undefined reference to `clntudp_create'rn/usr/rpc.rstatd-4.0.1/rup.c:291: undefined reference to `xdr_void'rnrup.o: In function `pointopoint_v5':rn/usr/rpc.rstatd-4.0.1/rup.c:250: undefined reference to `clntudp_create'rn/usr/rpc.rstatd-4.0.1/rup.c:256: undefined reference to `xdr_void'rnrup.o: In function `main':rn/usr/rpc.rstatd-4.0.1/rup.c:358: undefined reference to `clnt_pcreateerror'rnrstat_xdr.o: In function `xdr_rstat_timeval':rn/usr/rpc.rstatd-4.0.1/rstat_xdr.c:15: undefined reference to `xdr_u_int'rn/usr/rpc.rstatd-4.0.1/rstat_xdr.c:17: undefined reference to `xdr_u_int'rnrstat_xdr.o: In function `xdr_stats':rn/usr/rpc.rstatd-4.0.1/rstat_xdr.c:945: undefined reference to `xdr_int'rn/usr/rpc.rstatd-4.0.1/rstat_xdr.c:945: undefined reference to `xdr_vector'rn/usr/rpc.rstatd-4.0.1/rstat_xdr.c:948: undefined reference to `xdr_int'rn/usr/rpc.rstatd-4.0.1/rstat_xdr.c:948: undefined reference to `xdr_vector'rn/usr/rpc.rstatd-4.0.1/rstat_xdr.c:951: undefined reference to `xdr_u_int'rn/usr/rpc.rstatd-4.0.1/rstat_xdr.c:953: undefined reference to `xdr_u_int'rn/usr/rpc.rstatd-4.0.1/rstat_xdr.c:955: undefined reference to `xdr_u_int'rn/usr/rpc.rstatd-4.0.1/rstat_xdr.c:957: undefined reference to `xdr_u_int'rn/usr/rpc.rstatd-4.0.1/rstat_xdr.c:959: undefined reference to `xdr_u_int'rn/usr/rpc.rstatd-4.0.1/rstat_xdr.c:961: undefined reference to `xdr_int'rn/usr/rpc.rstatd-4.0.1/rstat_xdr.c:963: undefined reference to `xdr_int'rn/usr/rpc.rstatd-4.0.1/rstat_xdr.c:965: undefined reference to `xdr_int'rn/usr/rpc.rstatd-4.0.1/rstat_xdr.c:967: undefined reference to `xdr_int'rn/usr/rpc.rstatd-4.0.1/rstat_xdr.c:969: undefined reference to `xdr_int'rnrstat_xdr.o:/usr/rpc.rstatd-4.0.1/rstat_xdr.c:888: more undefined references to `xdr_int' followrnrstat_xdr.o: In function `xdr_statsswtch':rn/usr/rpc.rstatd-4.0.1/rstat_xdr.c:784: undefined reference to `xdr_vector'rn/usr/rpc.rstatd-4.0.1/rstat_xdr.c:787: undefined reference to `xdr_int'rn/usr/rpc.rstatd-4.0.1/rstat_xdr.c:787: undefined reference to `xdr_vector'rn/usr/rpc.rstatd-4.0.1/rstat_xdr.c:790: undefined reference to `xdr_u_int'rn/usr/rpc.rstatd-4.0.1/rstat_xdr.c:792: undefined reference to `xdr_u_int'rn/usr/rpc.rstatd-4.0.1/rstat_xdr.c:794: undefined reference to `xdr_u_int'rn/usr/rpc.rstatd-4.0.1/rstat_xdr.c:796: undefined reference to `xdr_u_int'rn/usr/rpc.rstatd-4.0.1/rstat_xdr.c:798: undefined reference to `xdr_u_int'rn/usr/rpc.rstatd-4.0.1/rstat_xdr.c:800: undefined reference to `xdr_int'rn/usr/rpc.rstatd-4.0.1/rstat_xdr.c:802: undefined reference to `xdr_int'rn/usr/rpc.rstatd-4.0.1/rstat_xdr.c:804: undefined reference to `xdr_int'rn/usr/rpc.rstatd-4.0.1/rstat_xdr.c:806: undefined reference to `xdr_int'rn/usr/rpc.rstatd-4.0.1/rstat_xdr.c:808: undefined reference to `xdr_u_int'rn/usr/rpc.rstatd-4.0.1/rstat_xdr.c:810: undefined reference to `xdr_u_int'rn/usr/rpc.rstatd-4.0.1/rstat_xdr.c:810: undefined reference to `xdr_vector'rn/usr/rpc.rstatd-4.0.1/rstat_xdr.c:815: undefined reference to `xdr_int'rn/usr/rpc.rstatd-4.0.1/rstat_xdr.c:711: undefined reference to `xdr_int'rnrstat_xdr.o: In function `xdr_statstime':rn/usr/rpc.rstatd-4.0.1/rstat_xdr.c:589: undefined reference to `xdr_int'rn/usr/rpc.rstatd-4.0.1/rstat_xdr.c:589: undefined reference to `xdr_vector'rn/usr/rpc.rstatd-4.0.1/rstat_xdr.c:592: undefined reference to `xdr_int'rn/usr/rpc.rstatd-4.0.1/rstat_xdr.c:592: undefined reference to `xdr_vector'rn/usr/rpc.rstatd-4.0.1/rstat_xdr.c:595: undefined reference to `xdr_u_int'rn/usr/rpc.rstatd-4.0.1/rstat_xdr.c:597: undefined reference to `xdr_u_int'rn/usr/rpc.rstatd-4.0.1/rstat_xdr.c:599: undefined reference to `xdr_u_int'rn/usr/rpc.rstatd-4.0.1/rstat_xdr.c:601: undefined reference to `xdr_u_int'rn/usr/rpc.rstatd-4.0.1/rstat_xdr.c:603: undefined reference to `xdr_u_int'rn/usr/rpc.rstatd-4.0.1/rstat_xdr.c:605: undefined reference to `xdr_int'rn/usr/rpc.rstatd-4.0.1/rstat_xdr.c:607: undefined reference to `xdr_int'rn/usr/rpc.rstatd-4.0.1/rstat_xdr.c:609: undefined reference to `xdr_int'rn/usr/rpc.rstatd-4.0.1/rstat_xdr.c:611: undefined reference to `xdr_int'rn/usr/rpc.rstatd-4.0.1/rstat_xdr.c:613: undefined reference to `xdr_u_int'rn/usr/rpc.rstatd-4.0.1/rstat_xdr.c:615: undefined reference to `xdr_int'rn/usr/rpc.rstatd-4.0.1/rstat_xdr.c:615: undefined reference to `xdr_vector'rn/usr/rpc.rstatd-4.0.1/rstat_xdr.c:622: undefined reference to `xdr_int'rn/usr/rpc.rstatd-4.0.1/rstat_xdr.c:514: undefined reference to `xdr_int'rnrstat_xdr.o: In function `xdr_statsvar':rn/usr/rpc.rstatd-4.0.1/rstat_xdr.c:390: undefined reference to `xdr_int'rn/usr/rpc.rstatd-4.0.1/rstat_xdr.c:390: undefined reference to `xdr_vector'rn/usr/rpc.rstatd-4.0.1/rstat_xdr.c:393: undefined reference to `xdr_int'rn/usr/rpc.rstatd-4.0.1/rstat_xdr.c:393: undefined reference to `xdr_vector'rn/usr/rpc.rstatd-4.0.1/rstat_xdr.c:396: undefined reference to `xdr_u_int'rn/usr/rpc.rstatd-4.0.1/rstat_xdr.c:398: undefined reference to `xdr_u_int'rn/usr/rpc.rstatd-4.0.1/rstat_xdr.c:400: undefined reference to `xdr_u_int'rn/usr/rpc.rstatd-4.0.1/rstat_xdr.c:402: undefined reference to `xdr_u_int'rn/usr/rpc.rstatd-4.0.1/rstat_xdr.c:404: undefined reference to `xdr_u_int'rn/usr/rpc.rstatd-4.0.1/rstat_xdr.c:406: undefined reference to `xdr_int'rn/usr/rpc.rstatd-4.0.1/rstat_xdr.c:408: undefined reference to `xdr_int'rn/usr/rpc.rstatd-4.0.1/rstat_xdr.c:410: undefined reference to `xdr_int'rn/usr/rpc.rstatd-4.0.1/rstat_xdr.c:412: undefined reference to `xdr_int'rn/usr/rpc.rstatd-4.0.1/rstat_xdr.c:414: undefined reference to `xdr_int'rn/usr/rpc.rstatd-4.0.1/rstat_xdr.c:416: undefined reference to `xdr_u_int'rn/usr/rpc.rstatd-4.0.1/rstat_xdr.c:418: undefined reference to `xdr_long'rn/usr/rpc.rstatd-4.0.1/rstat_xdr.c:418: undefined reference to `xdr_vector'rn/usr/rpc.rstatd-4.0.1/rstat_xdr.c:314: undefined reference to `xdr_int'rnrstat_xdr.o: In function `xdr_statsusers':rn/usr/rpc.rstatd-4.0.1/rstat_xdr.c:187: undefined reference to `xdr_int'rn/usr/rpc.rstatd-4.0.1/rstat_xdr.c:187: undefined reference to `xdr_vector'rn/usr/rpc.rstatd-4.0.1/rstat_xdr.c:190: undefined reference to `xdr_int'rn/usr/rpc.rstatd-4.0.1/rstat_xdr.c:190: undefined reference to `xdr_vector'rn/usr/rpc.rstatd-4.0.1/rstat_xdr.c:193: undefined reference to `xdr_u_int'rn/usr/rpc.rstatd-4.0.1/rstat_xdr.c:195: undefined reference to `xdr_u_int'rn/usr/rpc.rstatd-4.0.1/rstat_xdr.c:197: undefined reference to `xdr_u_int'rn/usr/rpc.rstatd-4.0.1/rstat_xdr.c:199: undefined reference to `xdr_u_int'rn/usr/rpc.rstatd-4.0.1/rstat_xdr.c:201: undefined reference to `xdr_u_int'rn/usr/rpc.rstatd-4.0.1/rstat_xdr.c:203: undefined reference to `xdr_int'rn/usr/rpc.rstatd-4.0.1/rstat_xdr.c:205: undefined reference to `xdr_int'rn/usr/rpc.rstatd-4.0.1/rstat_xdr.c:207: undefined reference to `xdr_int'rn/usr/rpc.rstatd-4.0.1/rstat_xdr.c:209: undefined reference to `xdr_int'rn/usr/rpc.rstatd-4.0.1/rstat_xdr.c:211: undefined reference to `xdr_u_int'rn/usr/rpc.rstatd-4.0.1/rstat_xdr.c:213: undefined reference to `xdr_int'rn/usr/rpc.rstatd-4.0.1/rstat_xdr.c:213: undefined reference to `xdr_vector'rn/usr/rpc.rstatd-4.0.1/rstat_xdr.c:220: undefined reference to `xdr_int'rn/usr/rpc.rstatd-4.0.1/rstat_xdr.c:222: undefined reference to `xdr_u_int'rn/usr/rpc.rstatd-4.0.1/rstat_xdr.c:110: undefined reference to `xdr_int'rnrstat_clnt.o: In function `rstatproc_havedisk_5':rn/usr/rpc.rstatd-4.0.1/rstat_clnt.c:35: undefined reference to `xdr_u_int'rn/usr/rpc.rstatd-4.0.1/rstat_clnt.c:35: undefined reference to `xdr_void'rn/usr/rpc.rstatd-4.0.1/rstat_clnt.c:125: undefined reference to `xdr_u_int'rn/usr/rpc.rstatd-4.0.1/rstat_clnt.c:125: undefined reference to `xdr_void'rnrstat_clnt.o: In function `rstatproc_havedisk_1':rn/usr/rpc.rstatd-4.0.1/rstat_clnt.c:155: undefined reference to `xdr_u_int'rn/usr/rpc.rstatd-4.0.1/rstat_clnt.c:155: undefined reference to `xdr_void'rnrstat_clnt.o: In function `rstatproc_stats_1':rn/usr/rpc.rstatd-4.0.1/rstat_clnt.c:140: undefined reference to `xdr_void'rnrstat_clnt.o: In function `rstatproc_stats_2':rn/usr/rpc.rstatd-4.0.1/rstat_clnt.c:110: undefined reference to `xdr_void'rnrstat_clnt.o: In function `rstatproc_stats_3':rn/usr/rpc.rstatd-4.0.1/rstat_clnt.c:80: undefined reference to `xdr_void'rnrstat_clnt.o: In function `rstatproc_stats_4':rn/usr/rpc.rstatd-4.0.1/rstat_clnt.c:50: undefined reference to `xdr_void'rnrstat_clnt.o:/usr/rpc.rstatd-4.0.1/rstat_clnt.c:20: more undefined references to `xdr_void' followrncollect2: ld returned 1 exit statusrn<em>make</em>[1]: *** [rup] Error 1rn<em>make</em>[1]: Leaving directory `/usr/rpc.rstatd-4.0.1'rn<em>make</em>: *** [all] Error 2rn[root@actsapp2 rpc.rstatd-4.0.1]# cat /etc/issuernCentOS release 6.8 (Final)rnKernel \r on an \m[/code]
项目实施各阶段的模板
适用于信息系统集成的项目管理,1、 项目可行性研究(模版) 2、 项目描述(模版) 3、 项目章程(模版) 4、 工作分解结构(WBS)(模版) 5、 项目范围管理(模版) 6、 项目风险管理计划(模版) 7、 项目资源管理计划(模版) 8、 项目预算(模版) 9、 项目质量管理计划(模版) 10、 项目采购管理计划(模版) 11、 项目沟通管理(模版) 12、 项目会议纪要(模版) 13、 项目状态报告(模版) 14、 项目变更控制(模版) 15、 项目配置管理计划(模版)
在安装Git时,Make出现如下错误,怎么解决呢?
<em>make</em>rnGIT_VERSION = 1.6.6rn * new build flags or prefixrn CC fast-import.orn在包含自 builtin.h:6 的文件中,rn 从 fast-import.c:147:rncache.h:17:18: <em>错误</em>:zlib.h:没有那个文件或目录rnIn file included from builtin.h:6,rn from fast-import.c:147:rncache.h:22: <em>错误</em>:expected ‘)’ before ‘strm’rncache.h:23: <em>错误</em>:expected ‘)’ before ‘strm’rncache.h:24: <em>错误</em>:expected ‘)’ before ‘strm’rnfast-import.c:284: <em>错误</em>:‘Z_DEFAULT_COMPRESSION’ 未声明 (不在函数内)rnfast-import.c: In function ‘store_object’:rnfast-import.c:1040: <em>错误</em>:‘z_stream’ 未声明 (在此函数内第一次使用)rnfast-import.c:1040: <em>错误</em>:(即使在一个函数内多次<em>出现</em>,每个未声明的标识符在其rnfast-import.c:1040: <em>错误</em>:所在的函数内只报告一次。)rnfast-import.c:1040: <em>错误</em>:expected ‘;’ before ‘s’rnfast-import.c:1076: <em>错误</em>:‘s’ 未声明 (在此函数内第一次使用)rnfast-import.c:1087: <em>错误</em>:‘Z_FINISH’ 未声明 (在此函数内第一次使用)rnfast-import.c:1087: <em>错误</em>:‘Z_OK’ 未声明 (在此函数内第一次使用)rnfast-import.c: In function ‘git_pack_config’:rnfast-import.c:2470: <em>错误</em>:‘Z_BEST_COMPRESSION’ 未声明 (在此函数内第一次使用)rn<em>make</em>: *** [fast-import.o] <em>错误</em> 1rn
poco生成ARM格式 make过程出现错误!!!
一、根据网上的教程,首先要生成STLport库的ARM格式rn1. 确保ARM编译成功安装,并配置好环境变量。 rn2. 解压STLport-5.2.1.tar.gz压缩包 rn3. 进入STLport-5.2.1目录,执行./configure --target=arm-<em>linux</em> rn4. 修改stlport/stl/_cstdlib.h rn 搜索宏定义 _STLP_NO_VENDOR_STDLIB_L 共2处,将这2处下的if !defined(__sun)分别修改为 rn 1处 #if !defined(__sun) && !defined(__arm__) && !defined(__sh__) rn 2处 #if !defined (__sun) && !defined(__arm__) && !defined(__mips__) && !defined(__mipsel__) && !defined(__sh__) rn5. 回到STLport-5.2.1目录, <em>make</em>下就大功告成。rn二、 rn1. 确保ARM编译成功安装,并配置好环境变量。 rn2. 解压Poco压缩包 rn3. 进入Poco目录,执行./configure --no-<em>test</em>s --omit=NetSSL_OpenSSL,Crypto,Data --config=ARM-Linux rn4. 编辑build/config/ARM-Linux,修改一下配置(STLport编译后执行<em>make</em> install) rn STLPORT_INCLUDE = /usr/local/include/stlport rn STLPORT_LIB = /usr/local/librn OPENSSL_INCLUDE = /usr/local/arm/4.3.2/include rn OPENSSL_LIB = /usr/local/arm/4.3.2/lib rn5. 由于Poco for ARM需要libstlport_arm-<em>linux</em>-gcc.so这个库,实际就是libstlport.so,故需要做个软连接 rn6. 由于stlport的ostream不支持long double类型,故需要修改Foundation/src/Format.cpp,修改处是216和217,将long double改为double. rn7. 以上都是根据网上配置成功的案例设置的。rn但是我在<em>make</em><em>过程</em>中<em>出现</em><em>错误</em>:rnIn file included from src/FPEnvironment_DUMMY.cpp:37,rn from src/FPEnvironment.cpp:42:rninclude/Poco/FPEnvironment_DUMMY.h: In static member function 'static bool Poco::FPEnvironmentImpl::isInfiniteImpl(float)':rninclude/Poco/FPEnvironment_DUMMY.h:98: error: 'isinf' is not a member of 'stlp_std'rninclude/Poco/FPEnvironment_DUMMY.h: In static member function 'static bool Poco::FPEnvironmentImpl::isInfiniteImpl(double)':rninclude/Poco/FPEnvironment_DUMMY.h:104: error: 'isinf' is not a member of 'stlp_std'rninclude/Poco/FPEnvironment_DUMMY.h: In static member function 'static bool Poco::FPEnvironmentImpl::isInfiniteImpl(long double)':rninclude/Poco/FPEnvironment_DUMMY.h:110: error: 'isinf' is not a member of 'stlp_std'rninclude/Poco/FPEnvironment_DUMMY.h: In static member function 'static bool Poco::FPEnvironmentImpl::isNaNImpl(float)':rninclude/Poco/FPEnvironment_DUMMY.h:116: error: 'isnan' is not a member of 'stlp_std'rninclude/Poco/FPEnvironment_DUMMY.h: In static member function 'static bool Poco::FPEnvironmentImpl::isNaNImpl(double)':rninclude/Poco/FPEnvironment_DUMMY.h:122: error: 'isnan' is not a member of 'stlp_std'rninclude/Poco/FPEnvironment_DUMMY.h: In static member function 'static bool Poco::FPEnvironmentImpl::isNaNImpl(long double)':rninclude/Poco/FPEnvironment_DUMMY.h:128: error: 'isnan' is not a member of 'stlp_std'rn<em>make</em>[1]: *** [/home/clarion/zhaoyong/poco-1.4.7p1/Foundation/obj/Linux/ARM/debug_shared/FPEnvironment.o] エラー 1rn<em>make</em>: *** [Foundation-libexec] エラー 2rnrn请问大神们 有否遇到过这种问题~~~~~~
GNU Radio 入门V 0.99
<em>gnuradio</em> 入门基础,详细介绍了怎么学习<em>gnuradio</em>
jackson-annotations、jackson-core、jackson-databind
jackson2.9 搭配spring4使用,如果版本不符合,会<em>出现</em>“http<em>请求</em>415<em>错误</em>Unsupported Media Type”<em>错误</em>
gnuradio学习教程
这是一个有关<em>gnuradio</em>开发的小教程,希望对大家有<em>帮助</em>
jackson-all-2.4.2.jar
jackson2.4 搭配spring4.1使用,如果版本不符合,会<em>出现</em>“http<em>请求</em>415<em>错误</em>Unsupported Media Type”<em>错误</em>
SQL_Server_服务无法启动”的解决办法
SQL_Server_2005<em>过程</em><em>出现</em><em>错误</em>“SQL_Server_服务无法启动”的解决办法
关于linux搭建环境make错误
各位大侠请了,小弟在配置cfengine时候,configure通过了,但是<em>make</em>的时候报错,rn<em>错误</em>内容<em>如下</em>,请指点一下rn<em>make</em>[1]: Entering directory `/usr/cfengine-2.2.8/src'rn/bin/bash ../ylwrap cflex.l .c cflex.c -- /bin/bash /usr/cfengine-2.2.8/missing --run flex rngot /usr/cfengine-2\.2\.8/src/rn<em>make</em>[1]: *** [cflex.c] Error 1rn<em>make</em>[1]: Leaving directory `/usr/cfengine-2.2.8/src'rn<em>make</em>: *** [install-recursive] Error 1
gnuradio
实用,广泛,这款硬件和软见结合的,体现了很多优点
文章热词 Linux 卷积神经网络池化过程 神经网络循环请求 Linux视频教程 Linux认证
相关热词 dreamweaver.exe出现配置错误 c++出现cin错误 c#出现错误跳过 android 请求接口错误401 本科阶段学习人工智能 人工智能帮助学习日语
我们是很有底线的