如何解决升级到android studio 3.0后编译报错.dexing.DexArchiveMergerException: Unable to merge

移动开发 > Android [问题点数:50分]
等级
本版专家分:0
结帖率 0%
等级
本版专家分:388
等级
本版专家分:3653
等级
本版专家分:0
等级
本版专家分:0
等级
本版专家分:562
等级
本版专家分:1248
勋章
Blank
技术圈认证(专家版) 博客专家完成年度认证,即可获得
Blank
GitHub 绑定GitHub第三方账户获取
等级
本版专家分:0
等级
本版专家分:0
等级
本版专家分:0
wy2210

等级:

Android studio 3.0 com.android.builder.dexing.DexArchiveMergerException: Unable to merge dex

com.android.builder.dexing.DexArchiveMergerException: Unable to merge dex 错误 build.gradle文件引入资源配置问题 修改前 compile(name: 'guavalib', ext: 'jar') 修改 compile files

升级到Android Studio 3.0 运行项目报错DexArchiveMergerException: Unable to merge 解决汇总

很早就升级到Android studio 3.0 了,但是一直没有升级gradle. 每天运行项目都有提醒, 让我升级gradle, 我点了不再提醒,它还是每天提醒我. 对于一个拥有强迫症的我, 当然不能忍受了, 于是手残的点击了升级. 结局当然...

DexArchiveMergerException: Unable to merge dex

com.android.builder.dexing.DexArchiveMergerException: Unable to merge dex 错误 ,点击如图所示的按钮,右边红框里面是错误提示,说的很情书 是merge的时候出错 看看app的build.gradle里面,导入了...

Android报错集锦之二:Android studio 3.0 com.android.builder.dexing.DexArchiveMergerException: Unable...

当出现 Android studio3.0 com.android.builder.dexing.DexArchiveMergerException: Unable to merge dex 或者 Error:warning: Ignoring InnerClasses attribute for an anonymous inner class,出现这个问题的...

transformDexArchiveWithExternalLibsDexMergerForDebug unable to merge dex 问题

Android studio 从2.3.3升级到3.0,然后gradle也升级了,导致了如下错误: Error:Execution failed for task ':app:transformDexArchiveWithExternalLibsDexMergerForDebug'. > ...

AS报错Unable to merge dex

错误信息:Error:Execution failed for task ':app:...> java.lang.RuntimeException: com.android.builder.dexing.DexArchiveMergerException: Unable to merge dex

AndroidStudio进行Build时出现DexArchiveMergerException异常的解决办法

今天在AndroidStudio中导入了一个项目,编译的时候没有什么问题,但是在执行Rebuild Project 和 Build APK(s)时报错了,提示:Error:Execution failed for task ':app:...gt; java.lang.RuntimeExcept...

Android studio 3.0 com.android.builder.dexing.DexArchiveMergerException: Error while merging dex ar

Android报错集锦之二:Android studio 3.0 com.android.builder.dexing.DexArchiveMergerException: Unable to mer <div class="article-info-box"&...

java.lang.RuntimeException: com.android.builder.dexing.DexArchiveMergerException: Unable to merge de

studio 从原来的2.3.3升级到3.0以后,原来的好好的代码就编译不过了。报Error:Execution failed for task ':app:transformDexArchiveWithExternalLibsDexMergerForDebug'. > java.lang.RuntimeException: ...

Android Studio 3.0 app:transformDexArchiveWithExternalLibsDexMergerForBaiduDebu

Android studio 从2.3.3升级到3.0transformDexArchiveWithExternalLibsDexMergerForDebug unable to merge ...

Android studio 从2.3.3升级到3.0,然后gradle也升级了,导致了如下错误: Error:Execution failed for task ':app:transformDexArchiveWithExternalLibsDexMergerForDebug'. > ...

Unable to merge dex,专治Android Studio各种抽风!

今天在洗一个项目时,报错:Error:Execution failed for task ':app:transform Dex Archive With External Libs Dex Merger For Debug'. > java.lang.Runtime Exception: java.lang.Runtime Exception: ...

问题:com.android.builder.dexing.DexArchiveMergerException: Unable to merge dex

记一个让我头疼了一天的问题,网上搜了搜,解决方案一大堆,但是好像并不适用。下面贴一下错误的log: 我使用的gradle tools版本是3.0.1 * What went wrong: Execution failed for task ':example:...

RuntimeException: com.android.builder.dexing.DexArchiveMergerException: Unable to merge dex解决方法

Android开发过程中都避免不了要集成第三方的项目、集成完之后今天碰到这个令人我非常不开心的transformClassesWithDexForDebug Exception、详细的Log如下: Error:java.lang.RuntimeException: java.lang....

Error:Execution failed for task ':app:transformDexArchiveWithExternalLibsDexMergerForDebug'....

错误: Error:Execution failed for task ‘:app:transformDexArchiveWithExternalLibsDexMergerForDebug’.... 》com.android.builder.dexing.DexArchiveMergerException: Unable to merge dex 原因: 根据stacko

升级到AndroidStudio3.0 之后的遇到问题的处理(新建、方法数限制等)

转载:升级到AndroidStudio3.0 之后的遇到问题的处理(新建、方法数限制等) - 个人文章 - SegmentFault 思否 https://segmentfault.com/a/1190000012063649遇到的新问题:1,新建项目报错Unable to resolve ...

android studio 在run出现“com.android.builder.dexing.DexArchiveMergerException: Unable to merge ...

应该是support包和第三方依赖冲突,在build.grade里面删除掉对support包的依赖

com.android.builder.dexing.DexArchiveMergerException: Unable to merge dex解决

如果您的Studio是3.0.1,并且您的gradle使用的是3.0.1,如下 dependencies { classpath 'com.android.tools.build:gradle:3.0.1' classpath "org.jetbrains.kotlin:kotlin-gradle-plugin:$kotlin_version&...

Error:Execution failed for task ':app:transformDexArchiveWithExternalLibsDexMergerForDebug'.

错误: Error:Execution failed for task ‘:app:transformDexArchiveWithExternalLibsDexMergerForDebug’.... 》com.android.builder.dexing.DexArchiveMergerException: Unable to merge dex 原因: 根据stacko

Android studio问题、错误积累

[Android Studio 日常奇怪问题记录] 之ERROR: Failed to resolve: org.jetbrains.kotlin:kotlin-stdlib-jre7:1.3.21 问题原因: kotlin插件升级到1.2.41时提示kotlin-stdlib-jre7过时 解决办法: 将org....

Error:Execution failed for task ':app:transformDexArchiveWithExternalLibsDex报错

原来的项目可以正常运行的,但升级到AndroidStudio 3.0后就有问题了。APP在Clear时没有报错,但一安装手机上就报错了。 Error:Execution failed for task ':app:...

解决编译错误: com.android.builder.dexing.DexArchiveMergerException: Unable to merge dex

今天下午在编译项目的时候,替换了很多内部开发出来的库的版本信息,然后编译的时候出现一个错误,如下所示: 1.1 问题简单描述 FAILURE: Build failed with an exception. * What went wrong: Execution failed ...

导入项目到android studio中遇到的各种问题

最近学习一下别人的源码,于是在网上下载了各种源码,有17年的16年的等,本来是想直接找一个androidstudio项目,看着这些年份相对13年(Androidstudio问世)比较久远,猜想这些应该是androidstudio项目了吧,可是我...

AndroidStudio 编译中遇到问题总结

1. 问题:运行项目中遇到,Error:Execution failed for task ':app:... com.android.ide.common.process.ProcessException: org.gradle.process.internal.ExecException: Process 'command 'E:\And...

导入融云即时通讯SDK之后老是报错

Android Studio中导入jar包之后,就会一直...> java.lang.RuntimeException: com.android.builder.dexing.DexArchiveMergerException: Unable tomerge dex。有哪位大神知道这个错误是什么原因吗?求大神们支招!

AndroidStudio添加多依赖导致依赖重复的解决办法

当使用maven导入依赖时,可能会出现不同的依赖包含了同一个jar,运行app的时候,就会报错 Error:Execution failed for task ‘:app:... java.lang.RuntimeException: com.android.builder.dexi...

android studio运行时为啥显示这个东西

Error:Execution failed for task ':app:transformDexArchiveWithExternalLibsDexMergerForDebug'. > com.android.builder.dexing.DexArchiveMergerException: Unable to merge dex

Android Studio 常见问题汇总

1.Error:com.android.dx.cf.code.SimException: invalid opcode ba (invokedynamic requires ...= 26)解决方法:在build中加入implementation "com.google.guava:guava:23.0-android"2. com.android.buil...

抢茅台jd_seckill-master 来自huanghyw

本仓库发布的jd_seckill项目中涉及的任何脚本,仅用于测试和学习研究,禁止用于商业用途,不能保证其合法性,准确性,完整性和有效性,请根据情况自行判断。 本项目内所有资源文件,禁止任何公众号、自媒体进行任何形式的转载、发布。 huanghyw 对任何脚本问题概不负责,包括但不限于由任何脚本错误导致的任何损失或损害. 间接使用脚本的任何用户,包括但不限于建立VPS或在某些行为违反国家/地区法律或相关法规的情况下进行传播, huanghyw 对于由此引起的任何隐私泄漏或其他后果概不负责。 请勿将jd_seckill项目的任何内容用于商业或非法目的,否则后果自负。

Scratch项目式学习-俄罗斯方块游戏

信息社会,编程就和传统的“读、写、算”一样,是一种的基本能力,而这种能力可以从儿童编程开始。本课程以俄罗斯方块游戏作为项目,按照项目开发的流程作为课程框架,从游戏的分析和设计入手,确定游戏的背景、角色和规则;然后从准备素材到功能模块编程到调试,体验完整的项目开发过程。学习者会不断地遇到问题,分析原因,训练工程思维,提升解决问题的能力。 1.学习Scratch的基本操作,如角色添加、修改及造型处理等; 2.理解Scratch的脚本功能,能编程实现功能; 3.体验项目开发的全过程,包括项目的分析、设计,角色的准备,功能模块的编程实现,以及调试等过程,提升问题解决能力;

相关热词 c#读取shp文件 c# 多个if c#上传图片到安卓的接口 c#中得到控件 c# 浏览器打开 调用 c# 绘制3维 c#酒店管理系统数据库 c#链接api c# 串口发送数据 c# 线程结束回调