安装包时出现有未满足的依赖关系,怎么解决 [问题点数:50分,无满意结帖,结帖人u011203541]

Bbs1
本版专家分:0
结帖率 66.67%
Bbs1
本版专家分:0
Bbs1
本版专家分:0
Bbs1
本版专家分:0
解决安装wine依赖问题
wine : Depends: wine1.6 but it is not going to be installed
ubuntu 16.04 在使用apt-get install命令出现:下列软件包有满足依赖关系错误
1、<em>出现</em>错误的命令:sudo apt-get install dpkg2、<em>出现</em>的错误信息:您可能需要运行“apt-get -f install”来纠正下列错误: 下列软件包有<em>未</em><em>满足</em>的<em>依赖</em><em>关系</em>: cups : <em>依赖</em>: cups-common (&amp;gt;= 2.1.3-4ubuntu0.4) 但是 2.1.3-4 正要被安装 cups-bsd : <em>依赖</em>: cups-common (&amp;gt;= 2....
Linux学习--安装软件提示有满足依赖关系
这种现象<em>出现</em>的原因是: (1)软件需要<em>依赖</em>旧的版本的其他软件,但是目前这些都是新的。 (2)要装A,但是<em>依赖</em>新版本的B,同<em>时</em>C也<em>依赖</em>了B,但是C<em>依赖</em>的的版本更旧,如果更新B,那么C也不能正常使用了。 这里采用的<em>解决</em>办法: (1)首先需要更新源,我在里面安装了清华的源和阿里的源,然后执行更新本地源列表指令; (2)sudo apt-get install 软件名,这个<em>时</em>候会提示你“有<em>未</em><em>满足</em>...
E: 有满足依赖关系。请尝试不指明软件包的名字来运行“apt-get -f install”(也可以指定一个解决办法)。
转发自https://blog.csdn.net/longma666666/article/details/79374453 遇到此类问题,直接在终端输入sudo apt-get –fix-broken install即可<em>解决</em>问题。
linux安装软件报错:有满足依赖关系
一、问题描述   <em>解决</em>了上一个问题   另外一个进程已经为 dpkg 状态数据库 加锁   又一个问题接踵而来(真是深得命运宠爱呀)    二、问题分析   很明显,这不是重启能<em>解决</em>的问题了,继续向命运抗争吧。   1. “<em>依赖</em>于vlc(&amp;amp;amp;gt;= 2.1.0);然而:<em>未</em>安装软件包 vlc。”   <em>未</em>安装那就安装呗(你要什么我给什么),然而失败了(看来说出来的不一定是想要的),不过...
debian 安装软件出现 下列软件包有满足依赖关系
apt-get install vim <em>出现</em> 下列软件包有<em>未</em><em>满足</em>的<em>依赖</em><em>关系</em>: vim : <em>依赖</em>: vim-common (= 2:7.2.445+hg~cb94c42c0e1a-1) 但是 2:7.3
ubuntu安装软件提示有满足依赖关系
  环境:ubuntu 14.04 STL、64位     在ubuntu中我们使用sudo apt-get install 或者dpkg -i *.deb安装软件<em>时</em>,常常提示“有<em>未</em>能<em>满足</em>的<em>依赖</em><em>关系</em>“,这是因为当前软件源中<em>依赖</em>库的版本不<em>满足</em>软件的要求。 <em>解决</em>办法: 步骤1:更新软件源。ubuntu自带的软件源比较旧,很多的软件版本较低,国内比较好用的源有阿里源; sudo cp /etc/ap...
Ubuntu有满足依赖关系解决
Ubuntu有<em>未</em><em>满足</em>的<em>依赖</em><em>关系</em><em>解决</em> 如下: wine : <em>依赖</em>: wine1.6 但是它将不会被安装 wine1.6-amd64 : <em>依赖</em>: wine1.6:any (= 1:1.6.2-0ubuntu14.2) wine1.6-i386:i386 : <em>依赖</em>: wine1.6:any (= 1:1.6.2-0ubuntu14.2) E: 有<em>未</em>能<em>满足</em>的<em>依赖</em><em>关系</em>。请尝试不指明软件包的名字来运行 ...
依赖: XXX 但是它将不会被安装
1. install aptitudesudo apt-get instal aptitude下列软件包有<em>未</em><em>满足</em>的<em>依赖</em><em>关系</em>: aptitude : <em>依赖</em>: libcwidget3 但是它将不会被安装 <em>依赖</em>: libsigc++-2.0-0c2a (&amp;gt;= 2.0.2) 但是它将不会被安装 <em>依赖</em>: libxapian22 但是它将不会被安装 ...
Deepin微信开发者工具依赖关系解决
Deepin微信开发者工具<em>依赖</em><em>关系</em><em>解决</em>安装微信开发者工具<em>时</em>报错:<em>依赖</em><em>关系</em>不<em>满足</em>:wine<em>解决</em> 安装微信开发者工具<em>时</em>报错:<em>依赖</em><em>关系</em>不<em>满足</em>:wine 安装<em>时</em>报错:<em>依赖</em><em>关系</em>不<em>满足</em>:wine,安装版本如下: <em>解决</em> 安装<em>时</em>,提示<em>依赖</em><em>关系</em><em>未</em>被配置,暂<em>时</em>先不看,继续执行下面的命令: sudo dpkg --add-architecture i386 sudo apt-get update sudo a...
ubuntu问题g++ : 依赖: g++-4.8 (>= 4.8.2-5~) 但是它将不会被安装
截图中选取了一个等同的例子。 python-dev : <em>依赖</em>:libpython-dev(=2.7.5-5ubuntu3)但是它将不会被安装 凡是遇到类似问题,括号里面会是一些版本号。这通常代表的意思是Ubuntu自生安装的软件包版本高,而所安装软件的<em>依赖</em>包版本低的原因 <em>解决</em>发案 1. $sudo apt-get install aptitude $sudo aptitude
ubuntu安装软件:有满足依赖关系
通常的原因是:1、软件<em>依赖</em>于某一软件旧的版本,可是你却已经安装了新的。 2、要装A, <em>依赖</em>B, 但是已经安装的软件C也<em>依赖</em>B, 但是A<em>依赖</em>的B的版本和C<em>依赖</em>的B的版本不一致, 导致了如果要安装B,那么C便不能正常运行了,所以系统报错。<em>解决</em>办法:方法(一):步骤1:更新软件源。ubuntu自带的软件源比较旧,很多的软件版本较低,国内比较好用的源有阿里源;                sudo cp...
GCC 7.3.0编译安装
科大开源镜像站 GCC源码 https://mirrors.ustc.edu.cn/gnu/gcc/下载gcc-7.3.0 wget https://mirrors.ustc.edu.cn/gnu/gcc/gcc-7.3.0/gcc-7.3.0.tar.gz 解压&amp;amp;进入目录 tar -xf gcc-7.3.0.tar.gz cd gcc-7.3.0运行 download_prerequis...
pat-get 与aptitude的区别 处理:下列软件包有满足依赖关系
有<em>时</em>候我们在ubuntu系统中用apt-get install 安装软件包<em>时</em>或<em>出现</em>以下错误:下列软件包有<em>未</em><em>满足</em>的<em>依赖</em><em>关系</em>:... ....这是我们可以考虑用sudo aptitude install  ... ... 的安装工具安装,举个例子:原来使用sudo apt-get install python-pip会提示以上错误。改成以下命令:sudo aptitude install python...
Ubuntu14.04搭建环境 g++ : 依赖: g++-4.8 (>= 4.8.2-5~) 但是它将不会被安装
Ubuntu14.04搭建环境遇到下列问题: root@ubuntu-VirtualBox:/home/ubuntu# apt-get install -y build-essential 正在读取软件包列表… 完成 正在分析软件包的<em>依赖</em><em>关系</em>树 正在读取状态信息… 完成 有一些软件包无法被安装。如果您用的是 unstable 发行版,这也许是 因为系统无法达到您要求的状态造成的。该版本中可能会有一...
解决办法』:build-essential: 依赖: XXX 但是它将不会被安装
当你安装一些东西的<em>时</em>候提示: build-essential:<em>依赖</em>:XXX但是它不会被安装 例如:build-essential:<em>依赖</em>:g++但是它不会被安转。 <em>解决</em>办法: sudo -i aptitude install g++
ubuntu 升级gcc 到4.7
最近因为项目需要,要把一套代码从Linux3.4内核移动到2.6内核下运行。在源码编译的<em>时</em>候就<em>出现</em>了各种情况了,其中就遇到了问题: undefined reference to `__sync_val_compare_and_swap_8' 分析之后,发现该问题的<em>出现</em>是由于2.6内核版本的ubuntu,编译器版本过低。 <em>解决</em>问题:升级gcc sudo add-apt-repository
npm 安装依赖出现错误
笔者在进行学习webpack学习实践的<em>时</em>候,使用npm命令进行<em>依赖</em>安装<em>时</em>,总是遇到以下错误,笔者一<em>时</em>找不到<em>解决</em>方案,很是无奈。后偶然间在看mpvue文档的<em>时</em>候瞬间受到启发<em>解决</em>了此错误。 <em>解决</em>方法及<em>解决</em>示例图如下: 执行以下命令后再执行安装<em>依赖</em>就不报错误啦 $ npm set registry https://registry.npm.taobao.org/ OR $ yarn con...
软件安装的依赖问题
在编译Android源码<em>时</em>,安装<em>依赖</em>的相关包<em>时</em>,如下: sudo apt-get install flex bison gperf libsdl-dev libesd0-dev libwxgtk2.6
下列软件包有满足依赖关系: cuda : 依赖: cuda-9-0 (>= 9.0.176) 但是它将不会被安装
楼主是Ubuntu 16.04装CUDA9的<em>时</em>候遇到了这个问题,最后发现是因为自己关闭了更新的原因,如果你也遇到问题的话,请按如下步骤:系统设置-软件和更新-更新设置为如下即可:如果还不行的话,你可以看一下你是否更换过软件的源,将源重置一下看看!...
Ubuntu18.04安装gcc提示错误
错误信息: 正在读取软件包列表... 完成 正在分析软件包的<em>依赖</em><em>关系</em>树 正在读取状态信息... 完成 有一些软件包无法被安装。如果您用的是 unstable 发行版,这也许是 因为系统无法达到您要求的状态造成的。该版本中可能会有一些您需要的软件 包尚<em>未</em>被创建或是它们已被从新到(Incoming)目录移出。 下列信息可能会对<em>解决</em>问题有所帮助: 下列软件包有<em>未</em><em>满足</em>的<em>依赖</em>...
E:无法修正错误,因为您要求某些软件包保持现状,就是它们破坏了软件包间的依赖关系
安装terminator等一些软件等<em>时</em>候,遇到了这样等问题 leo@leo:~$ sudo apt-get install terminator [sudo] password for leo: 正在读取软件包列表... 完成 正在分析软件包的<em>依赖</em><em>关系</em>树 正在读取状态信息... 完成 有一些软件包无法被安装。如果您用的是 unstable 发行版,这也许是
Ubuntu 14.04上 安装 OpenJDK8
先列一下按照网上高人步骤,后记录上遇到的问题。 1. 添加openjdk8的第三方源 sudo add-apt-repository ppa:openjdk-r/ppa 2. 执行更新 apt-get update 3. 安装openjdk8 sudo apt-get install openjdk-8-jdk 4. 选择版本 sudo update-alternatives –c
解决办法:发生故障,这可能是有软件包被要求保持现状的缘故
错误如下: sudo apt-get install openjdk-8-jdk 正在读取软件包列表... 完成 正在分析软件包的<em>依赖</em><em>关系</em>树 正在读取状态信息... 完成 有一些软件包无法被安装。如果您用的是 unstable 发行版,这也许是 因为系统无法达到您要求的状态造成的。该版本中可能会有一些您需要的软件 包尚<em>未</em>被创建或是它们已被从新到(Incoming)目...
sudo apt-get install package出现E:无法定位软件包
OS:Ubuntu 16.04 问题描述: ``` sudo apt-get install xxxx ``` <em>出现</em> ``` 正在读取软件包列表... 完成 正在分析软件包的<em>依赖</em><em>关系</em>树 正在读取状态信息... 完成 E: 无法定位软件包 xxxx ``` 网上的<em>解决</em>方案例如 ``` sudo apt-get update && apt-get upgrade ``` 我都试过了,没有用,问题依然存在。 ``` sudo gedit /etc/apt/sources.list ``` 换源我也试过了,不行。请问还有什么办法吗??
ubuntu 安装 nvidia-docker2报错“下列软件包有满足依赖关系:”
先看错误: 执行 sudo apt-get install -y nvidia-docker2 的<em>时</em>候<em>出现</em>下面错误信息: 下列软件包有<em>未</em><em>满足</em>的<em>依赖</em><em>关系</em>: nvidia-docker2 : <em>依赖</em>: docker-ce (= 5:18.09.0~3-0~ubuntu-xenial) 但是 5:18.09.1~3-0~ubuntu-xenial 正要被安装 或docker-ee (= 5:18.09....
依赖关系满足:teamviewer
<em>解决</em>办法是 sudo apt-get remove teamviewer
Ubuntu解决依赖关系
问题: apt-get install libprotobuf-dev 下列软件包有<em>未</em><em>满足</em>的<em>依赖</em><em>关系</em>:  libprotobuf-dev : <em>依赖</em>: zlib1g-dev 但是它将不会被安装 E: 无法修正错误,因为您要求某些软件包保持现状,就是它们破坏了软件包间的<em>依赖</em><em>关系</em>。 原因: Linux下经常需要安装不同类型的库,在Ubuntu中,这些类库都是以“lib_n
满足依赖关系"的一种解决办法">apt-get安装软件,出现"下列软件包有满足依赖关系"的一种解决办法
使用aptitude这个命令安装,他可以智能地分析库之间的<em>依赖</em><em>关系</em>,并给出调整建议(如降级或删除某个库)。 sudo aptitude install XXX 之后检查一下是否成功安装 dpkg -s XXX ...
下列软件包有满足依赖关系
"下列软件包有<em>未</em><em>满足</em>的<em>依赖</em><em>关系</em>:"错误<em>解决</em>办法 显示nvidia-cuda-toolkit有<em>未</em>能<em>满足</em><em>依赖</em><em>关系</em>,这是由于在之前误安装了nvidia-cuda-toolkit,版本与cuda版本没有配套对应上,将其卸载,才能正常安装其他软件包。 sudo apt-get remove --auto-remove nvidia-cuda-tookit ...
安装指定GCC版本7.3.0
指定安装GCC版本原因及目的:https://blog.csdn.net/vslyu/article/details/82629303 安装主要参考: https://www.jianshu.com/p/0caef3ce8e06和https://blog.51cto.com/ayuepm/1382240 按参考安装<em>出现</em>的问题及<em>解决</em>补充: 1、下载mpfr-3.1.4校验错误; <em>解决</em>:去http:/...
【protobuf】protobuf 的安装与使用
protobuf的安装与使用
linux 下安装openJDK 7 安装不了
安装了openJDK 8,但是JBoss AS 7.1.1 服务器开启不了,所以重新安装7,但是网站上的 sudo apt-get install openjdk-7-jre 报错 E: Packag
ubuntu 17.10 安装后软件包有满足依赖关系
求助一下各位老师,我刚接触ubuntu,最近下载安装了ubuntu kylin 17.10版本后,联网更新软件,发生了一个错误,错误信息:“错误:已损坏个数>0”, 这通常意味着您安装的软件包有<em>未</em><em>满足</em>
ubuntu安装软件出现,无法修正错误,因为您要求某些软件包保持现状,就是它们破坏了软件包间的依赖关系
安装terminator等一些软件等<em>时</em>候,遇到了这样等问题 leo@leo:~$ sudo apt-get install terminator [sudo] password for leo: 正在读取软件包列表... 完成 正在分析软件包的<em>依赖</em><em>关系</em>树 正在读取状态信息... 完成 有一些软件包无法被安装。如果您用的是 unstable 发行版,这也许
E:无法修正错误,因为您要求某些软件包保持现状,就是它们破坏了软件包间的依赖关系
安装terminator等一些软件等<em>时</em>候,遇到了这样等问题leo@leo:~$ sudo apt-get install terminator [sudo] password for leo: 正在读取软件包列表... 完成 正在分析软件包的<em>依赖</em><em>关系</em>树 正在读取状态信息... 完成 有一些软件包无法被安装。如果您用的是 unstable 发行版,这也许是 因为系统无法...
Python-pip 安装失败问题解决
一、问题描述root@ubuntu:/home/chao# apt-get install python-pip 正在读取软件包列表... 完成 正在分析软件包的<em>依赖</em><em>关系</em>树 正在读取状态信息... 完成 有一些软件包无法被安装。如果您用的是 unstable 发行版,这也许是 因为系统无法达到您要求的状态造成的。该版本中可能会有一些您需要的软件 包尚<em>未</em>被创建或是它们已被从
deepin深度商店安装应用说依赖关系被破坏
在深度终端执行以下命令即可<em>解决</em> sudo apt-get clean 清除已经下载的<em>安装包</em> sudo apt-get update 重新更新软件列表 sudo apt-get dist-upgrade
ubuntu安装VLC出现依赖包版本过高解决方法
cyl@cyl-Latitude-D630:~$ sudo apt-get install vlc正在读取软件包列表... 完成正在分析软件包的<em>依赖</em><em>关系</em>树 正在读取状态信息... 完成 有一些软件包无法被安装。如果您用的是 unstable 发行版,这也许是因为系统无法达到您要求的状态造成的。该版本中可能会有一些您需要的软件包尚<em>未</em>被创建或是它们已被从新到(Incoming)...
Ubuntu安装软件事出现依赖关系有问题解决方案
在ubuntu中安装软件中,有<em>时</em>会<em>出现</em>以下错误提示: 有一些软件包无法被安装。如果您用的是 unstable 发行版,这也许是因为系统无法达到您要求的状态造成的。该版本中可能会有一些您需要的软件包尚<em>未</em>被创建或是它们已被从新到(Incoming)目录移出。... <em>出现</em>上述等问题,一般是系统中相关软件没有更新。当然,有<em>时</em>可以在终端键入:sudo aptitude... 来降低相关软件版本,达到<em>依赖</em>...
build-essential: 依赖: g++ (>= 4:4.3.1) 但是它将不会被安装
问题:   [yangzb@yangzb-desktop:~]$ which g++ bash: type: g++: <em>未</em>找到 [yangzb@yangzb-desktop:~]$ sudo apt-get install build-essential 正在读取软件包列表... 完成 正在分析软件包的<em>依赖</em><em>关系</em>树       正在读取状态信息... 完成       有一些软件...
Ubuntu16.04,pycharm配置PyQt5+QtDesigner//下列软件包有满足依赖关系 linux-image-extra-4.4.0-139-generic : 依赖: linu
&amp;amp;amp;amp;amp;amp;lt;div id=&amp;amp;amp;amp;amp;quot;content_views&amp;amp;amp;amp;amp;quot; class=&amp;amp;amp;amp;amp;quot;markdown_views prism-atom-one-dark&amp;amp;amp;amp;amp;quot;&amp;amp;amp;amp;amp;amp;gt; &amp;amp
Ubuntu14.4 源列表问题导致下列软件包有满足依赖关系: MySQL社区服务器:取决于:MySQL客户端(= 5.642等等
首先第一步了解系统的一些基本信息如:系统版本号(方便根据不同版本选择不同的源列表) [root@database mysql]# cat /etc/issue Ubuntu 14.04.3 LTS \n \l 备份原装源列表: [root@database mysql]# cp /etc/apt/sources.list /etc/apt/sources.list.bak [root@d...
安装GTK开发环境,满足依赖关系,如何解决
ubuntu 10.04 2.6.32-22-generic $ sudo apt-get install gnome-devel gnome-devel-docs 正在读取软件包列表... 完成 正
满足依赖关系“的解决办法">apt-get 出现"软件包有满足依赖关系“的解决办法
卸载出错的软件包就行了 sudo apt-get purge XXX
Linux下BUG系列:ubuntu16.04安装wine有满足依赖关系
Linux下BUG系列:ubuntu16.04安装wine有<em>未</em><em>满足</em><em>依赖</em><em>关系</em> 想在ubuntu16.04下装一个MS的office,按照 https://www.sohu.com/a/162185166_295478 安装winetricks<em>时</em>: sudo apt-get install wine1.8 winetricks 首先报错 ... Rebuilding /usr/share/app...
ubuntu 请尝试不指明软件包的名字来运行“apt-get -f install”(也可以指定一个解决办法)。
下列软件包有<em>未</em><em>满足</em>的<em>依赖</em><em>关系</em>:  wine-qqintl:i386 : <em>依赖</em>: libasound2:i386                     <em>依赖</em>: libgtk2.0-0:i386 但是它将不会被安装                     <em>依赖</em>: liblcms2-2:i386 但是它将不会被安装                     <em>依赖</em>: libpng12-0:i386
下列软件包有满足依赖关系依赖: libxxx(= 2.2.10) 但是 2.3.0正要被安装
关键:提示<em>依赖</em>什么,就安装<em>依赖</em>库及其版本号(低的那个)! 出错信息: configure: error: Could not find cups! You might be able to fix this by running 'sudo apt-get install libcups2-dev'. 执行: apt install libcups2-dev 正在读取软件包列表... ...
ubuntu下列软件包有满足依赖关系
临<em>时</em><em>解决</em>案: $ apt-get remove conflict-pa
ubuntu18.04安装gcc7.3.0&g++7.3.0
代码 sudo apt-get update sudo apt-get install aptitude sudo aptitude install gcc sudo apt install gcc sudo apt-get install g++ 若显示如下则成功 gcc --version g++ --version
Linux下BUG系列:解决deepin-wine依赖问题
简单来说,就是常见的“为<em>满足</em><em>依赖</em>错误”,一般是由于软件安装卸载冲突所造成的。 报错: root@lowfree03:/home/lowfree# apt-get install libc6-dev:i386 正在读取软件包列表... 完成 正在分析软件包的<em>依赖</em><em>关系</em>树 正在读取状态信息... 完成 您可能需要运行“apt-get -f install”来纠正下列错误: 下...
ubuntu 安装deb出现:下列软件包有满足依赖关系
sudo apt-get update(更新源) sudo apt-get -f install   会自动安装<em>依赖</em>的包
Ubuntu卸载protobuf并安装3.6.0版本的protobuf
1.卸载Ubuntu自带的protobuf; # sudo apt-get remove libprotobuf-dev # which protoc // 运行完“which protoc”会显示一个protoc的路径,如果没有显示则下面这条命令不必执行 # rm /usr/local/bin/protoc // 具体路径以“which protoc”显示的为准 到此,低版本的protob...
ProtoBuf 2.6.1安装、配置、卸载
由于公司现在用的是2.6.1,所以现在我安装的版本是2.6.1,据说protoc2和protoc3的数据格式不通用 顺便说一下不要在github上面直接下源码,因为源码中没有configure文件,需要先在源码文件夹内运行./autogen.sh命令下载configure文件,但是下载网址被墙了,所以有可能下载失败 https://github.com/google/protobuf/relea...
Protobuf安装步骤
今天看Brpc开源代码的<em>时</em>候,看到了里面提到了google开源的protobuf的数据序列化和反序列工具,所以特地下了源码,试着看下一个简单的使用过程。 1、protobuf的介绍 google protobuf是一个灵活的、高效的用于序列化数据的协议。相比较XML和JSON格式,protobuf更小、更快、更便捷。google protobuf是跨语言的,并且自带了一个编译器(protoc),只...
protobuf的介绍、安装与使用
1.protobuf是什么? protobuf是google旗下的一款平台无关,语言无关,可扩展的序列化结构数据格式。所以很适合用做数据存储和作为不同应用,不同语言之间相互通信的数据交换格式,只要实现相同的协议格式即同一 proto文件被编译成不同的语言版本,加入到各自的工程中去。这样不同语言就可以解析其他语言通过 protobuf序列化的数据。 2.数据交互xml、json、proto...
Ubuntu16.04安装protobuf(最靠谱的)
emmmmmmm..... Ubuntu16.04自带protobuf protoc --version 查看版本 whereis protoc 查看安装位置 which protoc 如果有多个protobuf,查看默认使用的protobuf 方法一: 1、下载google protocol buffers,下载地址:http://code.google.com/p/protob...
ganglia-monitor : 依赖: libconfuse0 (>= 2.5) 但是它将不会被安装 ........
由于先前主节点更换的原因,ganglia<em>出现</em>问题,先将原主节点的ganglia相关软件卸载, 1、打开一个终端,输入dpkg --list显示的是你电脑上安装的所有软件。 2、在终端中找到你需要卸载的软件的名称,列表是按照首字母排序的。 3.在终端上输入命令sudo apt-get --purge remove 包名(--purge是可选项,写上这个属性是将软件及其配置文件一并删除...
解决npm 安装部分依赖失败问题总结
有<em>时</em>候,我们通过npm install进行项目初始化,会由于“天朝墙”的原因,可能会导致下载速度慢,无法下载等等问题<em>出现</em>。 好在现在有很多国内镜像,也有一个帮助我们随意切换 npm 镜像的工具:nrm。 npm install -g nrm nrm ls * npm ---- https://registry.npmjs.org/ cnpm --- http://r.cnpmjs.org...
apt-get安装问题:请尝试不指明软件包的名字来运行“apt-get -f install”(也可以指定一个解决办法)。
正在读取软件包列表... 完成 正在分析软件包的<em>依赖</em><em>关系</em>树... 完成 您可能需要运行“apt-get -f install”来纠正下列错误: 下列的软件包有不能<em>满足</em>的<em>依赖</em><em>关系</em>: cdparanoia: <em>依赖</em>: libcdparanoia0 (= 3a9.8-11) 但是,它将不会被安装 gpdf: <em>依赖</em>: libgnomeprint2.2-0 (>= 2.4.2) 但是,它将不会被安装
protobuf 安装笔记
本人从github上直接下载,然后按照步骤走,发现没有。/config命令。从网上搜集了原因,特此记录卸载掉老版本的Protocol:sudo apt-get remove libprotobuf-dev 2.下载最新的Protocol Buffers。下载网址:https://developers.google.com/protocol-buffers/docs/downloads。说明:最好不...
Linux安装gcc 7.3.0编译器详解(CentOS 7 64位系统)
因为原生的CentOS 7自动安装的gcc版本是4.8.5; yum -y install gcc gcc-c++ kernel-devel 最近工作和学习中需要使用C++17,所以被迫安装新版本的gcc编译器。   一、环境准备 yum -y install gmp-devel                                                       ...
下列软件包满足依赖关系: flashplugin-installer(ubuntu下adobe flash player的安装)
下列软件包<em>未</em><em>满足</em>的<em>依赖</em><em>关系</em>: flashplugin-installer(ubuntu下adobe flash player安装<em>时</em>碰到的怪事<em>解决</em>方案)
Linux下安装libncurses5-dev失败
ubuntu13.10 下 安装 $ sudo apt-get install libncurses5-dev Reading package lists... Done Building depen
ubuntu 安装包报:下列软件包有满足依赖关系
root@ubuntu:/usr/src/linux-5.0.1# apt install zlib1g-dev 正在读取软件包列表... 完成 正在分析软件包的<em>依赖</em><em>关系</em>树 正在读取状态信息... 完成 有一些软件包无法被安装。如果您用的是 unstable 发行版,这也许是 因为系统无法达到您要求的状态造成的。该版本中可能会有一些您需要的软件 包尚<em>未</em>被创建或是它们已被...
Ubuntu 14.04 “无法修正错误,因为您要求某些软件包保持现状,就是它们破坏了软件包间的依赖关” 解决办法
  ubuntu下apt-get install 安装软件, 报“无法修正错误,因为您要求某些软件包保持现状,就是它们破坏了软件包间的<em>依赖</em><em>关系</em>”。 这个错误<em>出现</em>的主要原因是,系统中已经安装了被<em>依赖</em>的包的高版本。例如在我安装 openssh-server <em>时</em>,有一个对于 openssh-client 的<em>依赖</em>,但是我系统中已经提前安装了openssh-client 这个包,并且版本高于所要求的...
Ubuntu gcc-7.3.0.安装包tar
Ubuntu gcc-7.3.0.<em>安装包</em>tar Ubuntu<em>安装包</em>(MRPT安装需要)
解决apt-get install在安装软件包依赖不兼容问题
<em>解决</em>apt-get install在安装软件包<em>时</em><em>依赖</em>不兼容问题在树莓派上安装libncurses5-dev<em>出现</em>以下问题<em>解决</em> 在树莓派上安装libncurses5-dev<em>出现</em>以下问题 pi@raspberrypi:~/6lbr/examples/6lbr $ sudo apt-get install libncurses5-dev Reading package lists… Done B...
ubuntu16.04--需要运行"apt-get -f install"来纠正下列错误
安装graphviz的<em>时</em>候报如下的错误: E: 有<em>未</em>能<em>满足</em>的<em>依赖</em><em>关系</em>。请尝试不指明软件包的名字来运行“apt-get -f install”(也可以指定一个<em>解决</em>办法)。 <em>解决</em>办法: 在终端输入:sudo apt-get -f install 然后在输入: sudo apt-get install graphviz <em>解决</em>了
Ubuntu 16 64位安装gcc4.4.0 make失败,求大神解救
../.././gcc/gimple.h:67:54: warning: ISO C does not support ‘__FUNCTION__’ predefined identifier [-Wpedantic] gimple_check_failed (__gs, __FILE__, __LINE__, __FUNCTION__, \ ^ ../.././gcc/gimple.h:4280:3: note: in expansion of macro ‘GIMPLE_CHECK’ GIMPLE_CHECK (gs, GIMPLE_PREDICT); ^ ../.././gcc/gimple.h:68:17: warning: enum conversion when passing argument 6 of ‘gimple_check_failed’ is invalid in C++ [-Wc++-compat] (CODE), 0); \ ^ ../.././gcc/gimple.h:4280:3: note: in expansion of macro ‘GIMPLE_CHECK’ GIMPLE_CHECK (gs, GIMPLE_PREDICT); ^ ../.././gcc/gimple.h:59:13: note: expected ‘enum tree_code’ but argument is of type ‘int’ extern void gimple_check_failed (const_gimple, const char *, int, \ ^ ../.././gcc/toplev.c: At top level: ../.././gcc/toplev.c:536:1: error: redefinition of ‘floor_log2’ floor_log2 (unsigned HOST_WIDE_INT x) ^ In file included from ../.././gcc/toplev.c:58:0: ../.././gcc/toplev.h:190:1: note: previous definition of ‘floor_log2’ was here floor_log2 (unsigned HOST_WIDE_INT x) ^ ../.././gcc/toplev.c:571:1: error: redefinition of ‘exact_log2’ exact_log2 (unsigned HOST_WIDE_INT x) ^ In file included from ../.././gcc/toplev.c:58:0: ../.././gcc/toplev.h:196:1: note: previous definition of ‘exact_log2’ was here exact_log2 (unsigned HOST_WIDE_INT x) ^ ../.././gcc/toplev.c: In function ‘print_to_asm_out_file’: ../.././gcc/toplev.c:1185:7: warning: format not a string literal and no format arguments [-Wformat-security] fprintf (asm_out_file, text); ^ ../.././gcc/toplev.c: In function ‘print_to_stderr’: ../.././gcc/toplev.c:1214:7: warning: format not a string literal and no format arguments [-Wformat-security] fprintf (stderr, text); ^ Makefile:2470: recipe for target 'toplev.o' failed make[3]: *** [toplev.o] Error 1 make[3]: Leaving directory '/home/zsj/下载/related/gcc-4.4.0/host-x86_64-unknown-linux-gnu/gcc' Makefile:5144: recipe for target 'all-stage1-gcc' failed make[2]: *** [all-stage1-gcc] Error 2 make[2]: Leaving directory '/home/zsj/下载/related/gcc-4.4.0' Makefile:19883: recipe for target 'stage1-bubble' failed make[1]: *** [stage1-bubble] Error 2 make[1]: Leaving directory '/home/zsj/下载/related/gcc-4.4.0' Makefile:741: recipe for target 'all' failed make: *** [all] Error 2
Ubuntu上安装vim不能安装的问题,“下列的软件包有不能满足依赖关系
前阵子,刚安装Ubuntu<em>时</em>,安装vim的问题,现在些出来分享一下。 apt-get install vim 正在读取软件包列表... 完成 正在分析软件包的<em>依赖</em><em>关系</em>树 正在读取状态信息... 完成 有一些软件包无法被安装。如果您用的是不稳定(unstable)发行版,
Linux 下升级gcc版本(gcc-7.3.0)
本文描述如何通过编译源码,来升级gcc编译版本,由于CentOs默认gcc编译版本太低不能<em>满足</em>需求。我通过自己的安装升级经验总结了一个shell脚本,整体<em>时</em>间大约在一个小<em>时</em>左右。 cd /usr/src/ vim upgradeGcc.sh 在upgradeGcc.sh中输入下面的内容 #!/bin/bash #在非root账户下,使用sudo命令 #获取源码 #或者手动下载,在...
树莓派kali 装完整包出现满足依赖关系
如题树莓派已经安装了kali但是主要工具都没有所以想安装全部但是不<em>满足</em><em>依赖</em><em>关系</em>![图片](https://img-ask.csdn.net/upload/201612/08/1481155510_158293.jpg)![图片](https://img-ask.csdn.net/upload/201612/08/1481155352_360756.jpg)![图片](https://img-ask.csdn.net/upload/201612/08/1481155541_845543.jpg)![图片](https://img-ask.csdn.net/upload/201612/08/1481155681_732564.jpg)
ubuntu18.04安装截图工具依赖包deepin-software-centerl下载
ubuntu下降级安装截图工具 的必备<em>依赖</em>包之一,是deepin-scrot能否安装成功的关键 相关下载链接://download.csdn.net/download/xrinosvip/105688
下列软件包有满足依赖关系: teamviewer:i386
这几天在项目中遇到一个问题,在安装teamviewer后,一直报错 <em>解决</em>办法是 sudo apt-get remove teamviewer
解决Linux Ubuntu依赖错误或者缺失问题的方法
Linux Ubuntu<em>依赖</em>错误或缺失的<em>解决</em>方法
deepin安装软件失败的解决方法
deepin安装软件总是失败。 更新系统也没用,换源也没有用。 商店提示网络错误。 现在在这里推荐一个方法,亲测有效。 打开终端 输入以下命令 sudo dpkg --configure -a 这个过程可能会很缓慢。 弄完之后就可以正常安装软件了。 ...
ubuntu 12.04新安装好后需要进行的包升级和清理工作
根据这么多次的操作经验,我发现,ubuntu系统在新安装好后需要进行一些包的升级和清理工作,不然的话,后续安装各种软件都不顺畅,会<em>出现</em>各种各样的问题。 需要进行的包升级和清理工作其实很简单,只需要执行以下两条命令即可: apt-get -f install #用来升级一些相互<em>依赖</em>的包 apt-get autoremove #用来删除一些过<em>时</em>的包 不过有<em>时</em>候执行上述命令<em>时</em>也会<em>出现</em>一些问题,最常
linux下安装GCC包的依赖问题
通过rpm查询,发现其实libstdc已经安装完毕。 [root@localhost Packages]# rpm -qa | grep libstdc libstdc++-4.4.6-3.el6.x86_64 但是在我安装GCC-C++的<em>时</em>候,依然<em>出现</em>包<em>依赖</em>问题,很是困扰 [root@localhost Packages]# rpm -ivh gcc-c++-4.4.6-3.el6.x86_64.rpm warning: gcc-c++-4.4.6-3.el6.x86_64.rpm: Header V3 RSA/SHA256 Signature, key ID fd431d51: NOKEY error: Failed dependencies: libstdc++-devel = 4.4.6-3.el6 is needed by gcc-c++-4.4.6-3.el6.x86_64
Ubuntu gcc-7.3.0.安装包tar下载
Ubuntu gcc-7.3.0.<em>安装包</em>tar Ubuntu<em>安装包</em>(MRPT安装需要) 相关下载链接://download.csdn.net/download/u011344545/10850256?
ubuntu 安装numpy的烂问题libgfortran3依赖
想在自己VM上安装numpy,然后尼码出来一些乱七八糟的问题。活该我用ubuntu还不太熟。大哭 1.首先直接sudo apt-get install python-numy。然后出错:错误 http://cn.archive.ubuntu.com/ubuntu/ trusty-updates/main libgfortran3 i386 4.8.4-2ubuntu1~14.04   40
解决ubantu下无法安装问题
软件安装<em>依赖</em><em>关系</em><em>解决</em>
linux下无法安装软件包
正在读取软件包列表... 完成 正在分析软件包的<em>依赖</em><em>关系</em>树        正在读取状态信息... 完成        有一些软件包无法被安装。如果您用的是不稳定(unstable)发行版,这也许是 因为系统无法达到您要求的状态造成的。该版本中可能会有一些您需要的软件 包尚<em>未</em>被创建或是它们还在新到(incoming)目录中。 下列的信息可能会对<em>解决</em>问题有所帮助: 下列的软件包有不能<em>满足</em>
Ubuntu 16.04系统中GCC 9.1编译器安装方法及C++17标准测试示例
2017年底,C++17标准正式颁布,该标准的最大贡献是,提供了STL库算法的并行运算版本,对于我这种喜欢追求算法性能的程序员而言,无疑是一个极大的福音。幸运地是,Linux系统标准编译器GCC能完美地支持C++ 17标准,但需升级到7.0以上版本;不幸地是,Ubuntu 16.04版本自带的GCC版本为5.4.0,可支持C++ 14标准,但基本不支持C++ 17标准。怎么办?那就从零开始,从GC...
ubuntu16.04 安装gcc 7.3.0
sudo add-apt-repository ppa:ubuntu-toolchain-r/test sudo apt-get update sudo apt-get install gcc-7网上找到的安装资料都是基于centos的,我尝试了一下,有错误,但没有具体分析原因。以上指令可以正确安装,下面是配置指令sudo update-alternatives --install /usr/b...
centos升级之gcc 升级 gcc-7.3.0安装
sudo yum install centos-release-scl sudo yum install devtoolset-6 scl enable devtoolset-6 bash sudo yum list devtoolset-6\*
centos升级之gcc 升级到 gcc-7.3.0
在做后端计算服务<em>时</em>,需要用到AVX512的计算指令集,当然首先需要服务器的CPU能够支持这种指令集,其次就是我们的gcc库需要7.3.0以上的版本来支持。那我们需要做的是安装升级gcc-7.3.0。 1. 下载gcc-7.3.0 可以去网上下载,下载地址如下:http://mirror.linux-ia64.org/gnu/gcc/releases/gcc-7.3.0/ 也可以用wget直接...
使用apt-get -f install出错
更换了无数次源还是这个问题
ubuntu下修复apt-get错误方法整理
<em>出现</em>错误: 您可能需要运行“apt-get -f install”来纠正下列错误: 下列软件包有<em>未</em><em>满足</em>的<em>依赖</em><em>关系</em>: linux-headers-2.6.37-6-generic-pae : <em>依赖</em>: linux-headers-2.6.37-6 但是它将不会被安装 linux-image-generic-pae : <em>依赖</em>: linux-image-2.6.37-6-generic-pae 但
爬虫福利二 之 妹子图网MM批量下载
爬虫福利一:27报网MM批量下载    点击 看了本文,相信大家对爬虫一定会产生强烈的兴趣,激励自己去学习爬虫,在这里提前祝:大家学有所成! 目标网站:妹子图网 环境:Python3.x 相关第三方模块:requests、beautifulsoup4 Re:各位在测试<em>时</em>只需要将代码里的变量 path 指定为你当前系统要保存的路径,使用 python xxx.py 或IDE运行即可。
网站开发人员应该知道的62件事.doc下载
网站开发人员应该知道的62件事.doc 你应该知道的... 相关下载链接:[url=//download.csdn.net/download/move01/3049799?utm_source=bbsseo]//download.csdn.net/download/move01/3049799?utm_source=bbsseo[/url]
C++ Primer 4th Edition(英文PDF版)下载
C++ Primer 第4版,pdf版,全标签! 相关下载链接:[url=//download.csdn.net/download/vickyzhe/229036?utm_source=bbsseo]//download.csdn.net/download/vickyzhe/229036?utm_source=bbsseo[/url]
netview安装配置培训下载
netview安装配置培训 netview安装配置培训 相关下载链接:[url=//download.csdn.net/download/ggl3333/634751?utm_source=bbsseo]//download.csdn.net/download/ggl3333/634751?utm_source=bbsseo[/url]
相关热词 c#判断数字不得为负数 c#帧和帧协议 c#算偏移值 c# 在枚举中 c#6 字符串 插值 c#程序中的占位符标签 c#监听数组变化 c# vlc c#索引实现 c# 局域网广播通信
我们是很有底线的