linux安装opencv时make出错 [问题点数:50分]

Bbs1
本版专家分:0
结帖率 66.67%
Bbs1
本版专家分:0
Bbs7
本版专家分:22786
版主
Blank
红花 2011年9月 Linux/Unix社区大版内专家分月排行榜第一
2008年11月 C/C++大版内专家分月排行榜第一
Blank
黄花 2012年11月 Linux/Unix社区大版内专家分月排行榜第二
2011年8月 Linux/Unix社区大版内专家分月排行榜第二
2008年10月 C/C++大版内专家分月排行榜第二
Blank
蓝花 2012年8月 Linux/Unix社区大版内专家分月排行榜第三
Bbs1
本版专家分:30
Bbs1
本版专家分:0
Bbs1
本版专家分:0
版主
Blank
签到新秀 累计签到获取,不积跬步,无以至千里,继续坚持!
Ubuntu6.04 下make编译 opencv3.2 出错
<em>make</em> 之后出现对‘cv::imread(0’未定义的引用............. 各种未定义引用 针对mianduo自己的问题主要两个原因: 1. sudo <em>make</em> install  变异<em>安装</em>完<em>opencv</em>3.2之后没有对该库进行配置!!!最主要的原因,以前用<em>opencv</em>2的<em>时</em>候配置过,结果这次忘了。。。具体配置参见博客https://blog.csdn.net/Function_K...
linux安装opencvmake出错
[ 12%] Built target gen-pkgconfig [ 12%] Built target libwebp [ 12%] Built target ippiw [ 12%] Building CXX object 3rdparty/protobuf/CMakeFiles/libprotobuf.dir/src/google/protobuf/extension_set.cc.o In file included from /home/w/<em>opencv</em>/3rdparty/protobuf/src/google/protobuf/repeated_field.h:62, from /home/w/<em>opencv</em>/3rdparty/protobuf/src/google/protobuf/extension_set.h:51, from /home/w/<em>opencv</em>/3rdparty/protobuf/src/google/protobuf/extension_set.cc:38: 3rdparty/protobuf/CMakeFiles/libprotobuf.dir/build.<em>make</em>:110: recipe for target '3rdparty/protobuf/CMakeFiles/libprotobuf.dir/src/google/protobuf/extension_set.cc.o' failed <em>make</em>[2]: *** [3rdparty/protobuf/CMakeFiles/libprotobuf.dir/src/google/protobuf/extension_set.cc.o] Error 1 CMakeFiles/Makefile2:436: recipe for target '3rdparty/protobuf/CMakeFiles/libprotobuf.dir/all' failed <em>make</em>[1]: *** [3rdparty/protobuf/CMakeFiles/libprotobuf.dir/all] Error 2 Makefile:160: recipe for target 'all' failed <em>make</em>: *** [all] Error 2
在ubuntu下配置opencv,cmake成功了,而make候报错
1 [ 6%] Generating precomp.hpp.gch/<em>opencv</em>_core_Release.gch 2 In file included from /usr/include/c++/6/bits/stl_algo.h:59:0, 3 from /usr/include/c++/6/algorithm:62, 4 from /opt/<em>opencv</em>/<em>opencv</em>-3.1.0/modules/core/include/<em>opencv</em>2/core/base.hpp:53, 5 from /opt/<em>opencv</em>/<em>opencv</em>-3.1.0/modules/core/include/<em>opencv</em>2/core.hpp:54, 6 from /opt/<em>opencv</em>/<em>opencv</em>-3.1.0/modules/core/include/<em>opencv</em>2/core/utility.hpp:52, 7 from /opt/<em>opencv</em>/build/modules/core/precomp.hpp:49: 8 /usr/include/c++/6/cstdlib:75:25: fatal error: stdlib.h: 没有那个文件或目录 9 #include_next 10 ^ 11 compilation terminated. 12 modules/core/CMakeFiles/pch_Generate_<em>opencv</em>_core.dir/build.<em>make</em>:62: recipe for target 'modules/core/precomp.hpp.gch/<em>opencv</em>_core_Release.gch' failed 13 <em>make</em>[2]: *** [modules/core/precomp.hpp.gch/<em>opencv</em>_core_Release.gch] Error 1 14 CMakeFiles/Makefile2:1178: recipe for target 'modules/core/CMakeFiles/pch_Generate_<em>opencv</em>_core.dir/all' failed 15 <em>make</em>[1]: *** [modules/core/CMakeFiles/pch_Generate_<em>opencv</em>_core.dir/all] Error 2 16 Makefile:160: recipe for target 'all' failed 17 <em>make</em>: *** [all] Error 2 ![图片说明](https://img-ask.csdn.net/upload/201703/03/1488542516_717767.png)
LINUX下opencv的编译安装
  下载、解压源码:略。   编译<em>安装</em>: sudo apt-get install c<em>make</em> # 有<em>时</em>需要显示窗口,还是一起更新了吧。 sudo apt-get install libgtk2.0-dev pkg-config mkdir build cd build # c<em>make</em> .. # 使用CUDA c<em>make</em> -D CMAKE_BUILD_TYPE=RELEASE \ -D...
opencv make 出错
错误: nvcc fatal : Unsupported gpu architecture'compute_11' 解决方法: sudo c<em>make</em> -D CMAKE_BUILD_TYPE=RELEASE -D CMAKE_INSTALL_PREFIX=/usr/local -D CUDA_GENERATION=Kepler ./
opencv安装问题
sunzj@sunzj123:~/下载/<em>opencv</em>-2.4.10/release$ <em>make</em> Built target zlib Built target libtiff Built target
Makefile:160: recipe for target 'all' failed (Ubuntu 16.06 + Opencv3.2)解决办法
前言之前一直用的<em>opencv</em> 好好的,今天<em>安装</em>了anaconda之后,python中的<em>opencv</em>不能用了,即便是拷贝cv2.so之后也是不能用,问题如下:根本原因<em>安装</em>anaconda之后,很多默认的编译器都变成了anaconda自带的了,比如python和gcc等。那么系统中的python<em>安装</em>的东西自然是用不了的,刚开始没发现这个问题,一怒之下就把<em>opencv</em>给卸载了,当发现这个问题的<em>时</em>候,已经
Qt+cmake编译并配置OpenCV问题
Qt+c<em>make</em>编译并配置OpenCV错误记录 每次一到30%~40%左右就显示下面错误 F:/Qt5.12/Tools/mingw730_64/bin/…/lib/gcc/x86_64-w64-mingw32/7.3.0/…/…/…/…/x86_64-w64-mingw32/bin/ld.exe: i386 architecture of input file `CMakeFiles\openc...
linux安装opencv,执行cmake .报错
CMakeError.log内容: cc1plus: 警告:命令行选项“-Wmissing-prototypes”对 C/ObjC 是有效的,但对 C++ 无效 cc1plus: 警告:命令行选项“-Wstrict-prototypes”对 C/ObjC 是有效的,但对 C++ 无效 cc1plus: 警告:命令行选项“-Wno-missing-declarations”对 C/ObjC 是有效的,但对 C++ 无效 cc1plus: 错误:无法识别的命令行选项“-Wno-misleading-indentation” <em>make</em>[1]: *** [CMakeFiles/cmTC_16c2d.dir/src.cxx.o] 错误 1 <em>make</em>[1]: Leaving directory `/home/d5000/fujian/<em>opencv</em>-3.2.0/CMakeFiles/CMakeTmp' <em>make</em>: *** [cmTC_16c2d/fast] 错误 2
为什么Opencv3.4.0使用make编译出现错误?
环境:Debian(Raspiberry Pi Buster) c<em>make</em> version: 3.0.2 gcc version: 8.2.0 python version: 3.7.2 <em>make</em> version: 4.2.1 本来计划用<em>opencv</em>基于python进行图像辨别 在使用c<em>make</em>配置完成后使用<em>make</em>命令编译: ``` sudo <em>make</em> ``` 编译到大约90%<em>时</em>,出现如下错误: ``` #这是之前很多条控制台信息中的warning warning: cast between incompatible function types from ‘PyObject* (*)(PyObject*, PyObject*, PyObject*)’ {aka ‘_object* (*)(_object*, _object*, _object*)’} to ‘PyCFunction’ {aka ‘_object* (*)(_object*, _object*)’} [-Wcast-function-type] ``` ``` #<em>make</em>错误,退出 <em>make</em>[2]: *** [modules/python3/CMakeFiles/<em>opencv</em>_python3.dir/build.<em>make</em>:56: modules/python3/CMakeFiles/<em>opencv</em>_python3.dir/__/src2/cv2.cpp.o] Error 1 <em>make</em>[1]: *** [CMakeFiles/Makefile2:21149: modules/python3/CMakeFiles/<em>opencv</em>_python3.dir/all] Error 2 <em>make</em>: *** [Makefile:138: all] Error 2 ``` 如图(图1中使用了<em>make</em> -i选项忽略错误,继续编译剩余部分,但open_cv python3没有成功编译): ![图片说明](https://img-ask.csdn.net/upload/201908/11/1565498546_278259.png) (图2显示了<em>make</em>的错误) ![图片说明](https://img-ask.csdn.net/upload/201908/11/1565499335_385379.png) ``` #忽略错误后出现的c++error c++: error: C<em>make</em>files/<em>opencv</em>_python3.dir/__/src2/cv2.cpp.o No such file or dictionary ``` 在网上看到的编译错误的例子都和这个有所区别,没有能够很好地解决问题。有的说这是gcc编译器的问题 希望各位大佬们能够帮忙分析一下错误的原因,因为我的项目急需配置好<em>opencv</em>,也没有其它更好的替代,谢谢~
linux安装opencvmake出错
[ 7%] Built target libwebp [ 7%] Built target <em>opencv</em>_test_core_pch_dephelp [ 7%] Built target <em>opencv</em>_core_pch_dephelp [ 7%] Built target <em>opencv</em>_ts_pch_dephelp [ 7%] Built target pch_Generate_<em>opencv</em>_ts [ 7%] Built target pch_Generate_<em>opencv</em>_core [ 7%] Building CXX object modules/core/CMakeFiles/<em>opencv</em>_core.dir/src/hal_internal.cpp.o /home/w/<em>opencv</em>-3.2.0/modules/core/src/hal_internal.cpp: In function ‘int lapack_gemm_c(const fptype*, size_t, const fptype*, size_t, fptype, const fptype*, size_t, fptype, fptype*, size_t, int, int, int, int)’: /home/w/<em>opencv</em>-3.2.0/modules/core/src/hal_internal.cpp:437: error: expected unqualified-id before ‘__complex__’ /home/w/<em>opencv</em>-3.2.0/modules/core/src/hal_internal.cpp:437: error: expected ‘)’ before ‘__complex__’ /home/w/<em>opencv</em>-3.2.0/modules/core/src/hal_internal.cpp:438: error: expected unqualified-id before ‘__complex__’ /home/w/<em>opencv</em>-3.2.0/modules/core/src/hal_internal.cpp:438: error: expected ‘)’ before ‘__complex__’ /home/w/<em>opencv</em>-3.2.0/modules/core/src/hal_internal.cpp:439: error: expected unqualified-id before ‘__complex__’ /home/w/<em>opencv</em>-3.2.0/modules/core/src/hal_internal.cpp:439: error: expected ‘)’ before ‘__complex__’ /home/w/<em>opencv</em>-3.2.0/modules/core/src/hal_internal.cpp:440: error: expected unqualified-id before ‘__complex__’ /home/w/<em>opencv</em>-3.2.0/modules/core/src/hal_internal.cpp:440: error: expected ‘)’ before ‘__complex__’ /home/w/<em>opencv</em>-3.2.0/modules/core/src/hal_internal.cpp:443: error: expected unqualified-id before ‘__complex__’ /home/w/<em>opencv</em>-3.2.0/modules/core/src/hal_internal.cpp:443: error: expected ‘;’ before ‘__complex__’ /home/w/<em>opencv</em>-3.2.0/modules/core/src/hal_internal.cpp:444: error: expected unqualified-id before ‘__complex__’ /home/w/<em>opencv</em>-3.2.0/modules/core/src/hal_internal.cpp:444: error: expected ‘;’ before ‘__complex__’ /home/w/<em>opencv</em>-3.2.0/modules/core/src/hal_internal.cpp:494: error: expected unqualified-id before ‘__complex__’ /home/w/<em>opencv</em>-3.2.0/modules/core/src/hal_internal.cpp:494: error: expected ‘)’ before ‘__complex__’ /home/w/<em>opencv</em>-3.2.0/modules/core/src/hal_internal.cpp:496: error: expected unqualified-id before ‘__complex__’ /home/w/<em>opencv</em>-3.2.0/modules/core/src/hal_internal.cpp:496: error: expected ‘)’ before ‘__complex__’ /home/w/<em>opencv</em>-3.2.0/modules/core/src/hal_internal.cpp:501: error: expected unqualified-id before ‘__complex__’ /home/w/<em>opencv</em>-3.2.0/modules/core/src/hal_internal.cpp:501: error: expected ‘)’ before ‘__complex__’ /home/w/<em>opencv</em>-3.2.0/modules/core/src/hal_internal.cpp:504: error: ‘cAlpha’ was not declared in this scope /home/w/<em>opencv</em>-3.2.0/modules/core/src/hal_internal.cpp:504: error: ‘cBeta’ was not declared in this scope /home/w/<em>opencv</em>-3.2.0/modules/core/src/hal_internal.cpp:506: error: ‘cAlpha’ was not declared in this scope /home/w/<em>opencv</em>-3.2.0/modules/core/src/hal_internal.cpp:506: error: ‘cBeta’ was not declared in this scope /home/w/<em>opencv</em>-3.2.0/modules/core/src/hal_internal.cpp: In function ‘int lapack_gemm_c(const fptype*, size_t, const fptype*, size_t, fptype, const fptype*, size_t, fptype, fptype*, size_t, int, int, int, int) [with fptype = float]’: /home/w/<em>opencv</em>-3.2.0/modules/core/src/hal_internal.cpp:591: instantiated from here /home/w/<em>opencv</em>-3.2.0/modules/core/src/hal_internal.cpp:439: warning: unused variable ‘ldsrc3’ [-Wunused-variable] /home/w/<em>opencv</em>-3.2.0/modules/core/src/hal_internal.cpp: At global scope: /home/w/<em>opencv</em>-3.2.0/modules/core/src/hal_internal.cpp:434: warning: unused parameter ‘alpha’ [-Wunused-parameter] /home/w/<em>opencv</em>-3.2.0/modules/core/src/hal_internal.cpp: In function ‘int lapack_gemm_c(const fptype*, size_t, const fptype*, size_t, fptype, const fptype*, size_t, fptype, fptype*, size_t, int, int, int, int) [with fptype = double]’: /home/w/<em>opencv</em>-3.2.0/modules/core/src/hal_internal.cpp:598: instantiated from here /home/w/<em>opencv</em>-3.2.0/modules/core/src/hal_internal.cpp:439: warning: unused variable ‘ldsrc3’ [-Wunused-variable] /home/w/<em>opencv</em>-3.2.0/modules/core/src/hal_internal.cpp: At global scope: /home/w/<em>opencv</em>-3.2.0/modules/core/src/hal_internal.cpp:434: warning: unused parameter ‘alpha’ [-Wunused-parameter] modules/core/CMakeFiles/<em>opencv</em>_core.dir/build.<em>make</em>:930: recipe for target 'modules/core/CMakeFiles/<em>opencv</em>_core.dir/src/hal_internal.cpp.o' failed <em>make</em>[2]: *** [modules/core/CMakeFiles/<em>opencv</em>_core.dir/src/hal_internal.cpp.o] Error 1 CMakeFiles/Makefile2:1289: recipe for target 'modules/core/CMakeFiles/<em>opencv</em>_core.dir/all' failed <em>make</em>[1]: *** [modules/core/CMakeFiles/<em>opencv</em>_core.dir/all] Error 2 Makefile:160: recipe for target 'all' failed <em>make</em>: *** [all] Error 2
xubuntu编译OpencV2.4.2出现make交叉编译出现错误。
假定已经有<em>安装</em>包。 更新软件列表,升级 sudo apt-get update sudo apt-get upgrade <em>安装</em>依赖包 sudo apt-get install build-essential libgtk2.0-dev libjpeg-dev libtiff4-dev libjasper-dev libopenexr-dev c<em>make</em> python-dev python-
cmake编译opencv报错
错误 CMakeFiles/<em>opencv</em>_example.dir/example.cpp.o:在函数‘main’中: example.cpp:(.text+0x12c):对‘cv::imshow(cv::String const&, cv::_InputArray const&)’未定义的引用 example.cpp:(.text+0x21d):对‘cv::imshow(cv::String
Linux入门:安装opencv后报错
在CentOS中<em>安装</em>了<em>opencv</em>-python 之后,在使用 import cv2 <em>时</em>报错和相应的解决方法(在CentOS中没有apt-get<em>时</em>,可以使用如下方法)。 错误1: ImportError: libSM.so.6: cannot open shared object file: No such file or directory 解决方法: 提示需要的<em>安装</em>包 yum wh...
编译OpenCV3.4.1出现的一些问题
使用CMake编译 编译文件夹在<em>opencv</em><em>安装</em>文件夹下,名字是release  1.https://blog.csdn.net/huihut/article/details/78701814 D:\<em>opencv</em>\sources\3rdparty\protobuf\src\google\protobuf\stubs\io_win32.cc:94:3: warning: identifier...
OpenCV使用CMake和MinGW的编译安装及其在Qt配置运行
软件环境 Windows-10-64bit Qt-5.9.3 MinGW-5.3.0-32bit CMake-3.9.2 OpenCV-3.3.1 / 3.4.1(适用) 编译好的 OpenCV(MinGW 版): Github . huihut/OpenCV-MinGW-Build OpenCV 的 MSVC 版及 MinGW 版 MSVC 版 下载的 OpenCV ...
Opencv 使用cmake和mingw 编译安装
转自 <em>opencv</em> 使用c<em>make</em> he mingw编译<em>安装</em>软件环境Windows-10-64bitQt-5.9.3MinGW-5.3.0-32bitCMake-3.9.2OpenCV-3.3.1 / 3.4.1(适用)编译好的 OpenCV(MinGW 版):Github . huihut/OpenCV-MinGW-BuildOpenCV 的 MSVC 版及 MinGW 版MSVC 版下载的 O...
Linux编译安装OpenCV
文章目录系统环境相关依赖下载OpenCV下载编译和<em>安装</em>错误集锦Tips 系统环境 System: Ubuntu 16.04 LTS 相关依赖下载 sudo apt-get update sudo apt-get install build-essential sudo apt-get install c<em>make</em> git libgtk2.0-dev pkg-config sudo apt-get i...
Linux安装opencv(附带出错,解决方法参考)
参考的<em>opencv</em>的一个社区里的解决方案 错误如下 CMake Error at c<em>make</em>/OpenCVDetectCXXCompiler.c<em>make</em>:85 (list): list GET given empty list Call Stack (most recent call first): CMakeLists.txt:68 (include) CMake Error at...
ubuntu 18.04安装opencv-2.4.10遇错解决
<em>安装</em><em>opencv</em>-2.4.10,执行<em>make</em> -j7<em>时</em>报如下错误: 问题1: ffmpeg错误 [ 17%] Building CXX object modules/highgui/CMakeFiles/<em>opencv</em>_highgui.dir/src/grfmt_exr.cpp.o In file included from /home/hri/MyInstallSoftware/<em>opencv</em>-2....
安装opencv3.2.0 cmake出现 CMakeFiles/Makefile2:1264: recipe for target 'modules/cudev/test/CMakeFiles/o
问题:CMakeFiles/<em>opencv</em>_test_cudev.dir/<em>opencv</em>_test_cudev_generated_test_arithm_func.cu.o:在函数‘testing::internal::TypeParameterizedTest&amp;lt;SqrtTest, testing::internal::TemplateSel&amp;lt;SqrtTest_GpuMat_Test&amp;g...
linux下编译opencv的C++代码命令
命令为: g++ -std=c++11 test.cpp `pkg-config --cflags --libs <em>opencv</em>` -o test 其中添加-std=c++11选项才能正常编译C++11标准的代码; 其中pkg-config --cflags --libs <em>opencv</em>为所配置的<em>opencv</em>路径: ...
Linux 编译基于Opencv的C++项目
背景:在<em>linux</em>下使用c<em>make</em>编译C++项目,其中使用的到<em>opencv</em>,有两种方法 1、项目中只有简单的一个源码文件,直接使用命令,这个没有亲测,仅是记录 gcc Test.c -o Test `pkg-config --cflags --libs <em>opencv</em>` 2、使用c<em>make</em>list文件进行编译 我尝试过直接在c<em>make</em>list文件中设置 <em>opencv</em>的include和lib...
关于mingw32-make的错误
参考:https://blog.csdn.net/fengxueniu/article/details/77478669?locationNum=10&amp;amp;fps=1关于:E:\OpenVC\<em>opencv</em>\sources\modules\videoio\src\cap_dshow.cpp的错误参考:http://blog.csdn.net/huihut/article/details/7870...
在Ubuntu下,编译Kernel报错:Makefile:xxx: recipe for target 'xxx' failed
**在Ubuntu下,编译Kernel报如下错误:** Makefile:xxx: recipe for target 'xxx' failed <em>make</em>[2]:***[arch/arm/boot/compressed/piggy.lzo] Error 1 <em>make</em>[1]: ***[arch/arm/boot/compressed/vm<em>linux</em>] Error 2 如下图所示: 原因:缺少工具l...
Ubuntu16.04+cuda9.1安装opencv3.4.0 make出错
Ubuntu16.04+cuda9.1<em>安装</em><em>opencv</em>3.4.0<em>时</em><em>出错</em> c<em>make</em>为3.10.2 python版本2.7 <em>make</em>之后<em>出错</em>: Built target libwebp Scanning
Ubuntu编译OpenCV3.2出现
当出现的错误类似: n file included from /home/yang/<em>opencv</em>-3.2.0/modules/core/src/hal_internal.cpp:49:0: /home/yang/<em>opencv</em>-3.2.0/build/<em>opencv</em>_lapack.h:2:10: fatal error: LAPACKE_H_PATH-NOTFOUND/lapacke.h: No ...
opencv配置cmake失败
c<em>make</em><em>时</em>出现 -- Detected version of GNU GCC: 54 (504) -- Found ZLIB: /usr/lib/i386-<em>linux</em>-gnu/libz.so (found suitable version "1.2.8", minimum required is "1.2.3") -- Could NOT find TIFF (missing: TIFF_
codeblocks-MinGW-4.8.1+opencv3.0+cmake遇到的问题及解决办法
首先设置环境变量,包含mingw的一些路径,minGW路径为E:\CodeBlocks\MinGW Include :E:\CodeBlocks\MinGW\include; Lib:E:\CodeBlocks\MinGW\lib; Path:E:\CodeBlocks\MinGW\bin;E:\CodeBlocks\MinGW\libexec\gcc\mingw32\4.8.1;E:\Co
Ubuntu14联合安装opencvopencv_contrib踩过的坑
1.下载好Opencv3.4.1与对应版本的Opencv_contrib3.4.1: https://github.com/<em>opencv</em> 并把<em>opencv</em>_contrib文件放到<em>opencv</em>3.4.1文件夹下,并在这个文件夹下建立build文件夹 2.<em>安装</em>必要依赖项(虽然不知道干吗用的,不<em>安装</em>编译通不过,而且报莫名其妙的错误): sudo apt-get install build-es...
'modules/cudalegacy/CMakeFiles/opencv_cudalegacy.dir/all' failed
在编译<em>安装</em><em>opencv</em><em>时</em>可能会报错modules/cudalegacy/CMakeFiles/<em>opencv</em>_cudalegacy.dir/build.<em>make</em>:290: recipe for target ‘modules/cudalegacy/CMakeFiles/<em>opencv</em>_cudalegacy.dir/src/graphcuts.cpp.o’ failed <em>make</em>[2]: *** [m
OpenCV编译 Make出错 recipe for target 'modules/imgproc/CMakeFiles/opencv_test_imgproc.dir/all' failed...
OpenCV编译 Make<em>出错</em> recipe for target 'modules/imgproc/CMakeFiles/<em>opencv</em>_test_imgproc.dir/all' failed 添加编译选项 -DENABLE_PRECOMPILED_HEADERS=OFF 相关连接: https://www.cnblogs.com/liutianchen/p/60898...
opencv cmake编译错误
使用C<em>make</em>编译<em>opencv</em>源码遇到如下错误 **CMake Error: The following variables are used in this project, but they are set to NOTFOUND. Please set them or <em>make</em> sure they are set and tested correctly in the CMake fil...
使用cmake重新编译opencv配置总出错
因为要使用CUDA+<em>opencv</em> 在使用c<em>make</em>3.4.3以及最新版编译<em>opencv</em>的<em>时</em>候配置总<em>出错</em> 错误提醒一直是 CMake Error at CMakeLists.txt:93 (projec
ubuntu编译opencv3.4.1遇到 [modules/imgcodecs/CMakeFiles/opencv_imgcodecs.dir/all] 错误 2
记录一下ubuntu编译<em>opencv</em>3.4.1遇到问题 重新编译了一下<em>opencv</em>3.4.1遇[modules/imgcodecs/CMakeFiles/<em>opencv</em>_imgcodecs.dir/all] 错误 2 需要<em>安装</em>这个包   libopenexr-dev
openCV安装出错
<em>安装</em><em>时</em>c<em>make</em>编译后出现错误 -- Configuring incomplete, errors occurred! See also "/home/mwx/<em>opencv</em>-3.2.0/CMakeFi
我用Cmake编译opencv3.0一直在97%的地方出错,万能的大神们,求救啊
这是97%之后的 In file included from C:/Python/include/Python.h:8:0, from C:\<em>opencv</em>\sources\modules\python
opencv安装,cmake完成,make候,报错/usr/include/c++/6.2.1/cmath:45:23: 致命错误:math.h
错误代码如下: Generating precomp.hpp.gch/<em>opencv</em>_core_bulid.gch In file included from /home/chenjianwen/ope
OpenCV使用CMake和MinGW-w64的编译安装
前言 之前写过的一篇博文:OpenCV使用CMake和MinGW的编译<em>安装</em>及其在Qt配置运行 是使用 32 位的 MinGW 在 Windows 下编译 OpenCV 生成 32 位的 dll。 而这篇博文是使用 64 位的 MinGW 编译 OpenCV 生成 64 位的 dll。 因为博主没有 64 位 q<em>make</em>,所以没勾选 WITH_QT 编译好的 OpenCV(MinGW 版...
Ubuntu安装opencv编译make出错
我用的是Ubuntu10.04版本的,装的是<em>opencv</em>2.4.13,可以c<em>make</em>过去,但是<em>make</em><em>时</em>出现以下问题: Built target pch_Generate_<em>opencv</em>_imgproc
跪求cmake交叉编译出错原因!!!
Linking CXX shared library ../../lib/lib<em>opencv</em>_core.so /opt/EmbedSky/4.4.6/lib/gcc/arm-embedsky-<em>linux</em>-gnueabi/4.4.6/../../../../arm-embedsky-<em>linux</em>-gnueabi/bin/ld: ../../3rdparty/lib/libzlib.a(inflate.c.obj): relocation R_ARM_MOVW_ABS_NC against `a local symbol' can not be used when making a shared object; recompile with -fPIC ../../3rdparty/lib/libzlib.a: could not read symbols: Bad value collect2: ld returned 1 exit status <em>make</em>[2]: *** [lib/lib<em>opencv</em>_core.so] 错误 1 <em>make</em>[1]: *** [modules/core/CMakeFiles/<em>opencv</em>_core.dir/all] 错误 2 <em>make</em>: *** [all] 错误 2 请问这是什么错误啊? <em>opencv</em>路径及版本:/usr/local/ Opencv2.4.1 c<em>make</em>路径及版本:/usr/local/ c<em>make</em>-2.8.12.2-Linux-i386 用户:root
make: *** [include/sndversions.h] 错误 2
从网上下了 alsa-driver-1.0.20.tar.bz2 alsa-lib-1.0.20.tar.bz2 alsa-utils-1.0.20.tar.bz2 先装DRIVER ./configure ----没有问题 <em>make</em>         ----出现错误: <em>make</em> dep <em>make</em>[1]: 正在进入目录 `/home/jhx/桌面/alsa
opencv交叉编译错误处理
[ 24%] Linking CXX shared library ../../lib/lib<em>opencv</em>_highgui.so /opt/arm-<em>linux</em>-gnueabihf/bin/../lib/gcc/arm-<em>linux</em>-gnueabihf/4.9.2/../../../../arm-<em>linux</em>-gnueabihf/bin/ld: ../../3rdparty/lib/liblibpng
Makefile:138: recipe for target 'all' failed make: *** [all] Error 2
ROS中出现这种情况,看下是不是功能包中的路径没有设置好,打开该功能包的CMakeLists.txt,编辑 ## Specify additional locations of header files ## Your package locations should be listed before other locations include_directories(   #include...
[环境配置]Ubuntu 16.04 源码编译安装OpenCV-3.2.0+OpenCV_contrib-3.2.0及产生的问题
1.OpenCV-3.2.0+OpenCV_contrib-3.2.0编译<em>安装</em>过程 1)下载官方要求的依赖包 GCC 4.4.x or later CMake 2.6 or higher Git GTK+2.x or higher, including headers (libgtk2.0-dev) # 控制<em>opencv</em> GUI pkg-config Python 2.6 or la...
安装opencv-3.1.0.zip 出错的解决方法,小记一下
ubuntu14.04<em>安装</em>caffe+cuda7.5的步骤见另外两篇 Caffe <em>安装</em>配置步骤 http://blog.csdn.net/windrainlife/article/details/52217317 ubuntu14.04<em>安装</em>cuda6.5简易版本,易操作: http://blog.csdn.net/windrainlife/article/details/52217
使用cmake生成OpenCV源代码工程的解决方案遇到报错
使用的版本<em>opencv</em>-3.0.0.exe,c<em>make</em>-3.9.1-win32-x86.exe,vs2015.求大神帮我看看怎么解决,网上看了一堆方法都没解决。 CMake Deprecation W
CMAKE编译opencv源码错误解决办法
因为最近想看看<em>opencv</em>的源码,就下了c<em>make</em>-2.8.8-win32-x86.exe,<em>opencv</em>版本为2.4.9,vs版本为2010,运行c<em>make</em>,选好source code 和build the binaries的文件夹路径,然后点击Configure,不料出现error in configurration process,project files may be invalid错误,
ubuntu下安装opencv,cmake出错,解决方法
ubuntu <em>opencv</em><em>安装</em><em>时</em>,c<em>make</em> -- Configuring incomplete, errors occurred!CMakeOutput.log
OpenCV报错之 Microsoft C++ 异常: cv::Exception
** OpenCV报错之 Microsoft C++ 异常: cv::Exception ** 最近开始学习<em>opencv</em>,之前配置的2.4.9版本觉得太老,错误又多,所以重新配置了一个新的版本VS2015+OpenCV3.2.0,使用的64位,可能会遇上不少问题,希望在此记录自己的错误,与君共勉。 “Microsoft C++ 异常: cv::Exception,位于内存位置0x000000C38...
Opencv的交叉编译错误的修改
第一次写博客,别喷。
opencv2.4.9 linux源码安装过程及问题
Scanning dependencies of target <em>opencv</em>_core [ 10%] Building CXX object modules/core/CMakeFiles/<em>opencv</em>_core.dir/src/system.cpp.o Linking CXX shared library ../../lib/lib<em>opencv</em>_core.so [ 15%] Built t
opencv3.1.0在ubutun14.04上编译出错问题
我在编译<em>opencv</em>的<em>时</em>候,总是出现这个错误: [ 33%] Building CXX object modules/core/CMakeFiles/<em>opencv</em>_core.dir/src/rand.cpp.o [ 33%] Building CXX object modules/core/CMakeFiles/<em>opencv</em>_core.dir/opencl_kernels_core.c
centos7 make[2]: *** [modules/highgui/CMakeFiles/opencv_highgui.dir/src/grfmt_jpeg2000.cpp.o] 错误 1
问题描述: [plain] view plain copy [ 17%] Building CXX object modules/highgui/CMakeFiles/<em>opencv</em>_highgui.dir/src/grfmt_jpeg2000.cpp.o   In file included from /usr/include/jasper/j
make[2]: *** [modules/cudalegacy/CMakeFiles/opencv_cudalegacy.dir/src/graphcuts.cpp.o] Error 1 make[
那是因为 cuda-8.0与OpenCV 3.1.0发生了冲突。解决方法:修改openCV 3.1.0源码,使其兼容cuda-8.0 $ sudo vi <em>opencv</em>-3.1.0/modules/cudalegacy/src/graphcuts.cpp 将第四十五行位置的 #if !defined (HAVE_CUDA) || defined (CUDA_DISABLER) 改为 #
树莓派安装opencv2.4.9--make出错
错误: <em>make</em>[2]: *** [modules/highgui/CMakeFiles/<em>opencv</em>_highgui.dir/src/cap_ffmpeg.o] Error 1   <em>make</em>[1]: *** [modules/highgui/CMakeFiles/<em>opencv</em>_highgui.dir/all] Error 2   <em>make</em>: *** [all] Error 2
Caffe+Kubuntu16.04_X64+CUDA 8.0配置
前言: 经过尝试过几次Caffe,theano,MxNet之后,很长<em>时</em>间没有进行caffe的更新,此次在Ubuntu16.04下<em>安装</em>Caffe,折腾了一天<em>时</em>间,终于<em>安装</em>成功。 参考链接:Caffe+UbuntuKylin14.04_X64+CUDA 6.5配置 一 配置CUDA8.0 既然使用了最新...
用cmake编译Opencv2.3.1到ARM上面总是出错
我用的交叉编译工具是arm-<em>linux</em>-gnueabihf-4.7.3每次编译到Linking CXX shared library ../../lib/lib<em>opencv</em>_core.so 就会报错
为什么我在linux系统PC端编译OpenCV,用的是cmake-gui,make到这个地方的候就总是报错过不去
Building CXX object modules/highgui/CMakeFiles/<em>opencv</em>_highgui.dir/src/window_QT.o /home/fl/tool/Ope
opencv recipe for target 'all' failed解决
<em>opencv</em> recipe for target 'all' failed解决
(更新v2018.1.24版)Opencv Qt 学习笔记(一)安装qt opencv 环境Win7(cmake3.9.1和Opencv3.3.0)
开始配置: 1.下载所需工具: (1) Qt: https://download.qt.io/official_releases/ (2) OpenCV: http://<em>opencv</em>.org/ (3) CMake: http://www.c<em>make</em>.org/c<em>make</em>/resources/software.html 2.<em>安装</em>Qt ;(记得添加环境变量F:\C++\
用MinGW编译opencv出错解决办法:(gcc 7.1.0 and cmake 3.9.0)->出错提示: windres.exe: unknown option -- W
环境Windows 7 x64 按照网上的教程<em>安装</em>qt和<em>opencv</em>的过程中,对<em>opencv</em>-3.4.0源码进行编译<em>时</em>,出现如下错误   &amp;gt; <em>make</em> [ 2%] Built target zlib [ 5%] Built target libtiff [ 8%] Built target libjpeg [ 16%] Built target libwebp [ 19%] B...
OpenCV300 CMake生成工程项目过程中的问题
2015年6月4日,OpenCV官网上面给出了最新版本的OpenCV,即:3.0.0版本,http://<em>opencv</em>.org/ 用CMake对其生成VS2010工程过程中,遇到个奇怪的问题: CMake Error at 3rdparty/ippicv/downloader.c<em>make</em>:97 (message):   ICV: Failed to unpack ICV package
caffe---make发生的错误和解决办法1
In file included from src/caffe/util/im2col.cpp:4:0: ./include/caffe/util/math_functions.hpp:7:26: fatal error: glog/logging.h: 没有那个文件或目录  #include "glog/logging.h"                           ^ com
opencv运行出错,跪求大神解决
#include #include #include usi
树莓派3B+配置opencv make出错
Opencv的<em>安装</em>参考https://blog.csdn.net/a1379478560/article/details/80554670 https://www.cnblogs.com/farewell-farewell/p/6125761.html 使用镜像可以加快下载资源的下载速度哟~ sudo vi /etc/apt/sources.list 阿里云镜像: deb http:...
OpenCV CMake后vs编译INSTALL报错,不成功
环境: 1.系统win7,64位 2.VS2010 3.<em>opencv</em>3.43   错误 error MSB3073: 命令“setlocal1&amp;gt;C:\Program Files (x86)\MSBuild\Microsoft.Cpp\v4.0\Microsoft.CppCommon.targets(113,5): error MSB3073: 命令“setlocal 1&amp;gt;C:...
转换到 COFF 期间失败: 文件无效或损坏
收藏自论坛http://bbs.csdn.net/topics/390121452?page=1#post-393823535 记录下来,以备翻阅。 VS 2010下 打开实例 出现这样的错误: LINK : fatal error LNK1123: 转换到 COFF 期间失败: 文件无效或损坏 终极解决方案: VS2010在经历一些更新后,建立Win32 Console Proje
Java学习的正确打开方式
在博主认为,对于入门级学习java的最佳学习方法莫过于视频+博客+书籍+总结,前三者博主将淋漓尽致地挥毫于这篇博客文章中,至于总结在于个人,实际上越到后面你会发现学习的最好方式就是阅读参考官方文档其次就是国内的书籍,博客次之,这又是一个层次了,这里暂<em>时</em>不提后面再谈。博主将为各位入门java保驾护航,各位只管冲鸭!!!上天是公平的,只要不辜负<em>时</em>间,<em>时</em>间自然不会辜负你。 何谓学习?博主所理解的学习,它是一个过程,是一个不断累积、不断沉淀、不断总结、善于传达自己的个人见解以及乐于分享的过程。
程序员必须掌握的核心算法有哪些?
由于我之前一直强调数据结构以及算法学习的重要性,所以就有一些读者经常问我,数据结构与算法应该要学习到哪个程度呢?,说实话,这个问题我不知道要怎么回答你,主要取决于你想学习到哪些程度,不过针对这个问题,我稍微总结一下我学过的算法知识点,以及我觉得值得学习的算法。这些算法与数据结构的学习大多数是零散的,并没有一本把他们全部覆盖的书籍。下面是我觉得值得学习的一些算法以及数据结构,当然,我也会整理一些看过...
大学四年自学走来,这些私藏的实用工具/学习网站我贡献出来了
大学四年,看课本是不可能一直看课本的了,对于学习,特别是自学,善于搜索网上的一些资源来辅助,还是非常有必要的,下面我就把这几年私藏的各种资源,网站贡献出来给你们。主要有:电子书搜索、实用工具、在线视频学习网站、非视频学习网站、软件下载、面试/求职必备网站。 注意:文中提到的所有资源,文末我都给你整理好了,你们只管拿去,如果觉得不错,转发、分享就是最大的支持了。 一、电子书搜索 对于大部分程序员...
linux系列之常用运维命令整理笔录
本博客记录工作中需要的<em>linux</em>运维命令,大学<em>时</em>候开始接触<em>linux</em>,会一些基本操作,可是都没有整理起来,加上是做开发,不做运维,有些命令忘记了,所以现在整理成博客,当然vi,文件操作等就不介绍了,慢慢积累一些其它拓展的命令,博客不定<em>时</em>更新 free -m 其中:m表示兆,也可以用g,注意都要小写 Men:表示物理内存统计 total:表示物理内存总数(total=used+free) use...
比特币原理详解
一、什么是比特币 比特币是一种电子货币,是一种基于密码学的货币,在2008年11月1日由中本聪发表比特币白皮书,文中提出了一种去中心化的电子记账系统,我们平<em>时</em>的电子现金是银行来记账,因为银行的背后是国家信用。去中心化电子记账系统是参与者共同记账。比特币可以防止主权危机、信用风险。其好处不多做赘述,这一层面介绍的文章很多,本文主要从更深层的技术原理角度进行介绍。 二、问题引入 假设现有4个人...
程序员接私活怎样防止做完了不给钱?
首先跟大家说明一点,我们做 IT 类的外包开发,是非标品开发,所以很有可能在开发过程中会有这样那样的需求修改,而这种需求修改很容易造成扯皮,进而影响到费用支付,甚至出现做完了项目收不到钱的情况。 那么,怎么保证自己的薪酬安全呢? 我们在开工前,一定要做好一些证据方面的准备(也就是“讨薪”的理论依据),这其中最重要的就是需求文档和验收标准。一定要让需求方提供这两个文档资料作为开发的基础。之后开发...
网页实现一个简单的音乐播放器(大佬别看。(⊙﹏⊙))
今天闲着无事,就想写点东西。然后听了下歌,就打算写个播放器。 于是乎用h5 audio的加上js简单的播放器完工了。 演示地点演示 html代码如下` music 这个年纪 七月的风 音乐 ` 然后就是css`*{ margin: 0; padding: 0; text-decoration: none; list-...
Python十大装B语法
Python 是一种代表简单思想的语言,其语法相对简单,很容易上手。不过,如果就此小视 Python 语法的精妙和深邃,那就大错特错了。本文精心筛选了最能展现 Python 语法之精妙的十个知识点,并附上详细的实例代码。如能在实战中融会贯通、灵活使用,必将使代码更为精炼、高效,同<em>时</em>也会极大提升代码B格,使之看上去更老练,读起来更优雅。
数据库优化 - SQL优化
以实际SQL入手,带你一步一步走上SQL优化之路!
通俗易懂地给女朋友讲:线程池的内部原理
餐盘在灯光的照耀下格外晶莹洁白,女朋友拿起红酒杯轻轻地抿了一小口,对我说:“经常听你说线程池,到底线程池到底是个什么原理?”
经典算法(5)杨辉三角
杨辉三角 是经典算法,这篇博客对它的算法思想进行了讲解,并有完整的代码实现。
使用 Docker 部署 Spring Boot 项目
Docker 技术发展为微服务落地提供了更加便利的环境,使用 Docker 部署 Spring Boot 其实非常简单,这篇文章我们就来简单学习下。首先构建一个简单的 S...
英特尔不为人知的 B 面
从 PC <em>时</em>代至今,众人只知在 CPU、GPU、XPU、制程、工艺等战场中,英特尔在与同行硬件芯片制造商们的竞争中杀出重围,且在不断的成长进化中,成为全球知名的半导体公司。殊不知,在「刚硬」的背后,英特尔「柔性」的软件早已经做到了全方位的支持与支撑,并持续发挥独特的生态价值,推动产业合作共赢。 而对于这一不知人知的 B 面,很多人将其称之为英特尔隐形的翅膀,虽低调,但是影响力却不容小觑。 那么,在...
面试官:你连RESTful都不知道我怎么敢要你?
干货,2019 RESTful最贱实践
刷了几千道算法题,这些我私藏的刷题网站都在这里了!
遥想当年,机缘巧合入了 ACM 的坑,周边巨擘林立,从此过上了"天天被虐似死狗"的生活… 然而我是谁,我可是死狗中的战斗鸡,智力不够那刷题来凑,开始了夜以继日哼哧哼哧刷题的日子,从此"读题与提交齐飞, AC 与 WA 一色 ",我惊喜的发现被题虐既刺激又有快感,那一刻我泪流满面。这么好的事儿作为一个正直的人绝不能自己独享,经过激烈的颅内斗争,我决定把我私藏的十几个 T 的,阿不,十几个刷题网...
白话阿里巴巴Java开发手册高级篇
不久前,阿里巴巴发布了《阿里巴巴Java开发手册》,总结了阿里巴巴内部实际项目开发过程中开发人员应该遵守的研发流程规范,这些流程规范在一定程度上能够保证最终的项目交付质量,通过在<em>时</em>间中总结模式,并推广给广大开发人员,来避免研发人员在实践中容易犯的错误,确保最终在大规模协作的项目中达成既定目标。 无独有偶,笔者去年在公司里负责升级和制定研发流程、设计模板、设计标准、代码标准等规范,并在实际工作中进行...
SQL-小白最佳入门sql查询一
不要偷偷的查询我的个人资料,即使你再喜欢我,也不要这样,真的不好;
redis分布式锁,面试官请随便问,我都会
文章有点长并且绕,先来个图片缓冲下! 前言 现在的业务场景越来越复杂,使用的架构也就越来越复杂,分布式、高并发已经是业务要求的常态。像腾讯系的不少服务,还有CDN优化、异地多备份等处理。 说到分布式,就必然涉及到分布式锁的概念,如何保证不同机器不同线程的分布式锁同步呢? 实现要点 互斥性,同一<em>时</em>刻,智能有一个客户端持有锁。 防止死锁发生,如果持有锁的客户端崩溃没有主动释放锁,也要保证锁可以正常释...
项目中的if else太多了,该怎么重构?
介绍 最近跟着公司的大佬开发了一款IM系统,类似QQ和微信哈,就是聊天软件。我们有一部分业务逻辑是这样的 if (msgType = "文本") { // dosomething } else if(msgType = "图片") { // doshomething } else if(msgType = "视频") { // doshomething } else { // doshom...
Nginx 原理和架构
Nginx 是一个免费的,开源的,高性能的 HTTP 服务器和反向代理,以及 IMAP / POP3 代理服务器。Nginx 以其高性能,稳定性,丰富的功能,简单的配置和低资源消耗而闻名。 Nginx 的整体架构 Nginx 里有一个 master 进程和多个 worker 进程。master 进程并不处理网络请求,主要负责调度工作进程:加载配置、启动工作进程及非停升级。worker 进程负责处...
“狗屁不通文章生成器”登顶GitHub热榜,分分钟写出万字形式主义大作
一、垃圾文字生成器介绍 最近在浏览GitHub的<em>时</em>候,发现了这样一个骨骼清奇的雷人项目,而且热度还特别高。 项目中文名:狗屁不通文章生成器 项目英文名:BullshitGenerator 根据作者的介绍,他是偶尔需要一些中文文字用于GUI开发<em>时</em>测试文本渲染,因此开发了这个废话生成器。但由于生成的废话实在是太过富于哲理,所以最近已经被小伙伴们给玩坏了。 他的文风可能是这样的: 你发现,...
程序员:我终于知道post和get的区别
是一个老生常谈的话题,然而随着不断的学习,对于以前的认识有很多误区,所以还是需要不断地总结的,学而<em>时</em>习之,不亦说乎
《程序人生》系列-这个程序员只用了20行代码就拿了冠军
你知道的越多,你不知道的越多 点赞再看,养成习惯GitHub上已经开源https://github.com/JavaFamily,有一线大厂面试点脑图,欢迎Star和完善 前言 这一期不算《吊打面试官》系列的,所有没前言我直接开始。 絮叨 本来应该是没有这期的,看过我上期的小伙伴应该是知道的嘛,双十一比较忙嘛,要值班又要去帮忙拍摄年会的视频素材,还得搞个程序员一天的Vlog,还要写BU...
加快推动区块链技术和产业创新发展,2019可信区块链峰会在京召开
11月8日,由中国信息通信研究院、中国通信标准化协会、中国互联网协会、可信区块链推进计划联合主办,科技行者协办的2019可信区块链峰会将在北京悠唐皇冠假日酒店开幕。   区块链技术被认为是继蒸汽机、电力、互联网之后,下一代颠覆性的核心技术。如果说蒸汽机释放了人类的生产力,电力解决了人类基本的生活需求,互联网彻底改变了信息传递的方式,区块链作为构造信任的技术有重要的价值。   1...
Java世界最常用的工具类库
Apache Commons Apache Commons有很多子项目 Google Guava 参考博客
程序员把地府后台管理系统做出来了,还有3.0版本!12月7号最新消息:已在开发中有github地址
第一幕:缘起 听说阎王爷要做个生死簿后台管理系统,我们派去了一个程序员…… 996程序员做的梦: 第一场:团队招募 为了应对地府管理危机,阎王打算找“人”开发一套地府后台管理系统,于是就在地府总经办群中发了项目需求。 话说还是中国电信的信号好,地府都是满格,哈哈!!! 经常会有外行朋友问:看某网站做的不错,功能也简单,你帮忙做一下? 而这次,面对这样的需求,这个程序员...
网易云6亿用户音乐推荐算法
网易云音乐是音乐爱好者的集聚地,云音乐推荐系统致力于通过 AI 算法的落地,实现用户千人千面的个性化推荐,为用户带来不一样的听歌体验。 本次分享重点介绍 AI 算法在音乐推荐中的应用实践,以及在算法落地过程中遇到的挑战和解决方案。 将从如下两个部分展开: AI算法在音乐推荐中的应用 音乐场景下的 AI 思考 从 2013 年 4 月正式上线至今,网易云音乐平台持续提供着:乐屏社区、UGC...
C#_List 的序列化.doc下载
用C#实现List对象的序列化,大家可以看看,也可以多提宝贵意见。 相关下载链接:[url=//download.csdn.net/download/haofang521105/2987088?utm_source=bbsseo]//download.csdn.net/download/haofang521105/2987088?utm_source=bbsseo[/url]
编程之美——微软技术面试心得下载
(1)1的数目 (2)NIM(2)“拈”游戏分析 (3)编程判断两个链表是否相交 (4)编程之美 让CPU占用率曲线听你指挥 (5)不要被阶乘吓倒 (6)瓷砖覆盖地板 (7)计算字符串的相似度 ………………………… (来自互联网) 相关下载链接:[url=//download.csdn.net/download/zhangyuehua123/3176896?utm_source=bbsseo]//download.csdn.net/download/zhangyuehua123/3176896?utm_source=bbsseo[/url]
High-voltage Differential Probes下载
High-voltage Differential Probes activate 相关下载链接:[url=//download.csdn.net/download/xiaozhilang/3560679?utm_source=bbsseo]//download.csdn.net/download/xiaozhilang/3560679?utm_source=bbsseo[/url]
相关热词 c# 二进制截断字符串 c#实现窗体设计器 c#检测是否为微信 c# plc s1200 c#里氏转换原则 c# 主界面 c# do loop c#存为组套 模板 c# 停掉协程 c# rgb 读取图片
我们是很有底线的