MSB3073错误 [问题点数:200分]

Bbs1
本版专家分:0
结帖率 98.46%
Bbs9
本版专家分:93809
版主
Blank
优秀版主 2016年8月优秀大版主
Blank
微软MVP 2019年7月 荣获微软MVP称号
2018年7月 荣获微软MVP称号
2017年7月荣获微软MVP称号
2016年10月荣获微软MVP称号
2015年10月荣获微软MVP称号
2014年10月荣获微软MVP称号
2013年10月 荣获微软MVP称号
2012年10月 荣获微软MVP称号
2011年10月 荣获微软MVP称号
2009年10月 荣获微软MVP称号
2010年10月 荣获微软MVP称号
2005年9月 荣获微软MVP称号
2008年10月 荣获微软MVP称号
2007年10月 荣获微软MVP称号
2006年10月 荣获微软MVP称号
Blank
红花 2018年12月 Windows专区大版内专家分月排行榜第一
2018年10月 Windows专区大版内专家分月排行榜第一
2018年7月 Windows专区大版内专家分月排行榜第一
2018年6月 Windows专区大版内专家分月排行榜第一
2018年5月 Windows专区大版内专家分月排行榜第一
2018年4月 Windows专区大版内专家分月排行榜第一
2018年2月 Windows专区大版内专家分月排行榜第一
2017年12月 Windows专区大版内专家分月排行榜第一
2017年11月 Windows专区大版内专家分月排行榜第一
2017年10月 Windows专区大板内专家分月排行榜第一
2017年9月 Windows专区大版内专家分月排行榜第一
2017年7月 Windows专区大版内专家分月排行榜第一
2017年6月 Windows专区大版内专家分月排行榜第一
2017年5月 Windows专区大版内专家分月排行榜第一
2016年10月 Windows专区大版内专家分月排行榜第一
2016年7月 Windows专区大版内专家分月排行榜第一
2016年5月 Windows专区大版内专家分月排行榜第一
2016年4月 Windows专区大版内专家分月排行榜第一
2016年2月 Windows专区大版内专家分月排行榜第一
2015年12月 Windows专区大版内专家分月排行榜第一
2015年10月 Windows专区大版内专家分月排行榜第一
2015年5月 Windows专区大版内专家分月排行榜第一
2015年1月 Windows专区大版内专家分月排行榜第一
2016年9月 Windows专区大版内专家分月排行榜第一
2014年4月 Windows专区大版内专家分月排行榜第一
2013年8月 Windows专区大版内专家分月排行榜第一
2013年7月 Windows专区大版内专家分月排行榜第一
2013年5月 Windows专区大版内专家分月排行榜第一
2013年4月 Windows专区大版内专家分月排行榜第一
Blank
黄花 2018年8月 Windows大版内专家分月排行榜第二
2018年3月 Windows专区大版内专家分月排行榜第二
2018年1月 Windows专区大版内专家分月排行榜第二
2017年8月 Windows专区大版内专家分月排行榜第二
2017年4月 Windows专区大版内专家分月排行榜第二
2017年3月 Windows专区大版内专家分月排行榜第二
2017年2月 Windows专区大版内专家分月排行榜第二
2017年1月 Windows专区大版内专家分月排行榜第二
2016年11月 Windows专区大版内专家分月排行榜第二
2016年8月 Windows专区大版内专家分月排行榜第二
2016年6月 Windows专区大版内专家分月排行榜第二
2016年3月 Windows专区大版内专家分月排行榜第二
2016年1月 Windows专区大版内专家分月排行榜第二
2015年7月 Windows专区大版内专家分月排行榜第二
2015年3月 Windows专区大版内专家分月排行榜第二
2014年2月 Windows专区大版内专家分月排行榜第二
2014年5月 Windows专区大版内专家分月排行榜第二
2013年11月 Windows专区大版内专家分月排行榜第二
2013年10月 Windows专区大版内专家分月排行榜第二
2013年6月 Windows专区大版内专家分月排行榜第二
2013年3月 Windows专区大版内专家分月排行榜第二
2006年1月 Windows专区大版内专家分月排行榜第二
error MSB3073的解决方案
1>C:\Program Files (x86)\MSBuild\Microsoft.Cpp\v4.0\V110\Microsoft.CppCommon.targets(134,5): error MSB3073: 命令“xcopy /E /F "C:/Users/mr/Desktop/mpsdk_progen/mpsdk_progen/sample.PC/mpviewer/resources/*
error MSB3073 这是什么错误呀?大家快来帮忙!
SMSClientService -> E:\ServiceMeSMS Project\ServiceMeSMS\SMSClientService\bin\Debug\SMSClientService
error MSB3073 错误解决办法
如果编译出现这个<em>错误</em>估计是版本不太不同造成的, 双击<em>错误</em>来到<em>错误</em>的地方 删除让你<em>错误</em>的那行, 编译没必要搞那么复杂
VS2015 编译时出现MSB3073错误如何解决?
<em>错误</em>的具体信息: <em>错误</em> MSB3073 命令“cmd /c copy /Y ..\..\..\..\code\lib\dynamic\orx*.dll ..\..\..\bin :VCEnd”已退出,
MSB3073 已退出,代码为 9009 的解决办法
MSB3073 已退出,代码为 9009 的解决办法
error MSB3073: :VCEnd”已退出,代码为 6
http://channel9.msdn.com/Forums/TechOff/Error-MSB3073-exited-with-code-3 最近在把vs6.0的程序用vs2010升级后,程序在编译时出现这个<em>错误</em>,找了一些网上的方法不试了下,不管用 最后解决方法为: 项目属性-配置属性-自定义生成步骤 ,修改“输出”项为“从父级或项目默认属性继承”即可 项目属性-配置属
关于将build 后发布到hololens时,“error MSB3073..已退出,代码为1“
放假之前一不小心剁了手,买了mbp,然而在开发hololens的时候还是要用到win10 的一系列东西,所以还是装了虚拟机,此为背景(此处省略一万字在虚拟机下安装hololens的开发环境),y因为之前在pc上没有碰到过这个问题。 然而在一切即将完成,却发现报了一长串<em>错误</em>,如下: 1>\\Mac\Home\Desktop\HololensProjects\MedicalTraning\Me
cocos2d-win32打不开怎么办啊 错误MSB3073
我用的win7 vs2015 cocos 2dx 3.15 但是打不开cocos2dwin32 怎么办 好伤心啊 求大神解答!!! [img=https://forum.csdn.net/PointForum/ui/scripts/csdn/Plugin/001/face/5.gif][/img][img=https://img-bbs.csdn.net/upload/201706/12/1497209705_674311.png][/img][img=https://img-bbs.csdn.net/upload/201706/12/1497209723_911821.png][/img][img=https://img-bbs.csdn.net/upload/201706/12/1497209734_442146.png][/img][img=https://img-bbs.csdn.net/upload/201706/12/1497209745_18817.png][/img]
VS 编译出错:MSB3073
今天在VS上修改工程遇到了MSB3070 <em>错误</em>,总的来说没有其他原因,就是在Project -> Properties -> Build Event -> prebuild/postbuild 中 command line 写错了,切记再三check 你所写的命令正确性, 包括语法,命令参数和 文件名文件路径的正确性。 如果不确定,可以在当前工程目录下,切记是当前工程的目录下执行用cmd执行你的命
VS2015种 MSB3073和LNK1104的解决办法
1、MSB3073 :<em>错误</em>列表一般显示:一个mikedir命令和copy命令出错,严格找一下这个路径,也许是路径名字一个字幕的大小写问题。其次:Build Events-&amp;gt;Post Build Events。这个地方要求运行一个cmd脚本,脚本里就写了一些拷贝命令,把一些文件从a路径拷贝到b路径,而其中一个命令里,路径b并不存在,所以拷贝失败,导致报了这个<em>错误</em>。2、LNK1104: 显示打不...
error MSB3073
<em>错误</em>提示:error MSB3073: 命令“copy E:\Release\64.exe C:\test\原因分析:可能是c盘拷贝数据无权限解决方案:1、手动把对应文件拷贝到对应位置2、后期生成事件去掉3、使用管理员账户(不是具有管理员权限)...
关于Visual Studio 2017中 MSB3073的问题
-
新人求助!编译gdcm时error MSB3073: 命令“setlocal
我在用vs2010编译gdcm(类似于vtk)的时候,生成INSTALL的时候提示error MSB3073: 命令“setlocal 求助!设置管理员权限运行没有用。。。怎么办
error MSB3073: :VCEnd”已退出,代码为 1 error MSB3073: :copy............
遇到copy的<em>错误</em>,查看一下要复制的路径是否存在,如果不存在,创建即可。
vs 工程 错误 error MSB3073: 命令 原因之一
有时,会突然间好好的工程就一堆下图的<em>错误</em>: 其中一个原因是调试或运行后,程序进程并没有关闭,可在资源管理器中看到,于是dll被占用,自然不能被编译出的dll替换。 手动结束进程后再编译就没问题 了,所以问题就在于程序关闭后为什么进程还没结束。
VS2013+CMake+编译时遇到的问题 MSB3073
bulid INSTALL工程时,发生如下<em>错误</em>: error MSB3073: The command "setlocal E:\cmake3.0.0\CMake\bin\cmake.exe -DBUILD_TYPE=Debug -P cmake_install.cmake if %errorlevel% neq 0 goto :cmEnd :cmEnd endlocal & call
error MSB3073 代码为 3
rn项目-》属性-》配置属性-》自定义生成步骤-》输出-》继承父类rn完美解决!!!rn参考一下文章:rnhttp://channel9.msdn.com/Forums/TechOff/Error-MSB3073-exited-with-code-3
编译ogre源码的时候出错 error MSB3073
编译ogre源码的时候出错 ``` <em>错误</em> 86 error MSB3073: 命令“"C:\Program Files\CMake 2.8\bin\cmake.exe" -E make_directory E:/ogre_src_v1-7-2/VS2008/lib/Debug if errorlevel 1 goto VCReportError :VCEnd”已退出,代码为 1。
新建一个ATL工程,编译出错,错误error MSB3073,请各位指教一下,谢谢
rnrn1> Description: 执行注册rn1>C:\Program Files\MSBuild\Microsoft.Cpp\v4.0\Microsoft.CppCommon.targets(113,5): error MSB3073: 命令“"D:\Work\ATL Project\TestOLEDB\Debug\TestOLEDB.exe" /RegServerrn1>C:\Program Files\MSBuild\Microsoft.Cpp\v4.0\Microsoft.CppCommon.targets(113,5): error MSB3073: :VCEnd”已退出,代码为 -2147319780。rnrn有说是编译器的问题,可是不知道怎么设置,环境是Visual Studio 2010 的C++,高手指点一下~~~
VS2013报错MSB3073
      最近莫名其妙的一个工程打开以后就报错MSB3073,网上有各种办法,修改VS配置,检查这个报错钱是否有其他<em>错误</em>,拷贝的原文件不存在等,我试过各种办法,还是不行。后来想到一个致命的<em>错误</em>,根目录可能有中文名的原因,其实之前就由于这个原因被坑过,出现各种莫名其面的<em>错误</em>,所以以后一定长记性,千万不能再根目录用中文,就这样轻松解决了,分享给大家,一起加油。...
使用vs2013编译时遇到error msb3073 vcend exited with code 1
今天在vs2013下编译一个工程师,遇到<em>错误</em>“error <em>msb3073</em> vcend exited with code 1”,找了半天,终于找到原因,在此分享一下。 这个工程的设置里,有一个编译后事件,也就是Build Events->Post Build Events。这个地方要求运行一个cmd脚本,脚本里就写了一些拷贝命令,把一些文件从a路径拷贝到b路径,而其中一个命令里,路径b并不存在,所
error MSB3073::VCEnd 已退出, 代码为4
====问题现象==== 突然一次编译开始报错error MSB3073::VCEnd 已退出。 报错的路径为“帮助文档”的Debug-Support路径,网上查到类似<em>错误</em>,主要原因可能是路径中包含中文。 但以前也没出现过这个问题,也是大项目,文件名字不是说改就改。 ====问题解决==== 把Debug文件重命名,全部重新编译,然后就通过了。...
error MSB3073 VCEnd 已退出,代码为1
-
vtk 与QT 编译出现error MSB3073错误,以管理员启动vs仍出错。
参照http://www.zhangzscn.com/index.php/vs2013%e7%bc%96%e8%af%91vtk7-0,编译vtk的,原因是
windows编译caffe中pycaffe时遇到了MSB3073的问题
当在用python导入了caffe模块后再次编译caffe时会报MSB3070的错,部分<em>错误</em>如下:“D:\caffe-windows\build\ALL_BUILD.vcxproj”(默认目标) (1) -&amp;gt; “D:\caffe-windows\build\python\pycaffe.vcxproj”(默认目标) (27) -&amp;gt; (PostBuildEvent 目标) -&amp;gt; ...
RMI错误,错误错误错误
-------远程接口rnimport java.rmi.Remote;rnimport java.rmi.RemoteException;rnrnpublic interface Rmi1 extends Remotern String getString()throws RemoteException;rnrn-------远程对象rnimport java.rmi.RemoteException;rnimport java.rmi.server.UnicastRemoteObject;rnimport java.rmi.RMISecurityManager;rnimport javax.naming.*;rnimport java.rmi.Naming;rnimport java.rmi.registry.*;rnimport java.net.*;rnpublic class Rmi1Impl extends UnicastRemoteObject implements Rmi1rn public Rmi1Impl()throws RemoteExceptionrn super();rn rn public String getString()throws RemoteExceptionrn String str="不管以后将如何结束只要我们曾经拥有过";rn String target="";rn for (int i = 0; i+t.getString());rn rn rn catch (Exception ex) rn ex.printStackTrace();rn rn rn rnrn高手快过来呀,
错误 错误 错误 烦.....
Parser Error rnDescription: An error occurred during the parsing of a resource required to service this request. Please review the following specific parse error details and modify your source file appropriately. rnrnParser Error Message: Circular file references are not allowed.rnrnSource Error: rnLine 1: rnLine 2: rn[color=#FF0000]Line 3: [/color] 有这个文件的rnLine 4: rnLine 5: rnrnSource File: /MYS/Cart.aspx Line: 3 而其他index.aspx页面可以 这个Cart.aspx页面不行rnrnrn--------------------------------------------------------------------------------rnVersion Information: Microsoft .NET Framework Version:2.0.50727.42; ASP.NET Version:2.0.50727.42 rnrn
错误 1122 error MSB3073: 命令“copy ..\..\3rd\staticlib\openblas\x64\*.dll ..\..\Build\cpu\Debug\x64\ cop
<em>错误</em>    1122    error MSB3073: 命令“copy ..\..\3rd\staticlib\openblas\x64\*.dll ..\..\Build\cpu\Debug\x64\ cop “属性”->“生成事件”->“后期生成时间”->“在生成中使用”->选择“否”。
error MSB3073 copy错误的一个解决办法
出现这个copy<em>错误</em>应该是找不到文件位置造成的,可以用如下方法解决: 打开“项目属性”——“配置属性”——“生成事件”——“后期生成事件”,将命令行中的内容删除即可。然后再编译就能成功了。 不过这种方法是治标不治本,根本的解决方法还是配置好文件位置的。
vs2013遇到 MSB3073错误
windows 7 VS2013 安装mcrosoft-caffe遇到这个问题,请问是什么原因?
VS_error MSB3073: :VCEnd”已退出,代码为 1
copy  工程的dll出错 解决办法: 选中工程右击---属性---配置属性---生成事件---后期生成事件---在生成中使用先置为否,编译工程,通过后在置为是
调试错误 error MSB3073: :VCEnd" exited with code 解决办法
最近在编程的时候遇到这个问题,双击<em>错误</em>之后,就会跳转到Microsoft.Common.targets里的下面命令行: Exec WorkingDirectory = “ $(OutDir)” Command = “ $(PostBuildEvent)” />  在网上找了很多答案都没有解决,最后很荣幸的终于功夫不负有心人,我找到了解决的方案,其实很简单,就是在项目窗口里找到工程项目性质管
错误错误
大侠们帮看看,我是新手,谢谢了。rnrn<em>错误</em>: error C3861: “QueryDVDName”: 找不到标识符rnrnrn//需要根据该DVDID查询tbDVDInfo,获得DVDname,插入List控件中rnm_rentInfoList.SetItemText(curItem,2,QueryDVDName(strValue));rnrnrn
错误与“错误
从小到大,我们都觉得犯了<em>错误</em>是一个很不光彩的事情。比如说,因为自己的调皮打 碎了邻居家的玻璃,或者点着了他们的柴火等等。当然,因此换来的当然是父母的一顿 臭骂,或者是更严重……因此,在我们的心里也有了这样一个“道理”,只有不犯<em>错误</em>的孩 子才会是一个好孩子,然后我们就这样遵循着这个似乎挺正确的道理长大了……     可是,我想说的是,并非所有的<em>错误</em>都是值得我们痛恨的。或者说,犯错
错误错误
SQL是装上了,可是服务怎么不能启动呢.rn一运行企业管理器,就提示<em>错误</em>说序数25不能装入,找不到什么oledbptc.dll这个文件,明明这个文件就在系统目录下,在SQL目录下也有为什么不可以呢.
net 连接数据库错误错误错误
![图片说明](https://img-ask.csdn.net/upload/201704/09/1491699154_180113.png)nn我的电脑主机名称 为openadmin/cctvnnn n nn可是我的服务名称 是=(LocalDB)\MSSQLLDBnn为什么出现 openadmin/cctv???n n
vs2010编译错误:error MSB3073: :VCEnd" exited with code 1.
vs2008编译通过,但vs出现如下<em>错误</em>:
error MSB3073: BinplaceCudaDependencies.cmd
1.&amp;lt;CuDnnPath&amp;gt;&amp;lt;/CuDnnPath&amp;gt; 中间不带任何路径。2.error MSB3073: :VCEnd”已退出,代码为 1。解决方案:项目属性->生成事件->预先生成事件->在生成中使用 是改否。解决方案:项目属性->生成事件->后期生成事件->在生成中使用 是改否。即可...
Visual Studio: MSB3073 error exited with code 1
Error 1 error MSB3073: The command “setlocal “C:\Program Files (x86)\CMake\bin\cmake.exe” -DBUILD_TYPE=Release -P cmake_install.cmake if %errorlevel% neq 0 goto :cmEnd :cmEnd endlocal & call :c
error MSB3073: 命令“copy.bat 解决方案
对应的工程目录下面缺少copy.bat文件,将其他工程目录下面的.bat文件拷贝至该工程目录下面,然后修改里面的工程名,重新编译即可通过。
错误错误错误!!!进来啾啾
我在taglib有定义,但是还是抛出exception:rnjavax.servlet.ServletException: Don't know how to iterate over supplied "items" in rn org.apache.jasper.runtime.PageContextImpl.doHandlePageException(PageContextImpl.java:825)rn org.apache.jasper.runtime.PageContextImpl.handlePageException(PageContextImpl.java:758)rn org.apache.jsp.listentry_jsp._jspService(listentry_jsp.java:325)rn org.apache.jasper.runtime.HttpJspBase.service(HttpJspBase.java:94)rn javax.servlet.http.HttpServlet.service(HttpServlet.java:802)rn org.apache.jasper.servlet.JspServletWrapper.service(JspServletWrapper.java:324)rn org.apache.jasper.servlet.JspServlet.serviceJspFile(JspServlet.java:292)rn org.apache.jasper.servlet.JspServlet.service(JspServlet.java:236)rn javax.servlet.http.HttpServlet.service(HttpServlet.java:802)rn org.apache.struts.action.RequestProcessor.doForward(RequestProcessor.java:1056)rn org.apache.struts.action.RequestProcessor.processForwardConfig(RequestProcessor.java:388)rn org.apache.struts.action.RequestProcessor.process(RequestProcessor.java:231)rn org.apache.struts.action.ActionServlet.process(ActionServlet.java:1164)rn org.apache.struts.action.ActionServlet.doGet(ActionServlet.java:397)rn javax.servlet.http.HttpServlet.service(HttpServlet.java:689)rn javax.servlet.http.HttpServlet.service(HttpServlet.java:802)rn这是为啥啊???在线等专家答疑!!!!
新问题,错误:未指定的错误
_ConnectionPtr m_pConnection; rn HRESULT hr; rn try rn rn hr=m_pConnection.CreateInstance("ADODB.Connection"); rn if(SUCCEEDED(hr)) rn rn hr=m_pConnection->Open("driver=SQLServer;Server=221.112.33.1;DATABASE=ora9;Port=1511;UID=use;PWD=pass","","",adModeUnknown); rn rn rn catch(_com_error e) rn rn CString errormessage; rn errormessage.Format("连接数据库失败!\r\n<em>错误</em>信息:%s",e.ErrorMessage()); rn AfxMessageBox(errormessage); rnrn rn总是报: 连接数据库失败 rn <em>错误</em>信息:未指定的<em>错误</em>! rn请高手指教呀。rn我qq179588430
javascript错误:未指定的错误
xmlhttp.open("get","ajax_intro.asp?type="+value+"&title="+encodeURIComponent(document.getElementById("test0").value),true);rnrn改成rnrnxmlhttp.open("POST","ajax_intro.asp",true); rnxmlhttp.setrequestheader("cache-control","no-cache"); rnxmlhttp.setrequestheader("Content-Type","application/x-www-form-urlencoded"); rnxmlhttp.send ("title="+encodeURIComponent(document.getElementById("test0").value); rnrn后,会出现rnjavascript<em>错误</em>:未指定的<em>错误</em>!rn虽然程序没有问题可以使用,但是总提示这个<em>错误</em>!请问怎么解决!谢谢
错误~!ERR 错误完蛋了 !
Microsoft OLE DB Provider for SQL Server <em>错误</em> '80040e14' rn第 1 行: '=' 附近有语法<em>错误</em>。 rnrnrnrn那里有<em>错误</em>数据库是 SQL的 原来是ACCES的
不是错误错误
我遇到了一个好像不是<em>错误</em>的<em>错误</em>,我写了一段向数据库里插入数据的小程序,当提交时系统报错是“/”应用程序中的服务器<em>错误</em>。rn可是当我刷新网页的时候,发现我的数据已经插入到数据库中,还能显示出来,这是为什么啊rn代码如下rnpublic void Page_Load(Object sender,EventArgs e)rnrn if(!Page.IsPostBack)rn rn SqlDataAdapter myCommand1 = new SqlDataAdapter("select * from xinxi",myConnection);rn DataSet ds1 = new DataSet();rn myCommand1.Fill(ds1, "xinxi");rn rn MyDataGrid.DataSource=ds1.Tables["xinxi"].DefaultView;rn MyDataGrid.DataBind();rn rnrnrnpublic void Btn_Click(Object sender,EventArgs e)rn rn String t1,t2,t3,t4,t5,t6;rn t1=Request.Form["T1"];rn t2=Request.Form["T2"];rn t3=Request.Form["T3"];rn t4=Request.Form["T4"];rn t5=Request.Form["T5"];rn t6=Request.Form["T6"];rn String selectCmd = "Insert into xinxi(pname,gongzuodanwei,youbian,gangweizhize,dianziyouxiang,gx) Values('"+t1+"','"+t2+"','"+t3+"','"+t4+"','"+t5+"','"+t6+"')";rn rn SqlDataAdapter myCommand = new SqlDataAdapter(selectCmd,myConnection);rn DataSet ds = new DataSet();rn myCommand.Fill(ds,"xinxi");rn rn MyDataGrid.DataSource=ds.Tables["xinxi"].DefaultView;rn MyDataGrid.DataBind();rnrn
VS2013+Cmake便于g2o遇到问题:error MSB3073: 命令“setlocal D:\tools\cmake-3.6.0-rc3-win32-x86\bin\cmake.exe -D
在编译g2o库的install的时候遇到了如下的<em>错误</em>: <em>错误</em> 1 error MSB3073: 命令“setlocal D:\tools\cmake-3.6.0-rc3-win32-x86\bin\cmake.exe -DBUILD_TYPE=Debug -P cmake_install.cmake if %errorlevel% neq 0 goto :cmEnd :cmEnd endloca
error MSB3073: 修改地方
<em>错误</em> 2 error MSB3073: 命令“if not exist "C:\dev\cocos2d-2.0-x-2.0.3\cocos2d
error MSB3073 copy错误的一个解决办法
error MSB3073 copy<em>错误</em>的一个解决办法 2014年08月29日 ⁄ 综合 ⁄ 共 124字 ⁄ 字号 小 中 大 ⁄ 评论关闭 出现这个copy<em>错误</em>应该是找不到文件位置造成的,可以用如下方法解决: 打开“项目属性”——“配置属性”——“生成事件”——“后期生成事件”,将命令行中的内容删除即可。然后再编译就能成功了。
VS2010编译程序报errorMSB3073
最近换了笔记本硬盘,重新安装了开发环境,在编译原来的工程的时候,发现无法正常编译完成,报error MSB3073:已退出,代码为 9009。 首先我说说我工程,工程带有第三方控件。我机器是WIN7系统,WIN7系统是DEP数据库执行保护,会拦截工程中的非托管代码,这个时候我们需要在工程生成后事件中加入命令来修改编译后APP的PE头文件的属性开关,这个开关在我另一篇关于如何关闭WIN7数据执行保护
错误”并不是真错误
这个呢是我在做项目时,找到了一个假<em>错误</em>,也是我目前用的还不错的一个一次性的使用,有时候假<em>错误</em>,并不是真的<em>错误</em>,只是用的不同的地方,就有不同的效果。如你做的项目不能用它,那么它就是一个<em>错误</em>。但如你做的是一次性验证或者其它,那么它就是一个有用的代码。 1.1 我把它单立出来了,还是如同往前用的是VS,代码用链接a标签,写上一些字提示一下。代码如截图: 1.2 在这里你发现了没有,链接中的javasc...
奇怪错误,HttpQueryInfo错误
这个问题挺奇怪,我之前我的下载程序是可以工作的。但由于网站为了安全提高了权限,我的程序就不能正常下载了。但我发现用下载工具是可以下。我跟踪发现HttpQueryInfo返回的下载文件字节只有20,后来我换了几个不同的文件试验了一下,还是同样的问题,大小也是20.最后下载到客户端的文件打开显示的是“Bad Request”我不知道这是为什么,哪里错了。在网站没有提升安全权限的时候,我的程序是可以正常工作的。现在就不行了,但下载工具是可以的。rn帮助我解决一下
gitpull错误和 fetch 错误
<em>错误</em>原因13:21:46.040: [monkey] git -c core.quotepath=false -c log.showSignature=false fetch origin --progress --prunejava.io.IOException: There was a problem while connecting to github.com:22 at com.trile...
实时错误“383”错误
这个和combobox控件有关        (1) 这个<em>错误</em>一开始没有出现过的,后来为了限制一下只能下拉选择而不能输入,设置后便出现这个问题,起初修改的时候是将此控件的代码删除但是,运行窗体的时候会有一些不一样(如下)性别和班号里没有信息。 所以说这个方法并不是很好的,于是便想到属性的设置,最后通过搜索终于解决此问题 (2)更改comboBOX的”style“属性(今天调试好几个都和S...
一个本没有错误错误
java web 之路 对于学习 java web 开发来说,最快捷的方法就是“抄”别人的代码,一点点的照搬,变成自己的代码。而这次抄也抄出了问题,无论怎样修改就是报错。头疼。 而实际上我遇到一个本没有<em>错误</em>的问题,我是想方设法的把自己的代码修改的和原来一样,还不断的在细节上找<em>错误</em>,可是就是一直报错,说什么SQL 语法<em>错误</em>。 直到最后重新建文件,但代码还是原来的,好嘛,直接就好
error MSB3073: :VCEnd”已退出,代码为 4
首先感谢 cocos2d-x 团队为我们做出这么好的跨平台框架,让我们这些码农省了很多时间,事半功倍。 里沃特最近在编译 win32 版本的时候最到一点小问题,现在记录下,说不定能帮到某些初学的朋友。本文原文地址:http://www.cnblogs.com/lyout/p/3280118.html   1.下载 cocos2d-x-2.1.4 版本,解压到工作盘,目录最好不要太
Makefile Project 中 MSBuild MSB3073 error 不能正确检测字符串 “error:"
背景 在 VS 中创建 Visual C++ –&amp;amp;gt; Cross Platform –&amp;amp;gt; Android | Linux –&amp;amp;gt; Makefile Project 后,只是在项目中有这样一段代码: LOGD(&amp;quot;data length error: %d&amp;quot;, datalen); 便宜的时候就会报错, 1&amp;amp;gt;------ Build started: Project: P...
error MSB3073: :VCEnd”已退出,代码为 3
转自VC<em>错误</em>:http://www.vcerror.com/?p=1480 问题描述: 最近在把vs6.0的程序用vs2012升级后,程序在编译时出现这个<em>错误</em>: 1>C:\Program Files (x86)\MSBuild\Microsoft.Cpp\v4.0\V110\Microsoft.CppCommon.targets(204,5): error MSB3073:
error MSB3073::VCEnd”已退出,代码为 4
  (以下为vs2010下出现的情况及解决方案) <em>错误</em>显示:   <em>错误</em>原因:   表面上看是“属性-配置属性-生成事件-后期生成事件-命令行”出现了问题,其实是你的项目的根目录中含有汉字或者其他敏感符号(比如你的项目代码存放在:“E:\code\备份”目录下,根目录做好是全英文)。   解决方案: 重命名项目的根目录,最好为全英文的(例如“E:\code\Backup”)。...
error MSB3073: 命令“regsvr32 /s /c:VCEnd”已退出,代码为 3
<em>错误</em>指出程序在编译后注册dll是发生<em>错误</em>,导致<em>错误</em>的可能原因是regsvr32 找不到编译后的dll文件(手动更改了输出目录),在配置-配置属性-生成事件-后期生成事件中Regsvr32.exe /s "正确的dll文件路径就可以了"
struts 错误 错误的url
[http-8083-Processor25] ERROR org.apache.struts.actions.DispatchAction - The error caused by the following urlhttp://192.168.0.10:8083/empuser.do?_method=loginrnjavax.servlet.ServletExceptionrn at org.apache.struts.chain.ComposableRequestProcessor.process(ComposableRequestProcessor.java:283)rn at org.apache.struts.action.ActionServlet.process(ActionServlet.java:1858)rn at org.apache.struts.action.ActionServlet.doGet(ActionServlet.java:446)rn at javax.servlet.http.HttpServlet.service(HttpServlet.java:689)rn at javax.servlet.http.HttpServlet.service(HttpServlet.java:802)rn at org.apache.catalina.core.ApplicationFilterChain.internalDoFilter(ApplicationFilterChain.java:252)rn at org.apache.catalina.core.ApplicationFilterChain.doFilter(ApplicationFilterChain.java:173)rn at com.shipin99.controller.InitializingFilter.doFilter(InitializingFilter.java:84)rn at org.apache.catalina.core.ApplicationFilterChain.internalDoFilter(ApplicationFilterChain.java:202)rn at org.apache.catalina.core.ApplicationFilterChain.doFilter(ApplicationFilterChain.java:173)rn at org.springframework.orm.hibernate3.support.OpenSessionInViewFilter.doFilterInternal(OpenSessionInViewFilter.java:174)rn at org.springframework.web.filter.OncePerRequestFilter.doFilter(OncePerRequestFilter.java:77)rn at org.apache.catalina.core.ApplicationFilterChain.internalDoFilter(ApplicationFilterChain.java:202)rn at org.apache.catalina.core.ApplicationFilterChain.doFilter(ApplicationFilterChain.java:173)rn at org.springframework.web.filter.CharacterEncodingFilter.doFilterInternal(CharacterEncodingFilter.java:78)rn at org.springframework.web.filter.OncePerRequestFilter.doFilter(OncePerRequestFilter.java:77)rn at org.apache.catalina.core.ApplicationFilterChain.internalDoFilter(ApplicationFilterChain.java:202)rn at org.apache.catalina.core.ApplicationFilterChain.doFilter(ApplicationFilterChain.java:173)rn at org.apache.catalina.ssi.SSIFilter.doFilter(SSIFilter.java:125)rn at org.apache.catalina.core.ApplicationFilterChain.internalDoFilter(ApplicationFilterChain.java:202)rn at org.apache.catalina.core.ApplicationFilterChain.doFilter(ApplicationFilterChain.java:173)rn at org.apache.catalina.core.StandardWrapperValve.invoke(StandardWrapperValve.java:213)rn at org.apache.catalina.core.StandardContextValve.invoke(StandardContextValve.java:178)rn at org.apache.catalina.core.StandardHostValve.invoke(StandardHostValve.java:126)rn at org.apache.catalina.valves.ErrorReportValve.invoke(ErrorReportValve.java:105)rn at org.apache.catalina.core.StandardEngineValve.invoke(StandardEngineValve.java:107)rn at org.apache.catalina.connector.CoyoteAdapter.service(CoyoteAdapter.java:148)rn at org.apache.coyote.http11.Http11Processor.process(Http11Processor.java:869)rn at org.apache.coyote.http11.Http11BaseProtocol$Http11ConnectionHandler.processConnection(Http11BaseProtocol.java:664)rn at org.apache.tomcat.util.net.PoolTcpEndpoint.processSocket(PoolTcpEndpoint.java:527)rn at org.apache.tomcat.util.net.LeaderFollowerWorkerThread.runIt(LeaderFollowerWorkerThread.java:80)rn at org.apache.tomcat.util.threads.ThreadPool$ControlRunnable.run(ThreadPool.java:684)rn at java.lang.Thread.run(Thread.java:595)
vs08的错误:分析器错误
我现在是将一个解决方案放到服务器是win2003 ,我的计算机是xp,现在直接打开服务器上的解决方案,创建一个页面rn然后在本地访问 http://10.4.10.205/CustomManager/TaskList.aspx 时候报错rnrn分析器<em>错误</em> rn说明: 在分析向此请求提供服务所需资源时出错。请检查下列特定分析<em>错误</em>详细信息并适当地修改源文件。 rnrn分析器<em>错误</em>信息: 未能加载类型“ZY_OA.CustomManager.TaskList”。rnrn源<em>错误</em>: rnrnrn行 1: rnrnrn这个是怎么回事?我发现用解决方案打开项目是对的,就是一个页面包含 rnTaskList.aspx,TaskList.aspx。cs,TaskList.aspx.desinger.cs,rn但是用 打开——网站 打开rn页面的 TaskList.aspx.desinger.cs 就不包含在里面了 怎么回事?rn rn
rman12004错误 ora-27001错误
我是新手,刚学的rman备份,遇到一些问题,请高手指教,操做过程如下: rn  rn  SQL> conn / as sysdba rn  SQL> shutdown immediate; rn  SQL> startup mount rn  SQL> alter database archivelog; rn  SQL> alter database open; rn  SQL> alter system archive log start; rn  SQL> exit rn 连接:rn  rman target=rman/rman@testrn  基本设置:rn  RMAN> configure default device type to disk; rn  RMAN> configure device type disk parallelism 2; rn  RMAN> configure channel 1 device type disk format 'D:/backup1/backup_%U'; rn  RMAN> configure channel 2 device type disk format 'D:/backup2/backup_%U'; rn  RMAN> configure controlfile autobackup on; rn  RMAN> configure controlfile autobackup format for device type disk to 'D:/backup1/ctl_%F';   rn 查看所有设置:rn  RMAN> show allrn  查看数据库方案报表:rn  RMAN> report schema;rn  备份全库:rn  RMAN> backup database plus archivelog delete input; rn  备份归档日志:rn  RMAN> backup archivelog all delete input;rn  查看备份和文件复本:rn  RMAN> list backup;rn  验证备份:rn  RMAN> validate backupset 3;rn当验证的时候出现ora-19624:操作失败,如果可能请重试 ora-19554:配置设备出错,设备类型:DISKYPE,设备名称ora-27001不受支持的设备类型。 如果设备类型不对的话为什么能备份成功呢啊?请高手帮帮我怎么解决遇到的<em>错误</em>,谢谢了rn
数据库连接错误:未指定的错误
数据库是 my-data在安装数据库时将sa 密码设为1234 混合模式 ADO方式rn第一次写数据库程序 好多地方不太明白 希望 大家赐教rnrn //初始化COM环境rn ::CoInitialize(NULL);rnrn //创建连接对象和记录集对象rn HRESULT hr;rn tryrn rn hr=m_Con.CreateInstance("ADODB.Connection");rn if(SUCCEEDED (hr))rn rnrn hr=m_Con->Open("Data Source=(local);Initial Catalog=my-data;User Id=sa;Password=1234",rn "","",adModeUnknown);rn rn rn catch(_com_error e)rn rn CString str;rn str.Format("连接数据库失败:%s",e.ErrorMessage());rn AfxMessageBox(str);rnrn rn rn m_pRec.CreateInstance(__uuidof(Recordset));
自动化错误是什么错误
各位高手:rn 我在应用程序中引用了ACTIVEX.eXE文件,测试此文件没有<em>错误</em>,可是在应用程序中确出现“自动化<em>错误</em>”
Windows 安装caffe 不能加载libcaffe和test_all问题 (附caffe安装教程)
最后我的配置的win10, x64, vs 2013, caffe, cuda 7.5, cudnn v5.1,matlab2014b 安装成功。   1. 按照网上教程安装好几天,都出现不能加载libcaffe问题,最后发现是cuda版本问题,https://github.com/Microsoft/caffe ,这里了下载的CommonSettings.props内配置的cuda版本为7....
caffe 配置过程中遇到的错误
<em>错误</em> 1 error MSB3073: 命令“"D:\caffe-windows\windows\\scripts\BinplaceCudaDependencies.cmd" "C:\Program Files\NVIDIA GPU Computing Toolkit\CUDA\v7.5\bin" "" false true "D:\caffe-windows\windows\..\Build\x
opencv2.3.0安装时出现error MSB3073: 命令“setlocal“ 和file INSTALL cannot find opencv_ffmpeg230...
当安装opencv2.3.0,重新编译(debug)install时,经常会碰到这个问题,一开始没有头绪,怎么调都调不出来。但是在仔细查看<em>错误</em>信息并结合网上内容,终于解决了。应该是由ffmpeg引起的,具体内容可以看下面前辈的分享。 步骤是:1.找到外层目录下的cmake_install.cmake文件                2.找到并用”#“注释掉                #
VS2015+Cmake安装OpenPose库遇到:error MSB3073: 命令“setlocal.... "
解决方法:以管理员身份运行Vs即可。应该是因为在Cmake GUI中CMAKE_INSTALL_PREFIX指定为C盘目录,install编译生成时需要权限。 另一问题:Cmake GUI的源码及二进制生成路径设置 另外在使用Cmake GUI生成Vs2015的解决方案过程中,对于源码目录和目标二进制的目录应设置为如下方式: 而不应该: 因为这个简单配置问题,程序运行时相关的相...
error MSB3073: 命令“setlocal "C:\Program Files\CMake\bin\cmake.exe" -DBUILD_
-
编译器错误 错误,问题
Microsoft VBScript 编译器<em>错误</em> <em>错误</em> '800a03f6' rnrn缺少 'End' rnrn/iisHelp/common/500-100.asp,行242 rnrnMicrosoft JET Database Engine <em>错误</em> '80040e09' rnrn不能更新。数据库或对象为只读。 rnrn/ypwl/admin/notify.asp,行20 rnrnrn这个<em>错误</em>怎么解决,
错误
 #include #include #define  int main() {     int num,total,x;     scanf("%d",&x);     num=x;     total=mum*price;     printf("%d",x);     return 0; } #define price 30 用define 进行定义是,
错误
package com.bruceeckel.swing;rnimport javax.swing.*;rnimport java.awt.event.*;rnrnpublic class Consolern public static String title(Object o)rn String t = o.getClass().toString();rn rn if(t.indexOf("class") != -1)rn t = t.substring(6);rnrn return t;rn rn rn public static void setupClosing(JFrame frame)rn frame.addWindowListener(new WindowAdapter()rn public void windowClosing(WindowEvent e)rn System.exit(0);rn rn );rn rn rn public static void run(JFrame frame,int width,int height)rn setupClosing(frame);rn frame.setSize(width,height);rn frame.setVisible(true);rn rn rn public static void run(JApplet applet,int width,int height)rn JFrame frame = new JFrame(title(applet));rn setupClosing(frame);rn frame.getContentPane().add(applet);rn frame.setSize(width,height);rn applet.init();rn applet.start();rn frame.setVisible(true);rn rn rn public static void run(JPanel panel,int width,int height)rn JFrame frame = new JFrame(title(panel));rn setupClosing(frame);rn frame.getContentPane().add(panel);rn frame.setSize(width,height);rn frame.setVisible(true);rn rnrnrn编译没问题:rnrnimport javax.swing.*;rnimport java.awt.*;rnimport com.bruceeckel.swing.*;rnrnpublic class Appletlc extends JAppletrn public void init()rn getContentPane().add(new JLabel("Applet!"));rn rn public static void main(String[] args)rn JApplet applet = new Appletlc();rn JFrame frame = new JFrame("Appletlc");rn Console.setupClosing(frame);rn frame.getContentPane().add(applet);rn frame.setSize(100,50);rn applet.init();rn applet.start();rn frame.setVisible(true);rn rnrn编译<em>错误</em>为:rnG:\My Documents\Appletlc.java:12: cannot resolve symbolrnsymbol : method setupClosing (javax.swing.JFrame)rnlocation: class Consolern Console.setupClosing(frame);rn ^rn1 errorrn
VS 编译PCL后 install报错(error MSB3073)
<em>错误</em> 1 error MSB3073: 命令“setlocal H:\PCL_BACKUP\PCL\CMake\bin\cmake.exe -DBUILD_TYPE=Release -P cmake_install.cmake if %errorlevel% neq 0 goto :cmEnd :cmEnd endlocal & call :cmErrorLevel %errorlev
菜鸟求教:用vs2010编译vtk install重新生成时出错
-
error MSB3073: copy dll出错,求各位大大帮忙。解决后可以有偿
-
【Tensorflow】windows编译tensorflow.sln的INSTALL时 error MSB3073: 命令“setlocal.... "
在win10上以cmake和visual studio 2015编译tensorflow时,报错: error MSB3073: 命令“setlocal.... " 这是因为在cmake的时候指定的安装目录是C盘,所以有两种解决方法: 1. 以管理员权限打开tensorflows.sln,重新编译INSTALL项目。 2. 在cmake时选择安装在其他盘。 ...
MSB3073 命令“platforms\android\cordova\clean.bat”已退出,代码为 2。
废话不多说 cordova+ionic开发android项目,在重新生成的时候,会提示一个: 严重性 代码 说明 项目 文件 行<em>错误</em> MSB3073 命令“platforms\android\cordova\clean.bat”已退出,代码为 2。 Ionic Tabs Template1 C:\Program Files (x86)\MSBuild\Microsoft\VisualStudi
错误!!!!!!!
13>------ Build started: Project: iSee, Configuration: Release Pocket PC 2003 (ARMV4) ------rn13>Performing Pre-Build Event...rn13>bash: /cygdrive/d/WebKit.iSee/iSee/build/build-generated-files-js.sh: No such file or directoryrn13>找不到文件 - Collator.hrn13>复制了 0 个文件rn13>找不到文件 - runtime.hrn13>复制了 0 个文件rn13>找不到文件 - runtime_object.hrn13>复制了 0 个文件rn13>找不到文件 - Register.hrn13>复制了 0 个文件rn13>找不到文件 - RegisterID.hrn13>复制了 0 个文件rn13>找不到文件 - RegisterFile.hrn13>复制了 0 个文件rn13>找不到文件 - Profiler.hrn13>复制了 0 个文件rn13>bash: /cygdrive/d/WebKit.iSee/iSee/build/build-generated-files-wc.sh: No such file or directoryrn1[color=#FF0000]3>Project : error PRJ0019: A tool returned an error code from "Performing Pre-Build Event..."[/color][b][/b]rn13>Build log was saved at "file://f:\iSee\iSeeBrowser_Source\ iseebrowser\iSee\iSee.project\Pocket PC 2003 (ARMV4)\Release\BuildLog.htm"rn13>iSee - 1 error(s), 0 warning(s)
错误
Response.Write "select * from Order_Details where UserID="&UserID&" and orders_date>='"&B_date&"' and orders_date='"&B_date&"' and orders_date='2008-11-1' and orders_date 中。 rnrn/dvn/DataBase/Orders_List.asp,行 79 rn
错误
当点击浏览服务器的时候,会报这个<em>错误</em>   &amp;lt;!-- fckediot ImageUpLoad--&amp;gt; &amp;lt;servlet&amp;gt; &amp;lt;servlet-name&amp;gt;Connector&amp;lt;/servlet-name&amp;gt; &amp;lt;servlet-class&amp;gt; org.zkforge.fckez.connector...
VS 编译后 install报错(error MSB3073)
vs编译出现如下<em>错误</em>: <em>错误</em> 1 error MSB3073: 命令“setlocal H:\PCL_BACKUP\PCL\CMake\bin\cmake.exe -DBUILD_TYPE=Release -P cmake_install.cmake if %errorlevel% neq 0 goto :cmEnd :cmEnd endlocal &amp; call :cmErrorLevel...
xxx\Microsoft.Common.targets: error MSB3073: The command xxx exited with code 4
http://www.crifan.com/microsoft_common_targets_error_<em>msb3073</em>_command_exited_with_code_4/ 在VS2010中编译一个C#项目,结果出错: ? 1 2 3 4 5 6 7 8 9 10 PostBuildEvent:   XCOPY /D /Y /R
ExcelDataReader下载
C#通过文件流将Excel(支持97~2003格式)转DataTable,不需要MS Office支持,示例为VS2005格式 相关下载链接:[url=//download.csdn.net/download/goga21cn/2049369?utm_source=bbsseo]//download.csdn.net/download/goga21cn/2049369?utm_source=bbsseo[/url]
The Status of Web Interoperability and activities in CJK下载
Increasing the development and usages of Open source web browsers based on Open Source operating systems. Gecko engine (Mozilla Firefox) Webkit engine (Safari) Bottle neck : Web Interoperability Users “Web sites don’t work in Firefox, but do in IE!” Developers “It’s hard to make web page in both br 相关下载链接:[url=//download.csdn.net/download/seongbin/2127286?utm_source=bbsseo]//download.csdn.net/download/seongbin/2127286?utm_source=bbsseo[/url]
VHDL实验报告下载
VDHL的开发实验报告模板,有利于同学更好的掌握对VHDL语言的理解 相关下载链接:[url=//download.csdn.net/download/dongweinan/5410503?utm_source=bbsseo]//download.csdn.net/download/dongweinan/5410503?utm_source=bbsseo[/url]
相关热词 c#串口测试应用程序 c# 匹配 正则表达式 c#防止窗体重绘 c#读写txt文件 c#挖地雷源代码 c#弹框选项 c# 移除 队列 c# 密码写入配置文件 c# 获取可用内存大小 c# 嵌入excel编辑
我们是很有底线的