0 test classes found in package 'com.test' [问题点数:50分]

Bbs1
本版专家分:0
结帖率 0%
Bbs1
本版专家分:0
Bbs5
本版专家分:2265
Blank
蓝花 2018年1月 Web 开发大版内专家分月排行榜第三
Bbs1
本版专家分:0
100道JAVA面试题+JAVA面试题参考答案
(一)Java部分 1、列举出JAVA中6个比较常用的包【天威诚信面试题】 【参考答案】 java.lang;java.util;java.io;java.sql;java.awt;java.net;javax.swing 2、JDK中哪些类是不能继承的?【信雅达面试题】 【参考答案】 不能继承的是类是那些用final关键字修饰的类。一般比较基本的类型或防止扩展类无意间破坏原来方法的实...
IDEA写junit测试用例时报class not found:...empty test suite
原本<em>test</em>文件夹错误设置在了src=》main下面。 我将<em>test</em>目录移动到了与main平级。 再shift+ctrl+f10,控制台报错“class not <em>found</em>:…empty <em>test</em> suite” 搜了搜,shift+ctrl+alt+s,到设置界面。 重新设置了下目录。再运行。 ...
JAVA中其它包中无法引用缺省包(default package)的类 - 使用反射可以
引用  csdn 里别人提的这个问题,我遇到了和这个一样的问题 ,即 build path 根目录下,定义的类,没有包名,其它位置引用这里的类,不好import ,直接使用 类名 ,编译器又会报错。   rnrnrn-- 本篇文章的结论是,java工程要建立良好的包结构,尽量不要在 <em>package</em> 根目录建类。rnrnrn问题文章链接如下: http://bbs.csdn.net/topics/3
Spring Boot 初级入门教程(四) —— 代码测试配置(附源码)
在项目开发中,测试环节是非常重要的,所以选择好的代码测试工具也显得尤为重要。nn首先,基于前三篇的代码,先修改一些 Jar 包的版本,都用目前最新版本(强迫症!!!)。nnjunit 版本修改:3.8.1 -》 4.12nnspring boot 版本修改:1.4.2.RELEASE -》 2.0.2.RELEASEnn修改后 pom 文件如下:nnn&amp;lt;project xmlns=&quot;http...
package com.test;package com.test;package com.test;package com.test;
<em>package</em> com.<em>test</em>; import java.awt.image.BufferedImage; import java.io.File; import java.io.FileInputStream; import java.io.FileNotFoundException; import java.io.IOException; public class B { public static void main(String[] args) { File file = new File("c:\\a.jpg"); FileInputStream is = null; try { is = new FileInputStream(file); } catch (FileNotFoundException e2) { e2.printStackTrace(); // return rect; } BufferedImage sourceImg = null; try { sourceImg = javax.imageio.ImageIO.read(is); } catch (IOException e1) { e1.printStackTrace(); // return rect; } System.out.println("width = " + sourceImg.getWidth() + "height = " + sourceImg.getHeight()); } } <em>package</em> com.<em>test</em>; import java.awt.image.BufferedImage; import java.io.File; import java.io.FileInputStream; import java.io.FileNotFoundException; import java.io.IOException; public class B { public static void main(String[] args) { File file = new File("c:\\a.jpg"); FileInputStream is = null; try { is = new FileInputStream(file); } catch (FileNotFoundException e2) { e2.printStackTrace(); // return rect; } BufferedImage sourceImg = null; try { sourceImg = javax.imageio.ImageIO.read(is); } catch (IOException e1) { e1.printStackTrace(); // return rect; } System.out.println("width = " + sourceImg.getWidth() + "height = " + sourceImg.getHeight()); } } <em>package</em> com.<em>test</em>; import java.awt.image.BufferedImage; import java.io.File; import java.io.FileInputStream; import java.io.FileNotFoundException; import java.io.IOException; public class B { public static void main(String[] args) { File file = new File("c:\\a.jpg"); FileInputStream is = null; try { is = new FileInputStream(file); } catch (FileNotFoundException e2) { e2.printStackTrace(); // return rect; } BufferedImage sourceImg = null; try { sourceImg = javax.imageio.ImageIO.read(is); } catch (IOException e1) { e1.printStackTrace(); // return rect; } System.out.println("width = " + sourceImg.getWidth() + "height = " + sourceImg.getHeight()); } } <em>package</em> com.<em>test</em>; import java.awt.image.BufferedImage; import java.io.File; import java.io.FileInputStream; import java.io.FileNotFoundException; import java.io.IOException; public class B { public static void main(String[] args) { File file = new File("c:\\a.jpg"); FileInputStream is = null; try { is = new FileInputStream(file); } catch (FileNotFoundException e2) { e2.printStackTrace(); // return rect; } BufferedImage sourceImg = null; try { sourceImg = javax.imageio.ImageIO.read(is); } catch (IOException e1) { e1.printStackTrace(); // return rect; } System.out.println("width = " + sourceImg.getWidth() + "height = " + sourceImg.getHeight()); } }
SpringBoot工程启动报错
nSpringBoot启动报错nnnn&quot;D:\Program Files\Java\jdk1.8.0_152\bin\java.exe&quot; -ea -Didea.<em>test</em>.cyclic.buffer.size=1048576 &quot;-javaagent:D:\Program Files\JetBrains\IntelliJ IDEA Community Edition 2018.2\lib\idea_...
调用flow_from_directory()出现“Found 0 images belonging to 2 classes”问题
问题描述: 使用keras的图像数据生成器(keras.preprocessing.image.ImageDataGenerator)抛出图像时出现&quot;Found 0 images belonging to 2 <em>classes</em>&quot;问题。 原因:识别出两个类别,证明目标文件夹满足要求,在stackoverflow上查找原因,发现: 从对应网址下载keras_preprocessing文件夹,并将...
【已解决】junit.framework.AssertionFailedError: No tests found in test.test
报junit.framework.AssertionFailedError这个错一般是Test命名前面没有加<em>test</em>字样。 没有加<em>test</em>字样如果能运行也有可能<em>test</em>时会很慢。半天没有出现输出结果。   格式:<em>test</em> + (你要的命名)   ...
Maven install时报错: Failed to execute goal org.apache.maven.plugins:maven-surefire-plugin:2.21.0:test
报错信息: [ERROR] Failed to execute goal org.apache.maven.plugins:maven-surefire-plugin:2.21.0:<em>test</em> (default-<em>test</em>) on project Spider: Execution default-<em>test</em> of goal org.apache.maven.plugins:maven-surefi...
使用rollup+es6+class 打包类库
一、为什么选用roll-up roll-up是下一代JavaScript模块打包工具。开发者可以在你的应用或库中使用ES2015模块,然后高效地将它们打包成一个单一文件用于浏览器和Node.js使用。 Rollup最令人激动的地方,就是能让打包文件体积很小。这么说很难理解,更详细的解释:相比其他JavaScript打包工具,Rollup总能打出更小,更快的包。因为Rollup基于ES2015模块,...
SpringBoot 结合SpringSecurity+Jwt实现权限认证
首先创建RBAC 权限系统表 /* MySQL Backup Database: <em>test</em> Backup Time: 2018-09-12 11:53:20 */ SET FOREIGN_KEY_CHECKS=0; DROP TABLE IF EXISTS `<em>test</em>`.`role`; DROP TABLE IF EXISTS `<em>test</em>`.`user`; DROP TABLE IF EXI...
Maven介绍与应用
Maven介绍
Android 热修复Tinker接入实战
1 热修复原理热修复的原理一句话总结就是:就是dex的动态替换。首先,我们知道PC上的JVM是直接解析class字节码的,而android上的JVM是解析dex文件的,因此Android程序要运行需要先编译打包成dex,之后才可以被Android虚拟机解析运行。所以我们如果想要即时修补bug就要让修复的代码被Android虚拟机识别,如何才能让虚拟机认识我们修改过的代码呢,也就是我们需要把修改过的代
第一个spring-boot工程
1.登陆网址https://start.spring.io/ 创建一个简单的spring-boot工程,这时会生成一个zip压缩文件nnnnnn 2.解压生成的压缩文件spring-boot.zip,解压后导入到eclipse中nn3.pom文件引入依赖nnn&amp;lt;?xml version=&quot;1.0&quot; encoding=&quot;UTF-8&quot;?&amp;gt;n&amp;lt;project xmlns=&quot;http:/...
【error】intellij idea报错处理
报错: nintellij idea一运行就报错,找不到类解决方法: n打开project structures(alt+ctrl+shift+s),查看project–out和module–path–out设置的目录是否存在。 n一般module–path–out设置的是target目录下的,但是首次运行时没有target目录的,必须先用maven build一下才会生成,所以要么改out路径,要
spark学习5之sbt问题
Spark和scala之sbt问题nnn按照参考【1】顺利安装了sbt,并显示nhadoop@Master:~/cloud/scala-2.10.5$ sbt sbt-versionn[info] Set current project to scala-2-10-5 (in build file:/home/hadoop/cloud/scala-2.10.5/)n[info] 0.13.
thrift:swift 命令行生成 IDL文件及Client java代码过程
swift是一个用于创建thrift 序列化类型和服务的java工具库,使用swfit可以生成非常简洁的java代码。并且更重要的是可以通过java代码生成接口描述文件(Thrift interface description language,IDL). n多数情况下,服务端的应用都是java写的。使用swift提供的工具,可以直接生成IDL,再用IDL生成其他语言的client端代码 (jav...
使Maven 2在package、install等阶段跳过运行Test的配置
Skipping TestsrnrnTo skip running the <em>test</em>s for a particular project, set the skipTests property to true.rn[code=&quot;xml&quot;]rnrn [...]rn rn rn rn org.apache.maven.pluginsrn maven-su...
萌新求救:安装完eclipse运行helloWord的时候出现这种错误
Error occurred during initialization of boot layer njava.lang.module.FindException: Error reading module: F:\steam\eclipse文件\Tofu\bin nCaused by: java.lang.module.InvalidModuleDescriptorException: Hel...
Maven打包去掉test包的配置
maven打包去掉<em>test</em>的方法
【常见错误】布局文件添加edittext报:The following classes could not be found错误
一、问题描述nnandroid项目布局文件中,添加edittext后布局报以下错误:nnException raised during rendering: java.lang.System.arraycopy([CI[CII)VnnException details are logged in Window > Show View > Error LognnThe followi
Go测试运行报“expected 'package', found 'EOF'“问题的解决
Go语言中有直接对方法进行Test的机制,命令是go.exe <em>test</em> -v,可是遇到运行时报“...expected '<em>package</em>', <em>found</em> 'EOF'“的错误,是怎么回事呢?原来,该目录下有空文件啦,我新建了一个.go文件,还没来得及coding,运行其他Test文件就报错了。于是,把该空文件移除,或者coding,再运行其他Test文件就没有这个报错了。...
javabeans在idea中调用时无法被加载调用问题解决方案
Classes from the default <em>package</em> must not be referenced from JSP file less... (Ctrl+F1) nThis inspection reports any references to a <em>classes</em> from the default <em>package</em> in JSP files.nSuch references will...
Android Tinker的两种接入方式
老大让我把项目里的AndFix改为Tinker,遇到各种问题,网上的文章大同小异不清不楚,折腾了好几天好不容易搞出来了,来为跟我一样的菜鸟们指点迷津。nTinker的接入主要有两种方式,一种是Tinker推荐使用的gradle接入,一种是命令行的接入。n一. gradle接入n1.project目录下gradle添加nbuildscript {n dependencies {
使用@SpringBootTest注解进行单元测试
概述nn@SpringBootTest注解是SpringBoot自1.4.0版本开始引入的一个用于测试的注解。基本用法如下:nnnn1. 添加Maven依赖nnnn&amp;lt;properties&amp;gt;n &amp;lt;project.build.sourceEncoding&amp;gt;UTF-8&amp;lt;/project.build.sourceEncoding&amp;gt;n &amp;lt;/pro...
热更新Tinker研究(七):Dex的patch文件生成
热更新Tinker研究-Dex的patch文件生成[toc] nApkDecoder中的dexPatchDecoder负责dex的patch生成工作,dexPatchDecoder实际上是UniqueDexDiffDecoder类型。这一系列相关的类的关系如下图所示。 n nBaseDecoder中有三个抽象方法,onAllPatchesStart(), patch(File oldFile, Fi
deeplearning.ai学习(numpy方法使用)
train_set_x_orig, train_set_y, <em>test</em>_set_x_orig, <em>test</em>_set_y, <em>classes</em> = load_dataset()rnrnrntrain_set_x_orig -- 一组图片rnplt.imshow(train_set_x_orig[index]) -- 展示出第index图片rnrnrnrnrntrain_set_y[:, index] --
opencv 3.0安装时提示ippicv 安装的MD5不匹配问题
按照欧新宇的教程,在执行sh .opencv3.0.0rc.sh时出现错误,于是打开该sh文件,按照sh文件的步骤来安装,直到提示错误步骤----就是在下载完后新建build目录并进入cmake(cmake -D CMAKE_BUILD_TYPE=RELEASE -D CMAKE_INSTALL_PREFIX=/usr/local -D WITH_TBB=ON等等)时出错:rnrn-- ICV:
【Android】微信热修复 Tinker 的集成和使用
简介Tinker: n. 〈英〉小炉匠,补锅匠,修补匠Tinker 是微信官方开源的 Android 热修复框架,支持在无需升级APK的前提下更新 dex, library and resources 文件。它也就是今年9月24才刚刚开源,几天功夫star数就超过3000,可见在开发者中的影响力有多大,也说明这是一个刚需。Tinker GitHub: https://github.com/Ten
springboot junit 测试出现的错误
spring boot  junit 测试代码如下n<em>package</em> com.zyc.ew;nnimport org.junit.Test;nimport org.junit.runner.RunWith;nimport org.springframework.beans.factory.annotation.Autowired;nimport org.springframework.b
maven package 打包test出错导致打包失败
今天用maven给项目打包,clean <em>package</em>之后跑了一连串异常,搞的一脸懵逼;仔细看了下报错发现:-------------------------------------------------------n T E S T Sn-------------------------------------------------------nRunning com.icinfo.tzmic
SpringBootTest 单元测试遇到的坑
项目结构是spring boot搭建的提供RPC接口的服务,用到了dubbo;rn最近需要用到单元测试,发现一致卡在那里,执行不到测试方法,貌似阻塞了;rn单元测试类:rnrn@RunWith(SpringRunner.class)n@SpringBootTest(webEnvironment= SpringBootTest.WebEnvironment.NONE, <em>classes</em> = Appli
ZeroMQ编译安装
1、下载zeromqhttp://pkgs.fedoraproject.org/repo/pkgs/zeromq/zeromq-4.1.2.tar.gzn2、解压/编译cd /root/zeromq/zeromq-4.1.2./configure --prefix=/usrn出现:No <em>package</em> 'libsodium' <em>found</em>下载libsodiumhttps://download.l
SpringBoot-自动配置源码解析
接着上一篇博客《 SpringBoot-快速搭建WEB工程》提出的需要分析的三个方面:我们来深入的探究SpringBoot是如何在没有一个配置文件的情况下为我们启动好一个完整的WEB工程的,首先我们从@SpringBootApplication 开始这里的分析会剖出一些次要的信息沿着主干走,所以可能会有一些略过的地方。以下源码截取自spring-boot-1.4.0.RELEASE@Target(E
No package 'xcb-xlib' found原因以及解决办法 Qt安装时候遇到libxcb问题
No <em>package</em> 'xcb-xlib' <em>found</em>原因以及解决办法nnn原文地址:  http://blog.chinaunix.net/uid-21931325-id-2237017.htmlnn nn如果你明明安装了libxcb库,但是在编译libX11时出现一下提示:nn nnchecking for X11... configure: error: Package requiremen...
maven中运行junit4报测试类class not found错误解决方案
最近项目写了个httpClient测试类,碰到了class not <em>found</em>问题,这里做个总结:nnmaven项目 clean run 后,在maven项目的src/java/<em>test</em>编写了一个HttpClientTest类nn直接方法右击运行Run As —> Junit Test,报错nClass not <em>found</em> com.ljw.portal.httpclient.
Python 执行unittest类进行测试,出现no tests found的情况
执行如下语句,unit<em>test</em>.main()运行后,代码没有进入到NamesTestCase运行。nimport unit<em>test</em>nfrom NameFunction import get_formatted_namenclass NamesTestCase(unit<em>test</em>.TestCase):n def <em>test</em>_first_last_name(self):n format...
eclipse下,使用junit4,报“no Junit tests found”错误的解决办法
在eclipse下,使用junit4,在某个测试类里右键Run AsJunit Test,报“no Junit <em>test</em>s <em>found</em>”的错误。rn解决:rnbuild path-》add library-》点junit,按提示操作
对于keras的图片生成器ImageDataGenerator对image和mask的同时数据生成
一 单张图片+flow函数###图片来源形式&quot;&quot;&quot;E:/tmp/0010.jpgE:/tmp/0010.png&quot;&quot;&quot;from keras.preprocessing.image import ImageDataGenerator, array_to_img, img_to_array, load_imgdatagen = ImageDataGenerator(        rotation_ra...
Spring Boot自动配置原理、实战
Spring Boot自动配置原理nnSpring Boot的自动配置注解是@EnableAutoConfiguration, n从上面的@Import的类可以找到下面自动加载自动配置的映射。nnnnorg.springframework.core.io.support.SpringFactoriesLoader.loadFactoryNames(Class, ClassLoader)nnnnpu
Spring Boot实战学习笔记3
title: Spring Boot实战学习笔记3 ntags:Spring Boot实战 ngrammar_cjkRuby: true 摘要本文为学习Spring Boot实战的学习笔记,学习了一遍,但是好记性不如烂笔头,所以文章记录下来。图书购买地址为: https://item.jd.com/11894632.html.Spring Boot实战学习笔记1Spring Boot实战学习笔记
maven项目src源代码下的资源文件不自动复制到classes文件夹的解决方法
nPOM文件rn&amp;lt;build&amp;gt;&amp;lt;resources&amp;gt;&amp;lt;resource&amp;gt;&amp;lt;directory&amp;gt;src/main/java&amp;lt;/directory&amp;gt;&amp;lt;excludes&amp;gt;&amp;lt;exclude&amp;gt;**/*.java&amp;lt;/exclude&amp;gt;&amp;lt;/excludes&amp;gt;&amp;lt;/
SpringBoot学习(二)---- web综合开发
一、常用web开发功能 json输出、filter、property、log等nn1,json接口nn在需要类中添加@RestController即可nnn@RestControllernpublic class JsonController {n @RequestMapping(&quot;/getUser&quot;)n public User getuser(){n User user = new User(...
demo开发之问题04编译ubuntu环境下编译opencv
一、安装过程中出现的问题nn1.  looking for ccache --not <em>found</em>nnsudo apt-get install ccachenn2.  Performance <em>test</em> HAVE)C_WSUGGEST_OVERRIDE - FailednnWhat parameter did you pass to cmake to allow for &quot;Non-free algor...
Maven管理项目时 使用package命令报错:There are test failures
解决方法:n这是因为测试代码时遇到错误,它会停止编译。只需要在pom.xml的里添加以下配置,使得测试出错不影响项目的编译。nbuild>n    plugins>n        plugin>n            groupId>org.apache.maven.pluginsgroupId>n            artifactId>maven-surefire-pluginar
maven编译的时候出现一大堆Test相关的错误
-----------------------------------------------------   T E S T S  -------------------------------------------------------    -------------------------------------------------------   T E S T S  -----
ROS学习基础例子出现的问题(上)
$ rospack depends1 beginner_tutorials 查看一级依赖包,出现的问题:n rospack depends1 beginner_tutorialsn[rospack] Error: <em>package</em> 'beginner_tutorials' depends on non-existent <em>package</em> 'rospyt' and rosdep claims that
openwrt之wrtnode的学习日记day2续
./scripts/feeds install -a 报警告
Spring Boot 运行原理 - 查看Spring Boot自动配置项
1 查看Spring Boot自动配置项nnSpring Boot 自动配置源代码在spring-boot-autoconfigure-1.5.3.RELEASE.jar内,如图:nnnn如果想知道Spring Boot做了那些自动配置可以在这里看源码。nn可以通过下面三种方式查看当前项目中已启用和未启动的自动配置报告:nn运行jar时添加--debug参数:njava -j
细数Tinker接入的那些坑
目录替换Application打包失败分包rn替换Applicationrn按照TInker官方文档,接入Tinker Patch需要把原来项目中Application的代码移动到ApplicationLike中,然而这可不是件小事情,我们的application可能包含各种初始化,并且很多地方调用了application的public方法。比如rnrnimport android.support.mul...
Test resource
Test resource with jar <em>package</em>
tcc test package
tcc <em>test</em> <em>package</em>
Test resource continue
Test <em>package</em> resource continue
No package 'orocos-bfl' found
在使用新的ros导航包的时候,会提示-- Checking for module 'orocos-bfl' -- No <em>package</em> 'orocos-bfl' <em>found</em> CMake Error at /usr/share/cmake-3.5/Modules/FindPkgConfig.cmake:367 (message): A required <em>package</em> was not <em>found</em> Call Stack (most recent call first): /usr/share/cmake-3.5/Modules/FindPkgConfig.cmake:532 (_pkg_check_modules_internal) navigation/robot_pose_ekf/CMakeLists.txt:6 (pkg_check_modules) 这个错误,源码的下载地址没找到,所以直接使用了编译好的。 这个压缩文件里面有4个文件夹,依次放入 opt/ros/Kinetic/目录的文件夹下,即可解决错误。
Maven项目构建命令compile、testpackage
compilen 前面我们按照maven约束好的文件路径建好项目后,加入pom.xml 在命令行输入mvn compile后,maven就会自动帮我们下载依赖jar,为代码生成字节码文件等。我们把这个过程称为 编译。n<em>test</em>n 前面我们写好测试类,在命令行输入 mvn <em>test</em> 项目会新增surefire-reports(测试报告) 、 <em>test</em>-<em>classes</em>(测试类字节码)两个文件夹。我
Maven package 跳过测试用例
Maven <em>package</em> 跳过测试用例在实际应用中,当我们已经写好了测试用例,并且单个测试已经通过,所以在<em>package</em>的时候不希望再运行一遍测试用例,一个可能是会出一些不必要的错误,因为有些东西我们已经删除了,再去删除,或者说数据库清空了会出现一些规则的错误,无法打包,因此要比亚麻这些问问题。方法一在集成环境中,这里以idea为例,你可以在你的pom文件中添加以下代码:n <
spring boot 启动的自动配置查询
启动方式:在application.properties或者application.yml文件中加入debug=true或者debug: true============================CONDITIONS EVALUATION REPORT============================Positive matches:-----------------   AopAut...
run-as 命令调用成工所需的packages.list说明
在用ndk-gdb-py --verbose  --adb D:\android-sdk\platform-tools\adb.exe 调用gdb调试JNI代码时报错:Could not extract <em>package</em>'s data directory. Are you sure that your installed application is debuggable?这个错报,run-as的调...
CTS Verifier NFC/Notification 测试教程
Notification Package Priority Test NFC <em>test</em> [CTS Verifier][Test Method]Notification Attention Management Test
ubuntu14.04安装opencv3.0遇到的问题
下载opencv3.0源码,解压到/home/username/softeware中,然后运行使用cmake-gui,开始有针对性的配置opencv,添加支持build_TBB, build_TFF, with_ TFF, with_TBB1.关于支持QT不要选择添加with_QT,因为这样默认支持的是qt42.关于报错编译时,出现以下报错: /home/usrname/opencv-3.0.0
Eclipse 项目无法自动编译,WEB-INF/classes目录下没有class文件的解决过程
今天发布某个Web项目新版本,需要替换服务器上的几个class文件。在项目树中找到WEB-INF/<em>classes</em>目录,竟然发现没有任何class文件!
将 Spring boot 项目打成可执行Jar包,及相关注意事项(main-class、缺少 xsd、重复打包依赖)
最近在看 spring boot 的东西,觉得很方便,很好用。对于一个简单的REST服务,都不要自己部署Tomcat了,直接在 IDE 里 run 一个包含 main 函数的主类就可以了。但是,转念一想,到了真正需要部署应用的时候,不可能通过 IDE 去部署啊。那有没有办法将 spring boot 的项目打包成一个可执行的 jar 包,然后通过 java -jar 命令去启动相应的服务呢?很明显,
idea 连接hive(cdh3)问题1
Exception in thread &quot;main&quot; java.lang.IllegalArgumentException: Unable to instantiate SparkSession with Hive support because Hive <em>classes</em> are not <em>found</em>. at org.apache.spark.sql.SparkSession$Builder.ena...
Maven项目在eclipse中使用junit进行单元测试时报错:ClassNotFoundException
Maven项目在eclipse中使用junit进行单元测试时报错:ClassNotFoundException
Sublime Test 3 Package Control
Sublime Test 3 Package Control
pip安装'torch'出现PackageNotFoundError报错解决办法
1.虚拟环境安装:nn若安装失败,可能权限不够,需要在根用户下安装:进入根用户nn2.安装torch:nnnpip install torchnn或者使用:nnnconda install torchnn3.若出现报错PackageNotFoundError:nnFetching <em>package</em> metadata ...........nnPackageNotFoundError: Package...
IDEA Maven打包时去掉test
nn 
SpringBoot之添加单元测试
在SpringBoot里添加单元测试是非常简单的一件事,我们只需要添加SpringBoot单元测试的依赖jar,然后再添加两个注解就可搞定了。rn首先我们来添加单元测试所需要的jarrn n org.springframework.bootn spring-boot-starter-<em>test</em>n 接着我们写了一个单元测试的dem
Flutter 开发遇到问题
持续更新。。nn1 添加依赖后运行提示 MissingPluginException(No implementation <em>found</em> for method * on channel *)nnn确认运行过Packages getnn执行flutter clean(相当于删除build文件夹);n点击Stop关闭应用n点击Run运行应用nn2 Automat...
spring boot 2.1学习笔记【五】SpringBootTest单元测试及日志
springboot 2.1 单元测试,及日志输出
linux 6.3安装Oracle11.2 R2数据库问题汇总
安装需要使用oracle用户nn报错:n./runInstaller: line 97: /root/database/install/.oui: Permission deniednn解决:nchmod -R 775 databasen加上-R的命令把子目录下所有文件夹和文件赋予775nnn报错nCould not execute auto check for displa
mybatis框架使用package标签别名就报错的原因分析
config.xml:nnn&amp;lt;?xml version=&quot;1.0&quot; encoding=&quot;UTF-8&quot;?&amp;gt;n&amp;lt;!DOCTYPE configurationnPUBLIC &quot;-//mybatis.org//DTD Config 3.0//EN&quot;n&quot;http://mybatis.org/dtd/mybatis-3-config.dtd&quot;&amp;gt;n&amp;lt;configuratio
maven项目install时忽略执行test的几种方法
1.在项目所在文件夹根目录使用maven命令打包时:n&lt;!-- 不执行单元测试,也不编译测试类 --&gt;nmvn install -Dmaven.<em>test</em>.skip=truenn或n&lt;!-- 不执行单元测试,但会编译测试类,并在target/<em>test</em>-<em>classes</em>目录下生成相应的class --&gt;nmvn install -DskipTests=truenn2.spring...
centos7 安装11.2.04 报错解决
centos7 安装11.2.04 报错解决Error in invoking target 'agent nmhs' of makefile
安装、使用mongodb踩过的坑
String,StringBuffer,StringBuild之间的区别nn本Markdown编辑器使用StackEdit修改而来,用它写博客,将会带来全新的体验哦:nnnMarkdown和扩展Markdown简洁的语法n代码块高亮n图片链接和图片上传nLaTex数学公式nUML序列图和流程图n离线写博客n导入导出Markdown文件n丰富的快捷键nnnnn快捷键nnn加粗 Ctrl + B...
ruby on rails 的模型测试
1 为什么要为 Rails 程序编写测试?rn在 Rails 中编写测试非常简单,生成模型和控制器时,已经生成了测试代码骨架。rn即便是大范围重构后,只需运行测试就能确保实现了所需功能。rnRails 中的测试还可以模拟浏览器请求,无需打开浏览器就能测试程序的响应。rnrn2 测试简介rnrn测试是 Rails 程序的重要组成部分,不是处于尝鲜和好奇才编写测试。基本上每个 Rails 程序都要频繁
maven打war包忽略test的命令
命令输入-------&amp;gt;     mvn install -DskipTests 或 mvn install -Dmaven.<em>test</em>.skip=true
FreeSwitch学习之一:FreeSwitch源码安装
开始学习Freeswitch, 在这里记录一下学习过程, 以便后续翻看,查找, 此文记录安装过程,遇到的问题n环境:Ubuntu 14.04 LTSn一. 环境搭建:n     Freeswitch依赖的包安装n     sudo apt-get install git libcurl4-openssl-dev libexpat1-dev libssl-dev libtiff4-dev l
RDF3.0部署手册
安装环境推荐1.1 硬件环境要求推荐小规模硬件推荐:4-10个节点中等规模硬件配置推荐:20+个节点大规模硬件配置推荐:100节点以上处理器cpu2路 8核心XeonE5处理器(3.8GHz)2路 10核心XeonE5处理器(3.8GHz)2路 10核心 XeonE7处理器(3.8GHz)内存64G或者以上内存,DDR3L,RRECC128G或者以上内存,DDR3L,RRECC128G或者以上内存...
基于ubuntu16.04系统下OpenCV源码安装及无法import cv2
开篇OpenCV: Open Source Computer Vision Library n 官网:http://opencv.org/ n github:https://github.com/opencv/opencv n Openvc是一个由许多算法组成的处理图片的库,算法基本由C++以及少部分的C写成。并且提供大量的编程语言接口,如:Python, Java and MATLAB/OC
Android studio第一次打开遇到的问题
作为超级新手,今天第一次安装好打开android studio,发现如下问题:nEntry fileTemplates//code/Google Test Fixture SetUp Method.cc.ft not <em>found</em> in C:/Program Files/Android/Android Studio/lib/idea.jarn然后,在CSDN里搜到了相关解决办法,原方法见nhttps...
使用govendor管理Golang项目依赖
1、安装govendorrnrnrnrngo get -u -v github.com/kardianos/govendorrnrnrnrn2、initrnrn在项目根目录,比如我这里是tap项目,那就是进入tap目录,执行init命令rnrnrnrngovendor initrnlsrncd vendor/rnlsrnrn rn这个 vendor.json 会类似 godep 工具中的描述文件版本的功能。 rnrnrnrnrn3、执行命令将当前
记录一些学习angular2中遇到的问题
之前跟着angular2中文官网的教程做完了angular-tour-of-heroes这个demo,感觉没学到的东西不多,或者说忘掉很多了.所以想着到angular2英文官网继续学习.问题一我跟着CLI QUICKSTART快速建一个angular2的程序, 在全局安装完Angular-CLI后,我测试创建一个新的项目,执行下面的命令:ng new my-appn报了一大堆错误,第一个错误信息我没
安装SparkR
必须条件:n1:安装好JDKn2:安装好Rn步骤1: 运行R Shellnn[jifeng@feng03 R-3.1.1]$ RnnR version 3.1.1 (2014-07-10) -- "Sock it to Me"nCopyright (C) 2014 The R Foundation for Statistical ComputingnPlatform: x86_64-un
Required package 'vcl' not found
在装第三方控件mxoutlookbarpro时系统提示rn[Fatal Error] mxOutlookBarPro_D6.dpk(30): Required <em>package</em> 'vcl' not <em>found</em>rn这是什么原因呢,我该怎么办
Maven通过Jacoco生成单元测试覆盖率数据,无法生成jacoco.exec
由于jacoco-maven-plugin与maven-surefire-plugin插件均使用argLine参数,导致surefire覆盖了jacoco的参数,而无法生成jacoco.exec,maven报错:Skipping JaCoCo execution due to missing execution data filenn在jacoco中加入propertyName参数,在surefi...
spring.factories
本文件是springboot1.5.2的启动配置文件(META-INF/spring.factories),容器启动时会自动加载该文件并根据其中配置的内容实例化各个类
Java基础类用法示例程序
Each <em>package</em> contains examples demonstrating the use of <em>classes</em> in that <em>package</em>.
SpringBoot整合Dubbo遇到的几个坑
一、Bean没有注入到容器中报错n [DUBBO] No Spring Bean annotating Dubbo'snn2019-03-27 09:01:57.601 INFO 9276 --- [ main] b.f.a.ServiceAnnotationBeanPostProcessor : [DUBBO] BeanNameGenerator bean can't b...
Required package 'se_std_d7' not found
delphi 初学者rn运行时出现rn构建rn [致命错误] Required <em>package</em> 'se_std_d7' not <em>found</em>rn是怎么回事?
Package sunw.admin.snmp not found in import
请问有人对JMAPI熟悉的吗?rn为什么我编译它的一个example的时候会告诉我这样的错误呢?rn谢谢了。
执行代码提示:Ran 0 tests in 0.000s
执行结果提示:Ran 0 <em>test</em>s in 0.000s,而看不到打开网页执行代码过程解决方法:unit<em>test</em>框架中,main()方法定义函数时使用的是以&quot;<em>test</em>_xxx&quot;或&quot;<em>test</em>xxx&quot;的格式,所以只要将代码中的login_<em>test</em>改为<em>test</em>_login就okn...
found问题">.xml文件中编译时的class " " not found问题
查看项目中的.classpath文件是否被改动
解决配置文件未能复制到classes中的问题
今天自己用idea搭个测试项目(SSM框架),项目很顺利的搭建起来了,但是在测试接口的时候遇到了个问题。nn就是一直出现:nnnnnnnnnnn竟然出现这个问题,org.apache.ibatis.binding.BindingException: Invalid bound statement (not <em>found</em>):nn可是我的文件都是逆向工程生成的,怎么可能出问题,真是一口老血喷出,没...
精通_WebSphere_MQ下载
陨月酝宰藻遭杂责澡藻则藻酝匝是一个优秀的消息中间件,它被广泛地应用于各种企业应用系统之间的互连,已经 逐渐成为这方面的标准。本书从原理到实践全面系统地阐述了陨月酝宰藻遭杂责澡藻则藻酝匝产品的安装、配置、管 理、设计、编程等各个方面,同时也介绍了产品的扩展功能和一些高级使用技巧。 相关下载链接:[url=//download.csdn.net/download/luogang2005_7/2132749?utm_source=bbsseo]//download.csdn.net/download/luogang2005_7/2132749?utm_source=bbsseo[/url]
公司外部oracle培训PPT第一章,非常实用下载
oracle,select查询,单行函数,多表查询数据,组函数,子查询,高级子查询以及_exist_with子句,SQLPLUS。 相关下载链接:[url=//download.csdn.net/download/zuijiukuang/2863737?utm_source=bbsseo]//download.csdn.net/download/zuijiukuang/2863737?utm_source=bbsseo[/url]
总在最前的透明提示条下载
透明的提示条,可以定时更换多条提示,在超长的文字时可以跑动。 如果你勤快,甚至可以用来背单词。呵呵。 还可以设定是否总在最前等。 Delphi2007编写的。 相关下载链接:[url=//download.csdn.net/download/lao1945/3061422?utm_source=bbsseo]//download.csdn.net/download/lao1945/3061422?utm_source=bbsseo[/url]
文章热词 机器学习教程 Objective-C培训 交互设计视频教程 颜色模型 设计制作学习
相关热词 mysql关联查询两次本表 native底部 react extjs glyph 图标 0基础大数据 0基础学python
我们是很有底线的