faster-r-cnn在Windows+tensorflow环境下运行出错No module named 'lib.utils.cython_bbox' [问题点数:50分,无满意结帖,结帖人qq_33054139]

Bbs1
本版专家分:0
结帖率 66.67%
Bbs1
本版专家分:0
Bbs1
本版专家分:0
Bbs1
本版专家分:0
'No module named 'lib.utils.cython_bbox',训练faster-rcnn python3.5版本时报错
报错的原因:python版本不匹配,好多小伙伴装Anaconda时都默认装了3.6版本的python,安装faster rcnn时会生成一个3.6版本的文件,而我们需要的是3.5版本的文件,版本不匹配,所以会报错。 试了多种方法,都不可行,不如简单粗暴来的痛快些,解决方法: 1 删掉Anoconda重新下载一个python3.5版本的Anaconda 2 conda一个新<em>环境</em> 我在Anacond...
训练faster-rcnn python版本的时候报错No module named cython_bbox
补充一点:将proposal_target_layer.py中的 from <em>utils</em>.cython_bbox import bbox_overlaps 替换成: from <em>utils</em>.bbox import bbox_overlaps
ImportError: No module named 'lib.utils.cython_bbox'
原因:缺少文件,注意目录; 如果没有自己找一下,别留言了(我东西不知道放哪了hhh,大家还是最后用主流的linux来做,问题会少很多)
YOLO object detection物体的跟踪识别
yolo(You Only Look Once)是一个高速的物体识别算法,在这里我不详细赘述论文的内容,记录一下我在<em>环境</em>中进行物体识别的整个过程。 YOLOv1的原文:https://arxiv.org/pdf/1506.02640.pdf YOLOv2原文:https://arxiv.org/pdf/1612.08242.pdf 一.准备工作: python 3.5 or 3.6 or 3.7 ...
Tensorflow踩坑记(三):ImportError: No module named gpu_nms 和 ImportError: No module named Cython.Distutil
我在跑faster rcnn的时候<em>运行</em>python3 tool/demo.py就会出现错误提示:ImportError: <em>No</em> <em>module</em> <em>named</em> gpu_nms。这是因为没有在tf-faster-rcnn/lib路径下执行make导致的。 当在tf-faster-rcnn/lib中执行make是有时候会出现ImportError: <em>No</em> <em>module</em> <em>named</em> Cython.Distut...
ModuleNotFoundError: No module named 'Cython'
在虚拟<em>环境</em>中用下面命令安装Cython(本人是3.7版): python3.7 -m pip install cython
ModuleNotFoundError: No module named 'cython'
在使用Fast-RCNN代码时https://github.com/smallcorgi/Faster-RCNN_TF ,按照步骤,第二步make后出现了这个问题,但是我的cython已经装了,可能是什么问题呢? ![图片说明](https://img-ask.csdn.net/upload/201801/26/1516968516_512053.png)
运行fasterrcnn报错No module named cython_bbox以及由此引发的新错误error: Unable to find vcvarsall.bat
1.<em>运行</em>train.py 报错<em>No</em> <em>module</em> <em>named</em> cython_bbox 这是由于fasterrcnn为基于pyhton3.5的代码,但是之前安装的python版本为3.6,解决方法很简单 这位博主的方法即可解决 https://blog.csdn.net/memories_sunset/article/details/82117628 但是,该博主的代码在<em>运行</em>过程中会报出新的...
CSP运行出现No module named gpu_nms解决办法
CSP源码:https://github.com/liuwei16/CSP CSP论文:https://arxiv.org/abs/1904.02948 CSP算法思想:https://www.jiqizhixin.com/articles/2019-04-13 在<em>运行</em>test code时出现<em>No</em> <em>module</em> <em>named</em> gpu_nms错误。 原因:作者公布的源码并没有make编译gpu...
Faster R-CNN系列之PYTHON篇
Faster R-CNN系列之PYTHON篇
pip配置darkflow+yolo环境:win10+darkflow+yolo
注:在<em>环境</em>搭建之前需要先配置<em>tensorflow</em>的<em>环境</em>,具体可参考链接https://blog.csdn.net/weixin_39290638/article/details/80045236 链接中在“3. 安装<em>tensorflow</em>1.7”步骤在配置清华源时可能会失败,用Anaconda Powershell Prompt 打开重新配置即可。 依赖<em>环境</em>: a、Python 3.5 b...
RPN 预备编程知识(二) : 函数篇章 bbox_transform.py
目录 1. bbox_transform 计算与anchor有最大IOU的GT的偏移量 2. bbox_transform_batch 3. bbox_transform_inv 根据anchor和偏移量计算proposals 4. clip_boxes 将proposals的边界限制在图片内 5. clip_boxes_batch 6. bbox_overlaps (附手绘理解IOU...
Faster RCNN需要的两个make文件:cython_bbox.cpython-35m-x86_64-linux-gnu.so;cython_bbox.so
Faster-RCNN在linux <em>tensorflow</em> python3.5下<em>运行</em>时需要的make生成文件。编译通过。 请点击下面链接: cython_bbox.cpython-35m-x86_64-linux-gnu.so cython_bbox.so
Cython相关报错解决记录
 fatal error C1083: 无法打开包括文件: “numpy/arrayobject.h”: <em>No</em> such file or directorypyx文件 生成pyd 文件用于 cython调用时报错:from Cython.Build import cythonize import numpy as np from dist<em>utils</em>.core import setup try...
python gpu_nms编译错误
解决方案: 将<em>出错</em>的函数变量__pyx_t_5numpy_int32_t*,改成int*(见红色字体)。接着,为了保证gpu_nms.cpp不再由gpu_nms.pyx自动生成,需要将setup.py中ext_<em>module</em>s数组下的nms/gpu_nms.pyx改为nms/gpu_nms.cpp。 error: _nms((&amp;(__Pyx_BufPtrStrid...
Windows下训练Faster-RCNN报错:'No module named 'lib.utils.cython_bbox'
(网上大部分说的都是错的) 这个问题的根源是 lib.<em>utils</em> 下没有cython_bbox这个文件可以import,只有一个cython_bbox.pyx文件; pyx文件是用Cython写的类似C语言风格的文件,只有通过编译脚本setup.py编译后才能转换成python可以调用的文件; 因此我们首先在终端进入 /lib/<em>utils</em> 文件夹,<em>运行</em>命令即可: python setup.py b...
No module named bbox
from ..cython.bbox import bbox_overlaps_cython 我在跑 mask rcnn的时候: 。。。cython下有bbox.pyx 文件 。。。 python setup.py install ...
ImportError: cannot import name 'bbox_overlaps_cython'
ImportError: cannot import name 'bbox_overlaps_cython' run init.sh first
Faster-RCNN_TF代码解读9:proposal_target_layer_tf.py
# -------------------------------------------------------- # Faster R-CNN # Copyright (c) 2015 Microsoft # Licensed under The MIT License [see LICENSE for details] # Written by Ross Girshick and Sean B
ModuleNotFoundError: No module named 'tools.utils'
这个错误很经典,我在项目里面建了一个爬虫项目,我的爬虫项目里面有我导入的那个包,但是报这个错误 Module<em>No</em>tFoundError: <em>No</em> <em>module</em> <em>named</em> 'tools.<em>utils</em>' 解决办法很简单,只需要在文件夹里面再建一个文件__init__.py即可<em>运行</em> 转载于:https://www.cnblogs.com/liangliangzz/p/103921...
cython_bbox.so
Faster-RCNN在linux <em>tensorflow</em> python3.5下<em>运行</em>时需要的make生成文件。
Windows cmd下运行python脚本报错“ImportError: No Module named ...”的解决方法
想让测试用例以及发送报告的动作分开 这样看起来比较清晰 结果 结果你猜怎么着!在编辑器 完美<em>运行</em> 但是这不是我想要的 要让他自动定时执行测试用例 两种方法1.要么加入到<em>Windows</em>服务里 产生.bat文件 加入对应的服务即可(怎么加 这里跳过 重点讲产生.bat文件 使用命令<em>运行</em>报错的解决办法)2.使用Jenkins持续集成(Jenkins的安装 以及使用 以及注意事项 百度一大堆)重点说下 第...
Faster R-CNN: Towards Real-Time Object Detection with Region Proposal Networks程序(Python)配置问题总结
目录目录 预先浏览 QA预先浏览 原文:<em>faster-r-cnn</em> 源码:py-faster-rcnn接下来列举源码配置过程中我遇到的问题,希望对大家有帮助。若有错误,还望指出。 Q&A Q1: error: <em>utils</em>/bbox.c: <em>No</em> such file or directory x86_64-linux-gnu-gcc: error: <em>utils</em>/bbox.c: <em>No</em> such file o
ImportError: No module named timeutils解决方案
问题描述:celery模块已安装,但是导入celery模块下的<em>utils</em>.time<em>utils</em>时报错了。网上查了很久发现是因为celery4.0以上版本和djcelery3.1.17不谦容,同时安装会导致这个错误,安装celery3.1.x版本即可解决该问题。...
【解决】ImportError: No module named Cython.Build
ImportError: <em>No</em> <em>module</em> <em>named</em> Cython.Build   python setup.py install
python之import异常-ImportError: cannot import name xxx
bug:最近开发中遇到了import异常 目录A下的py文件B import 目录C下的py文件D抛出import异常ImportError: cannot import name Danalyze:一般情况这个exception是python找不到import进来的包或库导致的, 排查了一番后还没找到问题根源,总结了下情况: A,C目录名和B,D文件名都没写错; B,D两个py文件进行单
ModuleNotFoundError: No module named 'pyximport'
conda install pyximport 找不到包 pip install pyximport 没有匹配的版本 pyCharm-&gt;settings-&gt;Project Interpreter也找不到可安装的pyximport anaconda也一样 以上方法都不行。。。以上方法都不行。。。以上方法都不行 解决方法: 首先,确保安装了cython pip install Cyth...
Python-ImportError: No module named librosa(或其他库)解决方法
<em>运行</em>python程序时,经常会遇到一种错误类型:ImportError: <em>No</em> <em>module</em> <em>named</em> xxx,其中xxx一般是一个库。比如,我最近跑GitHub上的代码时,就提示ImportError: <em>No</em> <em>module</em> <em>named</em> librosa。有两种方法可以解决这个问题。 方法1:检查python中是否已安装该库。首先在命令行中输入 pip list,检测python是否已安装该库。...
ModuleNotFoundError: No module named 'deeplab'错误的解决办法
先说平台,我用的是win10+python3+anaconda3。在<em>运行</em>deeplab V3+代码的时候一直报以下错误: 因为我是<em>Windows</em>平台,所以我也参考了https://github.com/<em>tensorflow</em>/models/issues/4364中xhlulu 的回答,在<em>环境</em>变量中添加了 path/to/models/research path/to/models/rese...
No module named 'pandas.lib'
使用ggplot 报错如下信息 Module<em>No</em>tFoundError Traceback (most recent call last) &lt;ipython-input-2-16fbd4dda854&gt; in &lt;<em>module</em>&gt; 1 get_ipython().run_line_magic('matplotlib', 'inline') 2 import pandas as ...
pycaffe编译后的配置问题(ModuleNotFoundError: No module named 'caffe')
今天需要使用caffe的python端口,但是发现虚拟<em>环境</em>识别不出之前编译好的caffe了. 最后发现是<em>环境</em>变量的问题. 参考链接: 解决python在import caffe时出现的no <em>module</em> name _caffe问题 解决方法: 虚拟<em>环境</em>识别出编译好的caffe, 有三种方式: 把编译好的build路径下python添加到<em>环境</em>变量; 把译好的build路径下pytho...
cython_bbox.cpython-35m-x86_64-linux-gnu.so
Faster-RCNN在linux <em>tensorflow</em> python3.5下<em>运行</em>时需要的make生成文件
ImportError: No module named 'httplib'
ImportError: <em>No</em> <em>module</em> <em>named</em> 'httplib' 原因:Python 2.x中的"httplib"模块在Python 3.x中变成了"http.client" 原代码: import httplib import urllib reqheaders={ 'MobileType':'Android', ...
报错 No module named 'email.utils'; 'email' is not a package解决方法
<em>运行</em>python程序报错 : import email.<em>utils</em> Module<em>No</em>tFoundError: <em>No</em> <em>module</em> <em>named</em> ‘email.<em>utils</em>’; ‘email’ is not a package 最基本的就是安装这个模块,但是email是python自带的 后来网上查了原因 先确保你的当前文件夹中不要有email.py,以及你自己的(测试文件的)pytho
Python--‘No module named natsort’问题解决
一、问题 1、.py文件中有一行代码 “import natsort”,在python3 工程.py 时报错如下   二、分析 1、之前没有安装 natsort 包,解决思路安装 natsort 包。 2、可以使用pip工具安装或者是下载对应的安装包然后命令用python安装。   三、解决步骤 方法一 1、查看是否安装了对应python版本的pip 工具,如果没有或者是pi...
tensorflow版本的faster rcnn在windows系统下用cpu训练
源码地址:https://github.com/endernewton/tf-faster-rcnn 代码<em>运行</em>路径<em>运行</em>在没有中文的路径中,<em>环境</em>要求:win10+vs2015+python3.4+<em>tensorflow</em> python所需第三方包:cython,opencv-python,easydict(版本最好为1.6)、scipy、pillow 所需<em>环境</em>(其中有关GPU<em>环境</em>所需的cuda...
ModuleNotFoundError: No module named 'utils'
安装web.py 时候报错: Module<em>No</em>tFoundError: <em>No</em> <em>module</em> <em>named</em> '<em>utils</em>' 原因 在python3 上安装 web.py ,使用的安装指令不对 解决方法 官网(http://webpy.org/)给出了安装方法: python2: pip install web.py python3: pip install web.py==0.4...
Python编程:从入门到实践 问题解决:ImportError: No module named 'pygal.i18n'
在《Python编程:从入门到实践》书中的一个项目用到pygal.i18n获取国别码,然而,现在pygal已经没有i18n模块,要改用pygal_maps_world.i18n,解决方法如下: 在终端中<em>运行</em>下面语句(注意pip3/pip) pip install pygal_maps_world 在代码文件中添加下面语句: from pygal_maps_world.i18n import CO...
faster-RCNN tensorflow-gpu环境配置及安装出现的问题
1.<em>环境</em>的配置: 基础<em>环境</em>win10+vs2015+pycharm+anaconda+<em>tensorflow</em>-gpu+cuda+cudnn 上面的基础<em>环境</em>安装可以自行再百度需要注意的有一下几点: &amp;lt;1&amp;gt;anaconda的安装必须要对应python3.5     ****这一条至关重要的**** (补充:如果要是电脑上装了anaconda的python版本不是3.5的话,就需要安装...
(2019.12.17已解决)Cython编译ImportError:No module named Cython.Build
HelloWorld程序 作为学习的第一个程序,《Cython使用案例之:输出Hello World》,可能出现如题错误。 而实际文件中是有Cython.Build的,这是因为<em>环境</em>配置问题。 如何在cmd中调用Python3 PyCharm中是Python3,已经安装好Cython了,但是在CMD中直接调用python使用的是Python2.7,并没有安装Cython,因此<em>出错</em>。 在本...
python 3.x报错:No module named 'cookielib'或No module named 'urllib2'
1. Module<em>No</em>tFoundError: <em>No</em> <em>module</em> <em>named</em> 'cookielib' Python3中,importcookielib改成 importhttp.cookiejar,然后方法里cookielib也改成http.cookiejar。 2. Module<em>No</em>tFoundError: <em>No</em> <em>module</em> <em>named</em> 'urllib2'...
[Python]ImportError: No module named Cython.Distutils
centos 6.2 中安装pymssql-2.0.0b1-dev-20111019.tar.gz 错误:ImportError: <em>No</em> <em>module</em> <em>named</em> Cython.Dist<em>utils</em> 解决: 安装Cpython 的包, pip就可以安装了
【求助】Import Error:No module named pyQt4怎么解决?
<em>环境</em>:Eric 5+PyQt4+PyQt3 代码: import sys from pyQt4 import QtCore, QtGui from test import Ui_formTest cl
成功解决ModuleNotFoundError: No module named 'scipy._lib._ccallback'
成功解决Module<em>No</em>tFoundError: <em>No</em> <em>module</em> <em>named</em> 'scipy._lib._ccallback' 目录 解决问题 解决思路 解决方法 解决问题 Module<em>No</em>tFoundError: <em>No</em> <em>module</em> <em>named</em> 'scipy._lib._ccallback' 解决思路 找不到模块错误:没有名为'scipy...
ImportError : No module named pygpu
用python执行以下例子的时候:(测试theano调用gpu执行程序)http://deeplearning.net/software/theano/tutorial/using_gpu.html from theano import function, config, shared, tensor import numpy import time vlen = 10 * 30 * 768...
ImportError: No module named psutil
基于<em>环境</em> Ubuntu16.04 anaconda安装的Python2.7 解决办法 pip install psutil
ImportError: No module named _markerlib (Python安装第三方库时出现的错误)
当我试着安装第三方库时,报错如下:(flask) arthur@arthur-CW65S:~/microblog/flask/bin$ pip install --upgrade distribute Collecting distribute Using cached distribute-0.7.3.zip Complete output from command python s...
Cython的一个很简单但是很诡异的问题
这一段代码在cython编译的时候报错: # -*- coding: utf-8 -*- # Form implementation generated from reading ui file 't
python模块以及导入出现ImportError: No module named 'xxx'问题
python中,每个py文件被称之为模块,每个具有__init__.py文件的目录被称为包。只要模 块或者包所在的目录在sys.path中,就可以使用import 模块或import 包来使用 如果你要使用的模块(py文件)和当前模块在同一目录,只要import相应的文件名就好,比 如在a.py中使用b.py:  import b  但是如果要import一个不同目录的文件(例如b.
No module named 'utils.nms.cpu_nms' "报错 'cpu_nms.py'">【DL】解决 "No module named 'utils.nms.cpu_nms' "报错 'cpu_nms.py'
跑一些开源模型,会遇到这样的报错: cpu-nms 报错 Module<em>No</em>tFoundError: <em>No</em> <em>module</em> <em>named</em> ‘<em>utils</em>.nms.cpu_nms’ 解决方案:把 cpu_nms.pyx(一般路径为 ./<em>utils</em>/nms/cpu_nms.pyx) 替换为 cpu_nms.py. cpu_nms.py 下载 这样, cpu-nms 就可以用了 gpu-nms 报错 懒得处...
【跪求】winrm配置问题
各位大佬好,小弟准备利用python的pywinrm模块,远程管理windows server,但是在服务器上设置winrm的时候遇到了如下问题,望各位大佬指点迷津: # 配置 winrm 服务器 a
cpu_nms.py
重写覆盖原模型中使用的 cpu_nms.pyx, 解决碰到的 Module<em>No</em>tFoundError: <em>No</em> <em>module</em> <em>named</em> '<em>utils</em>.nms.cpu_nms' 报错
ImportError: No module named model_libs
  在<em>运行</em>ssd时遇到这个问题 实际是python接口的路径不对,使用echo $$PYTHONPATH  弹出当前python路径,发现是caffe自己的python接口,采用 export PYTHONPATH=/home/用户名/(当前要用的Python路径)/python即可, 最后可用echo $$PYTHONPATH查询当前python路径,示意如...
问题解决——Python中出现“ModuleNotFoundError: No module named 'utils'”
出现问题:Module<em>No</em>tFoundError: <em>No</em> <em>module</em> <em>named</em> '<em>utils</em>’ 解决方法: python2安装 pip install web.py python3安装 pip install web.py==0.40-dev1 安装成功
ubuntu16.04 'No module named 'object_detection''解决方案
博主在使用<em>tensorflow</em>的Tensorflow object detection API 训练自己的数据集时,出现以下error: Traceback (most recent call last):   File &quot;train.py&quot;, line 49, in &amp;lt;<em>module</em>&amp;gt;     from object_detection.builders import dataset...
Windows下编译fast rcnn
一、准备 caffe-windows:https://github.com/happynear/caffe-windows。如果你的caffe-windows版本是2015/07/09之前下载的,请重新下载并重新编译。重新编译时请首先编译python接口,因为马上就要用到。主程序和matlab接口可以有空的时候再编译。 fast r-cnn:https://github.com/rbgirshick
ubuntu下调用keras报错:No module named 'error'
cuda9.0和TensorFlow1.8.0已安装 import <em>tensorflow</em>也没有问题,就是再import keras<em>出错</em>,求大神解答! 报错如下: Using TensorFlow backend. Traceback (most recent call last): File "/home/zhangzhiyang/PycharmProjects/<em>tensorflow</em>1/test_keras.py", line 2, in import keras File "/home/zhangzhiyang/anaconda3/envs/<em>tensorflow</em>/lib/python3.6/site-packages/keras/__init__.py", line 3, in from . import <em>utils</em> File "/home/zhangzhiyang/anaconda3/envs/<em>tensorflow</em>/lib/python3.6/site-packages/keras/<em>utils</em>/__init__.py", line 26, in from .multi_gpu_<em>utils</em> import multi_gpu_model File "/home/zhangzhiyang/anaconda3/envs/<em>tensorflow</em>/lib/python3.6/site-packages/keras/<em>utils</em>/multi_gpu_<em>utils</em>.py", line 7, in from ..layers.merge import concatenate File "/home/zhangzhiyang/anaconda3/envs/<em>tensorflow</em>/lib/python3.6/site-packages/keras/layers/__init__.py", line 4, in from ..engine.base_layer import Layer File "/home/zhangzhiyang/anaconda3/envs/<em>tensorflow</em>/lib/python3.6/site-packages/keras/engine/__init__.py", line 7, in from .network import get_source_inputs File "/home/zhangzhiyang/anaconda3/envs/<em>tensorflow</em>/lib/python3.6/site-packages/keras/engine/network.py", line 9, in import yaml File "/home/zhangzhiyang/anaconda3/envs/<em>tensorflow</em>/lib/python3.6/site-packages/yaml/__init__.py", line 2, in from error import * Module<em>No</em>tFoundError: <em>No</em> <em>module</em> <em>named</em> 'error' 我的版本:<em>tensorflow</em>1.8.0,cuda9.0,cuDNN7,anaconda3,python3.6.5 我的<em>tensorflow</em>和keras安装路径均为anaconda3/envs/<em>tensorflow</em>/lib/python3.6/site-packages 我的.bashrc文件如下: export PATH="/home/zhangzhiyang/anaconda3/bin:$PATH" export LD_LIBRARY_PATH="/home/zhangzhiyang/newdisk/cuda-9.0/lib64:$LD_LIBRARY_PATH" export PATH="/home/zhangzhiyang/newdisk/cuda-9.0/bin:$PATH" export CUDA_HOME=$CUDA_HOME:"/home/zhangzhiyang/newdisk/cuda-9.0" 个人推测可能是python版本的问题,但不知如何解决,我第一次pip Keras未指定安装路径,结果keras安装在了python2.7下,这次我指定了路径为python3.6/site_packages,但是报了如上错误,是否keras不支持python3? 求大神解答!
ModuleNotFoundError: No module named 'scrapy'
我已经安装了scrapy  但是又说没有scrapy模块  怎么解决
ImportError: No module named 通用解决方法
最近多个小伙伴儿问“ImportError: <em>No</em> <em>module</em> <em>named</em> xxx“,应该怎么样解决。 其实,问这个问题,还是因为你对python的基本方法没有掌握好,我也把这类问题的通用解决方法整理一下,希望对小伙伴儿们能够有帮助。 报错现象:ImportError: <em>No</em> <em>module</em> <em>named</em> xxx(例如:ImportError: <em>No</em> <em>module</em> <em>named</em> pexpect) 问...
ImportError: cannot import name np_utils问题解决的过程
ImportError: cannot import name np_<em>utils</em>问题解决的过程问题描述解决过程尝试其他解决途径(来源于网络)相关知识 问题描述 安装了<em>tensorflow</em>-GPU,未安装好cuda(即没配置好gpu加速运算) import keras 报错,返回 ImportError: cannot import name np_<em>utils</em> background: Kera...
Python3.6报错ModuleNotFoundError: No module named 'cStringIO'
原语句为:from cStringIO import StringIO 报错:Module<em>No</em>tFoundError: <em>No</em> <em>module</em> <em>named</em> 'cStringIO' 原因为:Python2.x转Python3.x的问题 Python2.x的写法:import StringIO Python3.x的写法:from io import StringIO 因为我的是Python3.6...
pva-faster-rcnn安装error汇总
总结一下,留备用 question1: File"setup.py", line 10, in     from setuptools import setup ImportError:<em>No</em> <em>module</em> <em>named</em> setuptools make:*** [all] Error 1   solution1: wget http://pypi.python.org/package
win10修改darknet(yolov3)源代码令其裁剪出bbox并保存到本地
1.修改image.c中draw_detections_v3函数 首先添加一个函数 IplImage* image_to_iplImage(image p,IplImage* disp){ // 将image结构体中存放的一维数组转换成二维图像。 maybe image copy = copy_image(p); if(p.c == 3) rgbgr_image(copy); in...
cython_bbox.cpython-36m-x86_64-linux-gnu.so
Faster-RCNN在linux <em>tensorflow</em> python3.6下<em>运行</em>时需要的make生成文件
Faster-RCNN_TF代码解读19:bbox.pyx
# -------------------------------------------------------- # Fast R-CNN # Copyright (c) 2015 Microsoft # Licensed under The MIT License [see LICENSE for details] # Written by Sergey Karayev # ---------
caffe用python时可能需要的模块安装
1.ImportError: <em>No</em> <em>module</em> <em>named</em> Cython.Dist<em>utils</em> 2.ImportError: <em>No</em> <em>module</em> <em>named</em> easydict 3.ubuntu python安装 sklearn.<em>utils</em> 4.ubuntu python安装 pandas.io.parsers 5.ImportError: <em>No</em> <em>module</em> <em>named</em> cv2 6.ImportError: <em>No</em> <em>module</em> <em>named</em> yaml
Ubuntu上编译Caffe和拓展应用(faster-rcnn, pvanet)的错误及解决方案
Caffe 错误 采用make方式编译时遇到如下错误 Faster-RCNN 问题 如何编译只采用cpu版本的Faster-RCNN 问题<em>运行</em>时遇到错误ImportError <em>No</em> <em>module</em> <em>named</em> cv2 问题编译cpu版本成功后faster-rcnn<em>运行</em>时遇到错误ImportError <em>No</em> <em>module</em> <em>named</em> gpu_nms 问题1<em>运行</em>vgg16版本的faster-rcnn的
Faster Rcnn 代码解读之 anchor_target_layer.py
# -------------------------------------------------------- # Faster R-CNN # Copyright (c) 2015 Microsoft # Licensed under The MIT License [see LICENSE for details] # Written by Ross Girshick and Xinl...
Fast rcnn cpu 训练自己的数据
本文介绍如何在 cpu 模式下使用 Faster RCNN demo,以及在cpu 模式下训练自己的数据。Install Faster-rcnn源码地址:https://github.com/rbgirshick/py-faster-rcnn由于 faster rcnn 依赖是基于 caffe 的,所以需要先安装 caffe,所以前提是你已经在本机上装过 caffe ,然后直接复制该 Make
Win7下尝试编译Fast RCNN---- 一次失败的经历
前辈说,建议用Linux系统做,windows系统做会有问题。这叫我摸索半天之余突然放弃,心中着实有点不甘。于是,找了happynear大神的一篇博文<em>Windows</em>下编译fast rcnn,尝试了一下。等到windows系统下跑速实在不能忍受,对Caffe也有初步直观的了解后,再抽空换Linux下操作吧。
安装不上啊!提示:错误1935。安装汇编组件时出错!!!
安装.net出现这样的错误是什么意思:错误1935。安装汇编组件{DA28CA4A-27CA-486A-923F-5A4317BB70CE}.HRESULT 大家有没有碰到过这样的情况啊?我的系统是X
求助:已经安装了matplotlib运行程序仍ModuleNotFoundError: No module named 'matplotplib'
import matplotplib.pyplot as plt from matplotlib.daet import DateFormatter from matplotlib.finance i
ImportError: cannot import name ABCMeta 问题解决
今天测试python代码,不知怎么都启动不了测试,显示“ImportError: cannot import name ABCMeta” 然后我试着只用一句“print ‘abc’”结果还是错,于是我清楚,这个错误不是我的问题了。 于是仔细翻了代码目录,找到了一个名为abc.py的文件,原来是这个文件来系统的abc.py命名冲突了,以后不能乱给文件起名字了。
tensorflow object-detection ImportError: cannot import name 'string_int_label_map_pb2'
# From <em>tensorflow</em>/models/ protoc object_detection/protos/*.proto --python_out=. 每次使用新解压出来的object_detection文件夹时都要重新<em>运行</em>这一句,否则<em>运行</em>demo时会出现找不到string_int_label_map_pb2的问题,查看label_map_util.py文件发现from object_de...
faster rcnn源码理解(二)之AnchorTargetLayer(网络中的rpn_data)
转载自:faster rcnn源码理解(二)之AnchorTargetLayer(网络中的rpn_data) - 野孩子的专栏 - 博客频道 - CSDN.NET http://blog.csdn.net/u010668907/article/details/51942481 faster用python版本的https://github.com/rbgirshick/py-faster
运行py-faster-rcnn遇到的问题
最近尝试<em>运行</em>了python版的py-faster-rcnn,代码地址(https://github.com/rbgirshick/py-faster-rcnn),遇到了一些问题,看到别人家的孩子在编译lib时候没出问题我特别羡慕嫉妒恨。。。       编译lib文件遇到的问题如下:      首先要先下载几个模块,cython,python-opencv,easydict,      su
pvanet的问题--ImportError: dynamic module does not define init function (initcython_bbox)
参照:http://www.coin163.com/it/8981382003560309276/python-faster%20rcnn-Faster%20R-CNN 如果发现哪个文件有类似提示就把那个文件里的:<em>utils</em>.cython_bbox改为<em>utils</em>.bbox,即可。
Faster-RCNN_TF代码解读17:anchor_target_layer_tf.py
# -------------------------------------------------------- # Faster R-CNN # Copyright (c) 2015 Microsoft # Licensed under The MIT License [see LICENSE for details] # Written by Ross Girshick and Sean B
Faster R-CNN系列(一):配置与运行
Faster R-CNN系列(一):配置与<em>运行</em> 很多人在windows上想使用GitHub上的faster rcnn进行训练会遇到各种各样的问题,在此吧整个流程和遇到的问题记录一下。 本系列主要分成两个部分: 在window系统上<em>运行</em>(训练)开源的Tensorflow版本的Faster R-CNN 对Faster R-CNN原理以及代码进行详细解读 <em>环境</em> windows 10 pytho...
windows 下 编译py-faster-rcnn,py-rfcn, py-pva-frcn 下的lib。编译Cython模块
windows下想要<em>运行</em>py-faster-rcnn,py-rfcn, py-pva-frcn ,首先就是要编译lib文件夹下的setup.py ,建立Cython模块。其实这一些方法的lib都差不多,只需对照原版的setup.py进行相应的微改,记得修改代码中相应的文件夹名字。在Linux下编译这个很简单,在windows下面直接在cmd下编译是不会通过的,需要修改setup.py。 这里提供修
cuda8+cuDNN Faster R-CNN安装塈运行demo
安装cudacuda8安装参见网上教程安装cudnnCaffe目前的代码貌似不支持cudnn5,如果安装cudnn5,在编译caffe时会报错: error: argument of type “int” is incompatible with parameter of type “cudnnNanPropagation_t” 参见 https://github.com/tbennun/
module named XX"">关于" no module named XX"
最近在看关于广告点击率的论文,用到了iPinYou RTB data数据库,但要得到标准数据时我遇到了一个难题:按照人家的步骤 make all后一直提示 " no <em>module</em> <em>named</em> user
`ImportError: No module named '_tkinter'的一种解决方法
在centos系统下,导入matplotlib时,出现ImportError: <em>No</em> <em>module</em> <em>named</em> '_tkinter'的错误,首先yum list | grep ^tk 查看是否存在相应模块,通常原因是tkinter和tk-devel缺失。通过yum install -y tkinter 和yum install -y tk-devel下载相应模块,再重新编译python即可。重新编
ImportError: No module named _jythonlib
使用jython过程中遇到的一些问题,解决问题的流程:这里写链接内容 附jython文档:Chapter 10: Jython and Java Integration 应用场景: java调Python,非系统cmd调用,使用jython的PythonInterpreter执行python语句获取java对象。
modulenotfounderror: no module named 'matplotlib._path'问题的解决
今天在装matplotlib包的时候遇到这样的问题,在网上找了很长时间没有类似很好的解决方法,最后自己 研究找到了解决的方法。       之前在pycharm里面已经装了matplotlib包,之后觉着下载包挺麻烦(还要考虑包之间的依赖关系,实话说吧本人就是懒^=^)就直接下载了Anaconda,它直接将所有能用到 的或者用不到的包都导入进来,最后将pycharm的编译器设置为Anacon
No module named _tkinter"问题解决过程总结">Python下"No module named _tkinter"问题解决过程总结
引言:在Python3下<em>运行</em>Matplotlib之时,碰到了”<em>No</em> <em>module</em> <em>named</em> _tkinter“的问题,花费数小时进行研究解决,这里讲整个过程记录下来,并尝试分析过程中的解决思路利弊得失,以资后效,这里重点提示需要关注错误信息的分析,这个是第一现场。
no module named 'past'
缺少模块,安装pip install future。。。。这个真的是让人意想不到
ImportError: No module named 通用解决方法
最近多个小伙伴儿问“ImportError: <em>No</em> <em>module</em> <em>named</em> xxx“,应该怎么样解决。其实,问这个问题,还是因为你对python的基本方法没有掌握好,我也把这类问题的通用解决方法整理一下,希望对小伙伴儿们能够有帮助。报错现象:ImportError: <em>No</em> <em>module</em> <em>named</em> xxx(例如:ImportError: <em>No</em> <em>module</em> <em>named</em> pexpect)问题原因:...
ModuleNotFoundError: No module named 'scipy._lib.decorator'问题解决
问题来源: 在导入sklearn库时,出现 /usr/lib/python3/dist-packages/scipy/sparse/linalg/isolve/iterative.py in () 8 9 from scipy.sparse.linalg.interface import LinearOperator —&amp;gt; 10 from scipy._l...
ImportError: No module named 'scipy._lib.decorator'
问题: 今天在安装好imgaug数据增强库,想试一下import看看到底有没安装成功 发现如下错误: Traceback (most recent call last): File &quot;&amp;lt;stdin&amp;gt;&quot;, line 1, in &amp;lt;<em>module</em>&amp;gt; File &quot;/usr/local/lib/python3.5/dist-packages/imgaug/__in...
No module named finance
可以mpl_finance从https://github.com/matplotlib/mpl_finance下载该模块 。 下载文件后,您可以按常规方式安装, python setup.py install 或者你可以尝试通过点子安装, pip install mpl_finance 原因是matplotlib的人想要保持他们的代码干净,而不是在主代码中维护这样的专用sid...
终于明白阿里百度这样的大公司,为什么面试经常拿ThreadLocal考验求职者了
点击上面↑「爱开发」关注我们每晚10点,捕获技术思考和创业资源洞察什么是ThreadLocalThreadLocal是一个本地线程副本变量工具类,各个线程都拥有一份线程私有的数
锐捷问题的解决下载
锐捷问题的描述和解决! 相关下载链接:[url=//download.csdn.net/download/fwkismet/3884643?utm_source=bbsseo]//download.csdn.net/download/fwkismet/3884643?utm_source=bbsseo[/url]
struts-2.3.20文档资料下载
struts-2.3.20文档资料,可以查看struts-2.3.20相关文档信息 相关下载链接:[url=//download.csdn.net/download/jmqj520/8495817?utm_source=bbsseo]//download.csdn.net/download/jmqj520/8495817?utm_source=bbsseo[/url]
树莓派快速启动指南下载
树莓派简单介绍 相关下载链接:[url=//download.csdn.net/download/qq_39928600/9944019?utm_source=bbsseo]//download.csdn.net/download/qq_39928600/9944019?utm_source=bbsseo[/url]
相关热词 c# 时间比天数 c# oracle查询 c# 主动推送 事件 c# java 属性 c# 控制台 窗体 c# 静态类存值 c#矢量作图 c#窗体调用外部程式 c# enum是否合法 c# 如何卸载引用
我们是很有底线的