faster-r-cnn在Windows+tensorflow环境下运行出错No module named 'lib.utils.cython_bbox' [问题点数:50分,无满意结帖,结帖人qq_33054139]

Bbs1
本版专家分:0
结帖率 66.67%
Bbs1
本版专家分:0
Bbs1
本版专家分:0
'No module named 'lib.utils.cython_bbox',训练faster-rcnn python3.5版本时报错
报错的原因:python版本不匹配,好多小伙伴装Anaconda时都默认装了3.6版本的python,安装faster rcnn时会生成一个3.6版本的文件,而我们需要的是3.5版本的文件,版本不匹配,所以会报错。 试了多种方法,都不可行,不如简单粗暴来的痛快些,解决方法: 1 删掉Anoconda重新下载一个python3.5版本的Anaconda 2 conda一个新<em>环境</em> 我在Anacond...
ImportError: No module named 'lib.utils.cython_bbox'
原因:缺少文件,注意目录; 如果没有自己找一下,别留言了(我东西不知道放哪了hhh,大家还是最后用主流的linux来做,问题会少很多)
WIN10+Tensorflow+Faster RCNN训练错误:No module named cython_bbox
在训练Faster RCNN的时候,在win平台下,有一些倒霉的小伙伴或许会出现如图的错误。这个错误的主要原因是,目前网上流行的Faster RCNN版本大多都是基于Py35的。当你使用Py36的<em>环境</em>去编译,那么就会出现这个问题。 我们需要对Faster RCNN项目当中的setup.py进行一点点修改。我们在程序的16行加上Extension( “lib.<em>utils</em>.cython_bbox...
训练faster-rcnn python版本的时候报错No module named cython_bbox
补充一点:将proposal_target_layer.py中的 from <em>utils</em>.cython_bbox import bbox_overlaps 替换成: from <em>utils</em>.bbox import bbox_overlaps
Tensorflow踩坑记(三):ImportError: No module named gpu_nms 和 ImportError: No module named Cython.Distutil
我在跑faster rcnn的时候<em>运行</em>python3 tool/demo.py就会出现错误提示:ImportError: <em>No</em> <em>module</em> <em>named</em> gpu_nms。这是因为没有在tf-faster-rcnn/lib路径下执行make导致的。 当在tf-faster-rcnn/lib中执行make是有时候会出现ImportError: <em>No</em> <em>module</em> <em>named</em> Cython.Distut...
ModuleNotFoundError: No module named 'cython'
在使用Fast-RCNN代码时https://github.com/smallcorgi/Faster-RCNN_TF ,按照步骤,第二步make后出现了这个问题,但是我的cython已经装了,可能是什么问题呢? ![图片说明](https://img-ask.csdn.net/upload/201801/26/1516968516_512053.png)
No module named 'utils.nms.cpu_nms' "报错 'cpu_nms.py'">【DL】解决 "No module named 'utils.nms.cpu_nms' "报错 'cpu_nms.py'
跑一些开源模型,会遇到这样的报错: cpu-nms 报错 Module<em>No</em>tFoundError: <em>No</em> <em>module</em> <em>named</em> ‘<em>utils</em>.nms.cpu_nms’ 解决方案:把 cpu_nms.pyx(一般路径为 ./<em>utils</em>/nms/cpu_nms.pyx) 替换为 cpu_nms.py. cpu_nms.py 下载 这样, cpu-nms 就可以用了 gpu-nms 报错 懒得处...
运行fasterrcnn报错No module named cython_bbox以及由此引发的新错误error: Unable to find vcvarsall.bat
1.<em>运行</em>train.py 报错<em>No</em> <em>module</em> <em>named</em> cython_bbox 这是由于fasterrcnn为基于pyhton3.5的代码,但是之前安装的python版本为3.6,解决方法很简单 这位博主的方法即可解决 https://blog.csdn.net/memories_sunset/article/details/82117628 但是,该博主的代码在<em>运行</em>过程中会报出新的...
CSP运行出现No module named gpu_nms解决办法
CSP源码:https://github.com/liuwei16/CSP CSP论文:https://arxiv.org/abs/1904.02948 CSP算法思想:https://www.jiqizhixin.com/articles/2019-04-13 在<em>运行</em>test code时出现<em>No</em> <em>module</em> <em>named</em> gpu_nms错误。 原因:作者公布的源码并没有make编译gpu...
ModuleNotFoundError: No module named 'Cython'
在虚拟<em>环境</em>中用下面命令安装Cython(本人是3.7版): python3.7 -m pip install cython
ModuleNotFoundError: No module named 'utils.cython_bbox'
源码地址:https://github.com/lijianaiml/tf-faster-rcnn-windows 从源码中找到“tf-faster-rcnn-windows-master\lib\setup.py”, 注释掉66行的# CUDA = locate_cuda() 用pycharm打开,右击,选择:open in terminal 先输入以下命令执行: python se...
ImportError: cannot import name 'bbox_overlaps_cython'
ImportError: cannot import name 'bbox_overlaps_cython' run init.sh first
cython_bbox.so
Faster-RCNN在linux <em>tensorflow</em> python3.5下<em>运行</em>时需要的make生成文件。
(2019.12.17已解决)Cython编译ImportError:No module named Cython.Build
HelloWorld程序 作为学习的第一个程序,《Cython使用案例之:输出Hello World》,可能出现如题错误。 而实际文件中是有Cython.Build的,这是因为<em>环境</em>配置问题。 如何在cmd中调用Python3 PyCharm中是Python3,已经安装好Cython了,但是在CMD中直接调用python使用的是Python2.7,并没有安装Cython,因此<em>出错</em>。 在本...
No module named 'pandas.lib'
使用ggplot 报错如下信息 Module<em>No</em>tFoundError Traceback (most recent call last) &lt;ipython-input-2-16fbd4dda854&gt; in &lt;<em>module</em>&gt; 1 get_ipython().run_line_magic('matplotlib', 'inline') 2 import pandas as ...
No module named 'libs.box_utils.cython_utils.bbox'
之所以会遇到这个问题,是因为Faster-RCNN的代码是在windows下跑的,编译出来的bbox文件和ubuntu下的文件是不同的,因为ubuntu下是通过cython编译的,所以需要改一句话就行 这是编译出来的文件名字,可以看到是叫cython_bbox 所以我们找到代码对应位置 把 from libs.box_<em>utils</em>.cython_<em>utils</em>.bbox import bbo...
Faster R-CNN系列(一):配置与运行
Faster R-CNN系列(一):配置与<em>运行</em> 很多人在windows上想使用GitHub上的faster rcnn进行训练会遇到各种各样的问题,在此吧整个流程和遇到的问题记录一下。 本系列主要分成两个部分: 在window系统上<em>运行</em>(训练)开源的Tensorflow版本的Faster R-CNN 对Faster R-CNN原理以及代码进行详细解读 <em>环境</em> windows 10 pytho...
Faster R-CNN系列之PYTHON篇
Faster R-CNN系列之PYTHON篇
Cython的一个很简单但是很诡异的问题
这一段代码在cython编译的时候报错: # -*- coding: utf-8 -*- # Form implementation generated from reading ui file 't
win10下解决报错no module named utils.cython_bbox问题 (win10+tensorflow+python3.6)
报错no <em>module</em> <em>named</em> <em>utils</em>.cython_bbox (win10+<em>tensorflow</em>+python3.6) win10下解决报错no <em>module</em> <em>named</em> <em>utils</em>.cython_bbox问题 这个问题困扰了我很多天,今天终于跑通了,记录一下。 (我跑的是S4Net的代码,里面的几个关键文件和faster-rcnn的差不多,我搜索到的解决方法等也都是基于faster-r...
cpu_nms.py
重写覆盖原模型中使用的 cpu_nms.pyx, 解决碰到的 Module<em>No</em>tFoundError: <em>No</em> <em>module</em> <em>named</em> '<em>utils</em>.nms.cpu_nms' 报错
python之import异常-ImportError: cannot import name xxx
bug:最近开发中遇到了import异常 目录A下的py文件B import 目录C下的py文件D抛出import异常ImportError: cannot import name Danalyze:一般情况这个exception是python找不到import进来的包或库导致的, 排查了一番后还没找到问题根源,总结了下情况: A,C目录名和B,D文件名都没写错; B,D两个py文件进行单
Windows下训练Faster-RCNN报错:'No module named 'lib.utils.cython_bbox'
(网上大部分说的都是错的) 这个问题的根源是 lib.<em>utils</em> 下没有cython_bbox这个文件可以import,只有一个cython_bbox.pyx文件; pyx文件是用Cython写的类似C语言风格的文件,只有通过编译脚本setup.py编译后才能转换成python可以调用的文件; 因此我们首先在终端进入 /lib/<em>utils</em> 文件夹,<em>运行</em>命令即可: python setup.py b...
win10编译Faster RCNN的cython_utils(No Module named ''cython_bbox.bbox_overlaps)
win10编译Faster RCNN的cython_<em>utils</em>安装cuda、cudnn安装MinGW修改cython_<em>utils</em>/setup.py修改cython_<em>utils</em>/Makefile编译 安装cuda、cudnn 略 请确保设置CUDAHOME<em>环境</em>变量 安装MinGW 略 修改cython_<em>utils</em>/setup.py 将以下代码块中的 nvcc改为nvcc.exe lib64改为li...
cython_bbox.cpython-35m-x86_64-linux-gnu.so
Faster-RCNN在linux <em>tensorflow</em> python3.5下<em>运行</em>时需要的make生成文件
PyCharm中报错ModuleNotFoundError: No module named 'numpy'怎么解决?
win10系统下python3.7,pycharm2019.1.1,python中可以用numpy,pycharm中报错 ![图片说明](https://img-ask.csdn.net/upload/201905/05/1557044207_50081.png)![图片说明](https://img-ask.csdn.net/upload/201905/05/1557044213_301523.png)
Faster R-CNN tensorflow版,使用cpu运行demo.py的步骤
官方给出的Faster R-CNN的代码是caffe框架下的,我对caffe不是很了解,一直用的是<em>tensorflow</em><em>环境</em>,所以去网上找了一下用<em>tensorflow</em>实现的Faster R-CNN。找到了一篇博客https://blog.csdn.net/sinat_33486980/article/details/81045315,作者使用的是一个github上Xinlei Chen的tensor...
编译CTPN遇到的问题总结
本地<em>环境</em>: mac os 10.14 python 3.6 <em>tensorflow</em> 1.12.0 问题一:仅用cpu版本,lib/<em>utils</em>/setup.py 如下,执行报找不到bbox.c,我用的是pycharm,<em>运行</em>时需要把workdirctory设置 到<em>utils</em>目录下,如图: from Cython.Build import cythonize import numpy a...
最简单cython编译出现问题,大神求帮忙
在使用cython编译最简单的helloworld程序时出现如下问题: 本人使用的是anaconda3+vs2015 ``` Compiling helloworld.pyx because it changed. [1/1] Cythonizing helloworld.pyx running build_ext Traceback (most recent call last): File "setup.py", line 5, in ext_<em>module</em>s = cythonize("helloworld.pyx") File "D:\anaconda\lib\dist<em>utils</em>\core.py", line 148, in setup dist.run_commands() File "D:\anaconda\lib\dist<em>utils</em>\dist.py", line 955, in run_commands self.run_command(cmd) File "D:\anaconda\lib\dist<em>utils</em>\dist.py", line 974, in run_command cmd_obj.run() File "D:\anaconda\lib\dist<em>utils</em>\command\build_ext.py", line 308, in run force=self.force) File "D:\anaconda\lib\dist<em>utils</em>\ccompiler.py", line 1031, in new_compiler return klass(<em>No</em>ne, dry_run, force) File "D:\anaconda\lib\dist<em>utils</em>\cygwinccompiler.py", line 285, in __init__ CygwinCCompiler.__init__ (self, verbose, dry_run, force) File "D:\anaconda\lib\dist<em>utils</em>\cygwinccompiler.py", line 129, in __init__ if self.ld_version >= "2.10.90": TypeError: '>=' not supported between instances of '<em>No</em>neType' and 'str' ``` helloworld.pyx文件中的代码 ``` print('hello world') ``` setup.py中代码 ``` from dist<em>utils</em>.core import setup from Cython.Build import cythonize setup( ext_<em>module</em>s = cythonize("helloworld.pyx") ) ```
python的setup问题
今天在使用python的扩展包的时候遇到了一些问题特此记录下来。 首先看一下有什么命令: Standard commands: build build everything needed to install build_py "build" pure Python <em>module</em>s (copy to build directory) build...
[Python]ImportError: No module named Cython.Distutils
centos 6.2 中安装pymssql-2.0.0b1-dev-20111019.tar.gz 错误:ImportError: <em>No</em> <em>module</em> <em>named</em> Cython.Dist<em>utils</em> 解决: 安装Cpython 的包, pip就可以安装了
Faster RCNN需要的两个make文件:cython_bbox.cpython-35m-x86_64-linux-gnu.so;cython_bbox.so
Faster-RCNN在linux <em>tensorflow</em> python3.5下<em>运行</em>时需要的make生成文件。编译通过。 请点击下面链接: cython_bbox.cpython-35m-x86_64-linux-gnu.so cython_bbox.so
retainface使用报错:ModuleNotFoundError: No module named 'rcnn.cython.bbox'
insightface新作:RetinaFace单阶段人脸检测 马上动手试了一波 项目链接: https://github.com/deepinsight/insightface/tree/master/RetinaFace 根据一步步操作下来,利用下载好的预训练模型进行人脸检测,突然发现报错 Module<em>No</em>tFoundError: <em>No</em> <em>module</em> <em>named</em> ‘rcnn.cython.b...
【解决】ImportError: No module named Cython.Build
ImportError: <em>No</em> <em>module</em> <em>named</em> Cython.Build   python setup.py install
No module named 'lib_kernel.lib_nms.gpu_nms'"解决方案">TF-cpn人体姿态估计运行mptest.py"No module named 'lib_kernel.lib_nms.gpu_nms'"解决方案
这个BUG解决了整整一天,特此纪念 原工程链接https://github.com/chenyilun95/tf-cpn/ 训练完毕后,执行python mptest.py -d 0-1 -m log/model_dump/snapshot_18.ckpt 报错 在这里说明一下,执行该命令前,已经完成lib.kernel/lib_nms下的compile.sh编译工作,编译就不多说了,首先手动删...
解决 No module named 'matplotlib'
声明: 1. 我是在jupyter notebook上出现的问题,jupyter notebook是在anaconda上进行安装的,同时<em>tensorflow</em>也是在anaconda上安装的。 2. 并且,我的各种默认地址都进行了改变,都安装在D盘下。 3. 我是一个喜欢看图的人,所以,我的过程主要看图其实就是可以的,文字只是起到说明作用。 问题: 以下就是解决措施: 1. 打开终端 ...
Faster-RCNN_TF代码解读19:bbox.pyx
# -------------------------------------------------------- # Fast R-CNN # Copyright (c) 2015 Microsoft # Licensed under The MIT License [see LICENSE for details] # Written by Sergey Karayev # ---------
win10 vs2015 编译nms和gpunms
rcnn r-fcn tiny-face 需要用, win10 vs2015 编译nms和gpunms,亲测成功,推荐下载
Win7下尝试编译Fast RCNN---- 一次失败的经历
前辈说,建议用Linux系统做,windows系统做会有问题。这叫我摸索半天之余突然放弃,心中着实有点不甘。于是,找了happynear大神的一篇博文<em>Windows</em>下编译fast rcnn,尝试了一下。等到windows系统下跑速实在不能忍受,对Caffe也有初步直观的了解后,再抽空换Linux下操作吧。
No module named finance
可以mpl_finance从https://github.com/matplotlib/mpl_finance下载该模块 。 下载文件后,您可以按常规方式安装, python setup.py install 或者你可以尝试通过点子安装, pip install mpl_finance 原因是matplotlib的人想要保持他们的代码干净,而不是在主代码中维护这样的专用sid...
Windows cmd下运行python脚本报错“ImportError: No Module named ...”的解决方法
想让测试用例以及发送报告的动作分开 这样看起来比较清晰 结果 结果你猜怎么着!在编辑器 完美<em>运行</em> 但是这不是我想要的 要让他自动定时执行测试用例 两种方法1.要么加入到<em>Windows</em>服务里 产生.bat文件 加入对应的服务即可(怎么加 这里跳过 重点讲产生.bat文件 使用命令<em>运行</em>报错的解决办法)2.使用Jenkins持续集成(Jenkins的安装 以及使用 以及注意事项 百度一大堆)重点说下 第...
python模块以及导入出现ImportError: No module named 'xxx'问题
在建testcase的时候,跟代码文件夹建了一个独立的文件夹tests, 用于存放测试用例, 但单独<em>运行</em>的时候,却报 找不到模块
ImportError : No module named pygpu
用python执行以下例子的时候:(测试theano调用gpu执行程序)http://deeplearning.net/software/theano/tutorial/using_gpu.html from theano import function, config, shared, tensor import numpy import time vlen = 10 * 30 * 768...
python gpu_nms编译错误
解决方案: 将<em>出错</em>的函数变量__pyx_t_5numpy_int32_t*,改成int*(见红色字体)。接着,为了保证gpu_nms.cpp不再由gpu_nms.pyx自动生成,需要将setup.py中ext_<em>module</em>s数组下的nms/gpu_nms.pyx改为nms/gpu_nms.cpp。 error: _nms((&amp;(__Pyx_BufPtrStrid...
python中import包的一些心得,解决ImportError: No module named
python中import包的一些心得,解决ImportError: <em>No</em> <em>module</em> <em>named</em> 今天用python3,在引包的时候出现一些错误,于是测试了一些情况,有以下几点心得,记录一下。 1.如果要import文件夹里的,记得是package才行,dictionary不行,区别是有没有__init__.py 2.如果是python2,在import同一个文件夹里的,不用加前缀,比如pro...
No module named bbox
from ..cython.bbox import bbox_overlaps_cython 我在跑 mask rcnn的时候: 。。。cython下有bbox.pyx 文件 。。。 python setup.py install ...
python import caffe时 报错【三】:ImportError: No module named Cython.Distutils
刚装好caffe,想网上查一下caffe的案例跑一跑   下载faster r-cnn: git clone --recursive https://github.com/rbgirshick/py-faster-rcnn.git 进入py-faster-rcnn/lib make   这时候发现问题如下: Traceback (most recent call last):  ...
ModuleNotFoundError: No module named 'tools.utils'
这个错误很经典,我在项目里面建了一个爬虫项目,我的爬虫项目里面有我导入的那个包,但是报这个错误 Module<em>No</em>tFoundError: <em>No</em> <em>module</em> <em>named</em> 'tools.<em>utils</em>' 解决办法很简单,只需要在文件夹里面再建一个文件__init__.py即可<em>运行</em> 转载于:https://www.cnblogs.com/liangliangzz/p/103921...
ImportError: No module named timeutils解决方案
问题描述:celery模块已安装,但是导入celery模块下的<em>utils</em>.time<em>utils</em>时报错了。网上查了很久发现是因为celery4.0以上版本和djcelery3.1.17不谦容,同时安装会导致这个错误,安装celery3.1.x版本即可解决该问题。...
Python-ImportError: No module named librosa(或其他库)解决方法
<em>运行</em>python程序时,经常会遇到一种错误类型:ImportError: <em>No</em> <em>module</em> <em>named</em> xxx,其中xxx一般是一个库。比如,我最近跑GitHub上的代码时,就提示ImportError: <em>No</em> <em>module</em> <em>named</em> librosa。有两种方法可以解决这个问题。 方法1:检查python中是否已安装该库。首先在命令行中输入 pip list,检测python是否已安装该库。...
ModuleNotFoundError: No module named 'deeplab'错误的解决办法
先说平台,我用的是win10+python3+anaconda3。在<em>运行</em>deeplab V3+代码的时候一直报以下错误: 因为我是<em>Windows</em>平台,所以我也参考了https://github.com/<em>tensorflow</em>/models/issues/4364中xhlulu 的回答,在<em>环境</em>变量中添加了 path/to/models/research path/to/models/rese...
pycaffe编译后的配置问题(ModuleNotFoundError: No module named 'caffe')
今天需要使用caffe的python端口,但是发现虚拟<em>环境</em>识别不出之前编译好的caffe了. 最后发现是<em>环境</em>变量的问题. 参考链接: 解决python在import caffe时出现的no <em>module</em> name _caffe问题 解决方法: 虚拟<em>环境</em>识别出编译好的caffe, 有三种方式: 把编译好的build路径下python添加到<em>环境</em>变量; 把译好的build路径下pytho...
ImportError: No module named 'httplib'
ImportError: <em>No</em> <em>module</em> <em>named</em> 'httplib' 原因:Python 2.x中的"httplib"模块在Python 3.x中变成了"http.client" 原代码: import httplib import urllib reqheaders={ 'MobileType':'Android', ...
no module named future.utils 和 no module import_export.amin的解决方案
在安装xadmin时遇到的问题 解决方案: pip install future 解决方案:pip install django_import_export 搞定!!!!!!!!!
报错 No module named 'email.utils'; 'email' is not a package解决方法
<em>运行</em>python程序报错 : import email.<em>utils</em> Module<em>No</em>tFoundError: <em>No</em> <em>module</em> <em>named</em> ‘email.<em>utils</em>’; ‘email’ is not a package 最基本的就是安装这个模块,但是email是python自带的 后来网上查了原因 先确保你的当前文件夹中不要有email.py,以及你自己的(测试文件的)pytho
Python--‘No module named natsort’问题解决
一、问题 1、.py文件中有一行代码 “import natsort”,在python3 工程.py 时报错如下   二、分析 1、之前没有安装 natsort 包,解决思路安装 natsort 包。 2、可以使用pip工具安装或者是下载对应的安装包然后命令用python安装。   三、解决步骤 方法一 1、查看是否安装了对应python版本的pip 工具,如果没有或者是pi...
ModuleNotFoundError: No module named 'pyximport'
conda install pyximport 找不到包 pip install pyximport 没有匹配的版本 pyCharm-&gt;settings-&gt;Project Interpreter也找不到可安装的pyximport anaconda也一样 以上方法都不行。。。以上方法都不行。。。以上方法都不行 解决方法: 首先,确保安装了cython pip install Cyth...
ModuleNotFoundError: No module named 'utils'
安装web.py 时候报错: Module<em>No</em>tFoundError: <em>No</em> <em>module</em> <em>named</em> '<em>utils</em>' 原因 在python3 上安装 web.py ,使用的安装指令不对 解决方法 官网(http://webpy.org/)给出了安装方法: python2: pip install web.py python3: pip install web.py==0.4...
Python编程:从入门到实践 问题解决:ImportError: No module named 'pygal.i18n'
在《Python编程:从入门到实践》书中的一个项目用到pygal.i18n获取国别码,然而,现在pygal已经没有i18n模块,要改用pygal_maps_world.i18n,解决方法如下: 在终端中<em>运行</em>下面语句(注意pip3/pip) pip install pygal_maps_world 在代码文件中添加下面语句: from pygal_maps_world.i18n import CO...
2019.6.18No module named 'utils'解决方法
<em>No</em> <em>module</em> <em>named</em> ‘<em>utils</em>’ 文件中已有模块 <em>环境</em>变量只设置到research,所以 改 from <em>utils</em> import label_map_util 为 from object_detection.<em>utils</em> import label_map_util 亲测有效
faster-RCNN tensorflow-gpu环境配置及安装出现的问题
1.<em>环境</em>的配置: 基础<em>环境</em>win10+vs2015+pycharm+anaconda+<em>tensorflow</em>-gpu+cuda+cudnn 上面的基础<em>环境</em>安装可以自行再百度需要注意的有一下几点: &amp;lt;1&amp;gt;anaconda的安装必须要对应python3.5     ****这一条至关重要的**** (补充:如果要是电脑上装了anaconda的python版本不是3.5的话,就需要安装...
Fast rcnn cpu 训练自己的数据
本文介绍如何在 cpu 模式下使用 Faster RCNN demo,以及在cpu 模式下训练自己的数据。Install Faster-rcnn源码地址:https://github.com/rbgirshick/py-faster-rcnn由于 faster rcnn 依赖是基于 caffe 的,所以需要先安装 caffe,所以前提是你已经在本机上装过 caffe ,然后直接复制该 Make
python 3.x报错:No module named 'cookielib'或No module named 'urllib2'
1. Module<em>No</em>tFoundError: <em>No</em> <em>module</em> <em>named</em> 'cookielib' Python3中,importcookielib改成 importhttp.cookiejar,然后方法里cookielib也改成http.cookiejar。 2. Module<em>No</em>tFoundError: <em>No</em> <em>module</em> <em>named</em> 'urllib2'...
【求助】Import Error:No module named pyQt4怎么解决?
<em>环境</em>:Eric 5+PyQt4+PyQt3 代码: import sys from pyQt4 import QtCore, QtGui from test import Ui_formTest cl
成功解决ModuleNotFoundError: No module named 'scipy._lib._ccallback'
成功解决Module<em>No</em>tFoundError: <em>No</em> <em>module</em> <em>named</em> 'scipy._lib._ccallback' 目录 解决问题 解决思路 解决方法 解决问题 Module<em>No</em>tFoundError: <em>No</em> <em>module</em> <em>named</em> 'scipy._lib._ccallback' 解决思路 找不到模块错误:没有名为'scipy...
ImportError: No module named _markerlib (Python安装第三方库时出现的错误)
当我试着安装第三方库时,报错如下:(flask) arthur@arthur-CW65S:~/microblog/flask/bin$ pip install --upgrade distribute Collecting distribute Using cached distribute-0.7.3.zip Complete output from command python s...
ModuleNotFoundError: No module named 'scrapy'
我已经安装了scrapy  但是又说没有scrapy模块  怎么解决
运行faster rcnn demo时出现dynamic module does not define init function (initcython_bbox)错误的解决方法
<em>运行</em>faster rcnn demo时出现部分错误的解决方法 第一:“from <em>utils</em>.cython_bbox import bbox_overlaps” dynamic <em>module</em> does not define init function (initcython_bbox)的解决办法 第1步:在faster rcnn文件夹下,在终端使用find lib -name "*.so" -del...
【跪求】winrm配置问题
各位大佬好,小弟准备利用python的pywinrm模块,远程管理windows server,但是在服务器上设置winrm的时候遇到了如下问题,望各位大佬指点迷津: # 配置 winrm 服务器 a
Faster_RCNN 报错dynamic module does not define module export function (PyInit_cython_bbox)
1.自己生成pyd文件后,要与生成时的名字相对应,如setup( ext_<em>module</em>s=cythonize([&quot;bbox.pyx&quot;,&quot;nms.pyx&quot;],include_dirs=[np.get_include()]), )对应的就是bbox,所以如果发现哪个文件有类似提示就把那个文件里的:<em>utils</em>.cython_bbox改为<em>utils</em>.bbox,即可。...
ImportError: No module named model_libs
  在<em>运行</em>ssd时遇到这个问题 实际是python接口的路径不对,使用echo $$PYTHONPATH  弹出当前python路径,发现是caffe自己的python接口,采用 export PYTHONPATH=/home/用户名/(当前要用的Python路径)/python即可, 最后可用echo $$PYTHONPATH查询当前python路径,示意如...
问题解决——Python中出现“ModuleNotFoundError: No module named 'utils'”
出现问题:Module<em>No</em>tFoundError: <em>No</em> <em>module</em> <em>named</em> '<em>utils</em>’ 解决方法: python2安装 pip install web.py python3安装 pip install web.py==0.40-dev1 安装成功
ubuntu16.04 'No module named 'object_detection''解决方案
博主在使用<em>tensorflow</em>的Tensorflow object detection API 训练自己的数据集时,出现以下error: Traceback (most recent call last):   File &quot;train.py&quot;, line 49, in &amp;lt;<em>module</em>&amp;gt;     from object_detection.builders import dataset...
Windows下编译fast rcnn
一、准备 caffe-windows:https://github.com/happynear/caffe-windows。如果你的caffe-windows版本是2015/07/09之前下载的,请重新下载并重新编译。重新编译时请首先编译python接口,因为马上就要用到。主程序和matlab接口可以有空的时候再编译。 fast r-cnn:https://github.com/rbgirshick
ubuntu下调用keras报错:No module named 'error'
cuda9.0和TensorFlow1.8.0已安装 import <em>tensorflow</em>也没有问题,就是再import keras<em>出错</em>,求大神解答! 报错如下: Using TensorFlow backend. Traceback (most recent call last): File "/home/zhangzhiyang/PycharmProjects/<em>tensorflow</em>1/test_keras.py", line 2, in import keras File "/home/zhangzhiyang/anaconda3/envs/<em>tensorflow</em>/lib/python3.6/site-packages/keras/__init__.py", line 3, in from . import <em>utils</em> File "/home/zhangzhiyang/anaconda3/envs/<em>tensorflow</em>/lib/python3.6/site-packages/keras/<em>utils</em>/__init__.py", line 26, in from .multi_gpu_<em>utils</em> import multi_gpu_model File "/home/zhangzhiyang/anaconda3/envs/<em>tensorflow</em>/lib/python3.6/site-packages/keras/<em>utils</em>/multi_gpu_<em>utils</em>.py", line 7, in from ..layers.merge import concatenate File "/home/zhangzhiyang/anaconda3/envs/<em>tensorflow</em>/lib/python3.6/site-packages/keras/layers/__init__.py", line 4, in from ..engine.base_layer import Layer File "/home/zhangzhiyang/anaconda3/envs/<em>tensorflow</em>/lib/python3.6/site-packages/keras/engine/__init__.py", line 7, in from .network import get_source_inputs File "/home/zhangzhiyang/anaconda3/envs/<em>tensorflow</em>/lib/python3.6/site-packages/keras/engine/network.py", line 9, in import yaml File "/home/zhangzhiyang/anaconda3/envs/<em>tensorflow</em>/lib/python3.6/site-packages/yaml/__init__.py", line 2, in from error import * Module<em>No</em>tFoundError: <em>No</em> <em>module</em> <em>named</em> 'error' 我的版本:<em>tensorflow</em>1.8.0,cuda9.0,cuDNN7,anaconda3,python3.6.5 我的<em>tensorflow</em>和keras安装路径均为anaconda3/envs/<em>tensorflow</em>/lib/python3.6/site-packages 我的.bashrc文件如下: export PATH="/home/zhangzhiyang/anaconda3/bin:$PATH" export LD_LIBRARY_PATH="/home/zhangzhiyang/newdisk/cuda-9.0/lib64:$LD_LIBRARY_PATH" export PATH="/home/zhangzhiyang/newdisk/cuda-9.0/bin:$PATH" export CUDA_HOME=$CUDA_HOME:"/home/zhangzhiyang/newdisk/cuda-9.0" 个人推测可能是python版本的问题,但不知如何解决,我第一次pip Keras未指定安装路径,结果keras安装在了python2.7下,这次我指定了路径为python3.6/site_packages,但是报了如上错误,是否keras不支持python3? 求大神解答!
ImportError: No module named 通用解决方法
最近多个小伙伴儿问“ImportError: <em>No</em> <em>module</em> <em>named</em> xxx“,应该怎么样解决。 其实,问这个问题,还是因为你对python的基本方法没有掌握好,我也把这类问题的通用解决方法整理一下,希望对小伙伴儿们能够有帮助。 报错现象:ImportError: <em>No</em> <em>module</em> <em>named</em> xxx(例如:ImportError: <em>No</em> <em>module</em> <em>named</em> pexpect) 问...
使用Tensorflow实现MTCNN遇到了nms作用不理想的问题
使用widerface库对pnet,rnet,onet分别进行了训练,训练阶段没问题,测试FDDB数据集发现nms没有起到太好的效果,如下图所示: 一开始效果太差,后面进行了两次nms,效果依旧不好
setup_cuda.py 编译gpu_nms
setup_cuda.py setup_cuda 1.修改 include_dirs = [numpy_include, r'C:\Program Files\NVIDIA GPU Computing Toolkit\CUDA\v8.0\include']) 2.报错: LINK : fatal error LNK118
目标检测中NMS的GPU实现(来自于Faster R-CNN中的nms_kernel.cu文件)
最近要修改Faster R-CNN中实现的GPU版的NMS代码,于是小白的我就看起了CUDA编程,当然也只是浅显地阅读一些教程,快速入门而已,所以具体需要注意的以及一些思想,大家移步此博主的系列教程: 在了解了CUDA编程的核心思想后,我们便可以开始阅读nms_kernel.cu文件了,先直接上源码(部分简单的已经注释),如下: // ----------------------------...
ImportError: cannot import name np_utils问题解决的过程
ImportError: cannot import name np_<em>utils</em>问题解决的过程问题描述解决过程尝试其他解决途径(来源于网络)相关知识 问题描述 安装了<em>tensorflow</em>-GPU,未安装好cuda(即没配置好gpu加速运算) import keras 报错,返回 ImportError: cannot import name np_<em>utils</em> background: Kera...
Python3.6报错ModuleNotFoundError: No module named 'cStringIO'
原语句为:from cStringIO import StringIO 报错:Module<em>No</em>tFoundError: <em>No</em> <em>module</em> <em>named</em> 'cStringIO' 原因为:Python2.x转Python3.x的问题 Python2.x的写法:import StringIO Python3.x的写法:from io import StringIO 因为我的是Python3.6...
新人求教,Python支行时提示ImportError: cannot import name LifoQueue
不知道什么原因,在网上搜索了下,也没有找到答案啊,请都各位这是什么原因,需要怎么来改! <em>运行</em><em>环境</em>Centos7+Python 2.7.5+pycharm-4.5.1,python 是centos7自带
pva-faster-rcnn安装error汇总
总结一下,留备用 question1: File"setup.py", line 10, in     from setuptools import setup ImportError:<em>No</em> <em>module</em> <em>named</em> setuptools make:*** [all] Error 1   solution1: wget http://pypi.python.org/package
pvanet的问题--ImportError: dynamic module does not define init function (initcython_bbox)
参照:http://www.coin163.com/it/8981382003560309276/python-faster%20rcnn-Faster%20R-CNN 如果发现哪个文件有类似提示就把那个文件里的:<em>utils</em>.cython_bbox改为<em>utils</em>.bbox,即可。
cython_bbox.cpython-36m-x86_64-linux-gnu.so
Faster-RCNN在linux <em>tensorflow</em> python3.6下<em>运行</em>时需要的make生成文件
pydbg: No module name utils
[Python灰帽子:黑客与逆向工程师的Python编程之道] 里面代码中,有部分代码没办法适用 其中有 import <em>utils</em> 导入失败 显示错误为:  <em>No</em> <em>module</em> name <em>utils</em> 经过大多时间纠结之后,终于发现他是paimei中的一部份代码,网址:https://github.com/OpenRCE/paimei 可以在这里下载 把需要的<em>utils</em>放到Lib
caffe用python时可能需要的模块安装
1.ImportError: <em>No</em> <em>module</em> <em>named</em> Cython.Dist<em>utils</em> 2.ImportError: <em>No</em> <em>module</em> <em>named</em> easydict 3.ubuntu python安装 sklearn.<em>utils</em> 4.ubuntu python安装 pandas.io.parsers 5.ImportError: <em>No</em> <em>module</em> <em>named</em> cv2 6.ImportError: <em>No</em> <em>module</em> <em>named</em> yaml
Mask R-CNN tensorflow CPU版本配置 问题& 解决方案
问题1:python-dev无法安装 用aptitude 工具可以两步搞定, sudo apt-get install aptitude sudo aptitude install python-dev 问题2:缺少Cython.build模块 使用pip install Cython即可 问题3:在shell, /libs/datasets/pycocotools目录中 输入make指令出现字符...
Cython基础--Cython入门
Cython入门 1 Cython是什么? 对你没有看错,是Cython,不是Python当初也我也对这个名字感到很奇怪,但是了解之后,再才知这是我一直想要的工具,比起swig,这个工具要好上很多它是一个用来快速生成Python扩展模块(extention<em>module</em>)的工具它的语法是python语言语法和c语言语法的混血他比swig更容易编写python的扩展模块也许你会说swig可以直接通过c
《MySQL 性能优化》之理解 MySQL 体系结构
本文介绍 MySQL 的体系结构,包括物理结构、逻辑结构以及插件式存储引擎。
《自动控制原理》综合复习资料下载
《自动控制原理》综合复习资料,系中国石油大学远程教育学院编制,最最基础的东西,含知识点讲解,典型例题等 相关下载链接:[url=//download.csdn.net/download/ji402392707/2008000?utm_source=bbsseo]//download.csdn.net/download/ji402392707/2008000?utm_source=bbsseo[/url]
唐人笔TP216驱动不支持WIN7下载
唐人笔TP216驱动不支持WIN7 相关下载链接:[url=//download.csdn.net/download/qq_27350059/8587459?utm_source=bbsseo]//download.csdn.net/download/qq_27350059/8587459?utm_source=bbsseo[/url]
html语言教程一键学习下载
全方位讲解html语言知识,新增页面,字体,文字布局,表格,多窗口页面等相关知识 相关下载链接:[url=//download.csdn.net/download/weixin_43172270/10656864?utm_source=bbsseo]//download.csdn.net/download/weixin_43172270/10656864?utm_source=bbsseo[/url]
我们是很有底线的