Execution failed for task ':app:transformDexArchiveWithExternalLibsDexMergerForD [问题点数:50分,结帖人parryhotter]

Bbs1
本版专家分:0
结帖率 50%
Bbs7
本版专家分:24273
Blank
GitHub 绑定GitHub第三方账户获取
Blank
红花 2018年12月 移动开发大版内专家分月排行榜第一
2018年11月 移动开发大版内专家分月排行榜第一
2018年10月 移动开发大版内专家分月排行榜第一
2018年3月 移动开发大版内专家分月排行榜第一
2018年1月 移动开发大版内专家分月排行榜第一
2017年12月 移动开发大版内专家分月排行榜第一
2017年11月 移动开发大版内专家分月排行榜第一
2017年10月 移动开发大版内专家分月排行榜第一
2017年9月 移动开发大版内专家分月排行榜第一
2015年11月 移动开发大版内专家分月排行榜第一
2015年10月 移动开发大版内专家分月排行榜第一
Blank
黄花 2019年7月 移动开发大版内专家分月排行榜第二
2018年4月 移动开发大版内专家分月排行榜第二
2016年4月 移动开发大版内专家分月排行榜第二
Blank
蓝花 2017年8月 移动开发大版内专家分月排行榜第三
2016年7月 移动开发大版内专家分月排行榜第三
2015年12月 移动开发大版内专家分月排行榜第三
Error:Execution failed for task ':app:transformDexArchiveWithExternalLibsDexMergerForDebug'. > java.
Error:Execution <em>failed</em> for <em>task</em> ':<em>app</em>:transformDexArchiveWithExternalLibsDexMergerForDebug'. &gt; java.lang.RuntimeException: com.android.builder.dexing.DexArchiveMergerException: Unable to merge d...
包重复Execution failed for task ':app:transformDexArchiveWithExternalLibsDexMergerForDebug'.
一. gradle中jar冲突问题,从这里是看不出任何原因  二.打开 gradle consonle, 找到如下圈圈所示位置(Run with –stacktrace),然后双击  三.这里可以看到gradle失败的具体原因,Multiple dex files…. 显然是由于同一个文件在多个jar中出现,典型的jar冲突问题,  那该类具体是在哪几个jar中被引用了呢?  四. 在...
Error:Execution failed for task ':app:transformDexArchiveWithExternalLibsDexMergerForDebug'.
Error:FAILURE: Build <em>failed</em> with an exception. * What went wrong: Execution <em>failed</em> for <em>task</em> ':<em>app</em>:transformDexArchiveWithExternalLibsDexMergerForDebug'. &amp;gt; java.lang.RuntimeException: com.android.b...
Execution failed for task ':app:transformClassesWithInstantRunForDebug'.
Execution <em>failed</em> for <em>task</em> ':<em>app</em>:transformClassesWithInstantRunForDebug'. &amp;gt; com.android.build.api.transform.TransformException: java.lang.RuntimeException: java.lang.RuntimeException: java.io.IOExce...
Error:Execution failed for task ':app:preDebugAndroidTestBuild'. > Conflict with dependency 'com.and
出现错误详细信息: Error:Execution <em>failed</em> for <em>task</em> ‘:<em>app</em>:preDebugAndroidTestBuild’. Conflict with dependency ‘com.android.support:support-annotations’ in project ‘:<em>app</em>’. Resolved versions for <em>app</em> (27.1.0)...
66.android 导入项目报错Error:Execution failed for task ':app:validateDebugSigning'. > Keystore file F:\myA
   //第一种方式: 导入下载的工程出现这个错误,追究其原因是是下载的工程中有指定使用的Keystore文件的路径, 所以我们可以通过Android studio File-》ProjectStructure-》选择<em>app</em> ,再选择signing 把Store File里指定的Keystore文件的路径删除,或者填写自己的Keystore文件的路径 然后点击ok,再clean下...
Execution failed for task ':app:transformClassesAndResourcesWithProguardForRelease'
在混淆文件proguard-rules.pro中加入 -ignorewarnings  屏蔽警告
transformDexArchiveWithExternalLibsDexMergerForDebug 问题的完美定位
程序出现问题,自然而然想到的看log,然后定位问题在哪里。gradle作为一门脚本语言,也可以说是一门编程语言, 通过gradle 构建程序如果失败,最好的解决方式当然也是看log,然后找出问题所在,具体的方式如下几个步骤: 一. gradle中jar冲突问题,从这里是看不出任何原因 二.打开 gradle consonle, 找到如下圈圈所示位置(Run with –stacktrac...
Android 导入开发库transformDexArchiveWithExternalLibsDexMergerForDebug问题分析和解决
问题描述 最近在集成一个第三方的视频监控模块的时候遇到了一个很神奇的问题,如题,项目构建没问题,但是应用安装的时候一直出这个问题。一看就是开发库重复的问题。 解决思路 初级思路,这种问题我见过,把所有项目的gradle找一遍删除掉重用的开发库,compile尽量改成implementation,这样可以让模块的引用在打包的时候不打包到apk中 对了一遍该改的改 ,该删的删问题还...
Execution failed for task ':app:transformDexArchiveWithExternalLibsDexMergerForDebug'.
外部导入的AS项目往往会报这个错误,解决方案: 如果上述两种都没有解决问题,可以使用这种方法, 在build.gradle文件中导入这个依赖: ? 1 compile 'com.android.support:multidex:1.0.1' 然后在 build.gradle 文件中的 defaultConfig 配置中添加配置: ? ...
Android Studio 3.0 app:transformDexArchiveWithExternalLibsDexMergerForBaiduDebu
Android Studio 升级3.0之后,现有的代码报错,Error:Execution <em>failed</em> for <em>task</em> ':<em>app</em>:transformDexArchiveWithExternal
android stuido 使用中遇到的问题
-
Execution failed for task ':app:transformResourcesWithMergeJavaResForDebug'
transformResourcesWithMergeJavaResForDebug  编译的时候出现以下问题: 百度多次找到了解决办法:在build.gradle中添加一些配置就行了 packagingOptions { exclude 'META-INF/NOTICE' exclude 'META-INF/LICENSE'
Minos Hypervisor v0.2.1正式支持树莓派3/3b+/3A+
Minos - Type 1 Hypervisor for ARMv8-A Minos is a lightweight open source Type 1 Hypervisor for mobile and embedded systems that runs directly in bare metal environments. Minos implements a complete vi...
Bug 日志之Failed to resolve: com.android.support:appcompat-v7:27.+
一、问题描述 使用Android Studio(版本2.3.3)新建了一个测试项目,随后编译无法通过,直接报错 二、错误分析 通过日志信息,我们很容易就能定位到问题代码 compile 'com.android.support:<em>app</em>compat-v7:27.+' 这是一种很正常的写法,当我们需要一个library时,我们就能通过compile方式在Maven仓库服务器上去下载...
3A+ISP之AWB篇
PS:吐槽知乎的导入功能,为何公式导入之后全部GG。。。 ...
编译异常:Execution failed for task ':app:transformClassesWithMultidexlistForDebug'.
Execution <em>failed</em> for <em>task</em> ‘:<em>app</em>:transformClassesWithMultidexlistForDebug’. com.android.build.api.transform.TransformException: Error while generating the main dex list 这个问题多半是依赖重复导致的 在android studio...
Execution failed for task ':app:transformDexArchiveWithExternalLibsDexMergerForDebug'
  正题       前几天在做项目的时候由于功能需要,也是为了方便引入了一个三方的库,在运行的时候就各种报错,报错的截图如下: 如果不了解这个的好多同学都是懵逼的状态,就是去百度谷歌也是一大堆相似的,但是很少能真正的解决这个错误,这个错误的真正原因是因为jar的冲突,可是有些人会问我怎么知道哪个jar冲突了,导入的时候也没有相同的jar呀!这是因为在你引入的依赖中它也用和你项目中重复的j...
Execution failed for task ':app:transformDexArchiveWithExternalLibsDexMergerForDebug'整合不同工程出错解决方法...
Error:Execution <em>failed</em> for <em>task</em> ‘:<em>app</em>:transformDexArchiveWithExternalLibsDexMergerForDebug’. 我整合了两个工程,然后由于依赖版本不同产生了上面的问题,不能整合 google了一下,stackoverflow上有类似的问题:https://stackoverf...
react-native 新建项目运行报错Execution failed for task ':app:transformDexArchiveWithExternalLibsDexMerg
react-native run-android报错Execution <em>failed</em> for <em>task</em> ‘:<em>app</em>:transformDexArchiveWithExternalLibsDexMergerForDebug’. react-native新建项目运行报错 如果你运行项目的结果和下图一样,那么我这个方法应该可以给你解决 我这里当初是刚学react-native 搭建完环境之后新建项目然后...
Android Studio依赖库重复问题
-
Execution failed for task ':app:transformDexArchiveWithExternalLibsDexMergerForBaiduDebug'
我在做第三方登录时,开始使用的是腾讯的SDK,后来改成了友盟的,在运行时,报了Execution <em>failed</em> for <em>task</em> ':<em>app</em>:transformDexArchiveWithExternalLibsDexMergerForBaiduDebug'这个错。顿时,有点懵,什么鬼。。。遇到问题,首先要冷静,唱一首凉凉。喝一杯凉茶。。当然解决不了问题,不过,心态最重要嘛!嘿嘿。把这个问题在某网...
DexArchiveMergerException:Unable to merge dex 异常解决办法
异常为(详细异常信息见文章结尾):Execution <em>failed</em> for <em>task</em> ':<em>app</em>:transformDexArchiveWithExternalLibsDexMergerForDebug'.&amp;gt; java.lang.RuntimeException: java.lang.RuntimeException: com.android.builder.dexing.DexArchiv...
我的Android进阶之旅------>解决:Execution failed for task ':app:transformResourcesWithMergeJavaResForD...
错误描述 今天在Android Studio项目中加入了jackson的开发包,编译运行时候,引发了如下的错误: Error:Execution <em>failed</em> for <em>task</em> ':<em>app</em>:transformResourcesWithMergeJavaResForDebug'. &gt; com.android.buil...
Error:Execution failed for task ':app:transformDexArchiveWithExternalLibsDexMergerForDebug'. > com.a
Error:Execution <em>failed</em> for <em>task</em> ':<em>app</em>:transformDexArchiveWithExternalLibsDexMergerForDebug'. &amp;gt; com.android.builder.dexing.DexArchiveMergerException: Unable to merge dex 相信大家在Android studio开发中,都遇到过...
解决:Error:Execution failed for task ':app:transformDexArchiveWithExternalLibsDexMergerForDebug'.
hvh
app:javaPreCompileDebug和transformDexArchiveWithExternalLibsDexMergerForDebug
出现这个错误之后在App的build.gradle(Module:<em>app</em>) Error:Execution <em>failed</em> for <em>task</em> ':<em>app</em>:javaPreCompileDebug'. > Annotation processors must be explicitly declared now.  The following dependencies on the compile
':app:transformDexArchiveWithExternalLibsDexMergerForDebug' — Unable to merge dex
第三方依赖  最近遇到的问题   问题解决方案   如下:找到你的工程里添加依赖的  build.gradle   文件   将下图中的  字段  进行替换替换为  如下图的  方式  同时  在   defaultConfig  中  添加  下图中的  文字      最后   clean Project      Rebuild Project...
:app:transformDexArchiveWithExternalLibsDexMergerForDebug'. 问题记载
Error:Execution <em>failed</em> for <em>task</em> ':<em>app</em>:transformDexArchiveWithExternalLibsDexMergerForDebug'. &amp;gt; java.lang.RuntimeException: com.android.builder.dexing.DexArchiveMergerException: Unable to merge dex...
transformDexArchiveWithExternalLibsDexMergerForDebug unable to merge dex 问题
Android studio 从2.3.3升级到3.0,然后gradle也升级了,导致了如下错误: Error:Execution <em>failed</em> for <em>task</em> ':<em>app</em>:transformDexArchiveWithExternalLibsDexMergerForDebug'. > com.android.builder.dexing.DexArchiveMergerException:
完美解决Error:Execution failed for task ':APP:transformClassesWithDexForDebug'...问题
相信大伙在Android开发过程中都避免不了要集成第三方的项目、集成完之后有时就会碰到这个令人灰常厌恶的transformClassesWithDexForDebug、详细的Log如下: Error:Execution <em>failed</em> for <em>task</em> ':APP:transformClassesWithDexForDebug'. > com.android.build.api.trans
Error:Execution failed for task ':app2:transformDexArchiveWithExternalLibsDexMergerForDebug
最近在集成mopub新的SDK,集成过程中,一直出现: Error:Execution <em>failed</em> for <em>task</em> ':<em>app</em>2:transformDexArchiveWithExternalLibsDexMergerForDebug 这个问题,查询之后,网上主要说的解决办法是: gradlew clean gradlew build 相关链接: https://stac
安卓中运行报错Error:Execution failed for task ':app:transformClassesWithDexForDebug'解决
错误如下:Error:Execution <em>failed</em> for <em>task</em> ':<em>app</em>:transformDexArchiveWithExternalLibsDexMergerForDebug'. > java.lang.RuntimeException: java.lang.RuntimeException: com.android.builder.dexing.DexArchiveMerger
Android 解决jar包、依赖冲突问题
在工作过程中我们经常会遇到项目中jar包或者依赖重复而导致的错误信息,这个时候虽然我们知道原因是因为jar包或者依赖重复而导致,但是并不知道具体是哪一个重复了,这个时候我们就需要快速定位重复的jar包或者依赖。这里我们可以使用Android Studio的Terminal命令快速去定位相关问题: gradlew assembleDebug --stacktrace命令,编译过程中会提示相关错误信...
Execution failed for task ':app:preDebugAndroidTestBuild' ....dependency-conflicts.html for details.
遇到的错误1: Error:FAILURE: Build <em>failed</em> with an exception. * What went wrong: Execution <em>failed</em> for <em>task</em> ':<em>app</em>:preDebugAndroidTestBuild'. &amp;gt; Conflict with dependency 'com.android.support:support-annota...
Error:Execution failed for task ':app:transformDexArchiveWithExternalLibsDexMergerForDebug'
第一次写博客,就当做个笔记,这个报错,大多数情况下是在添加在lib中的包重复,两种情况:一种是与已添加的包重复,一种是添加的包中自己重复,我的解决办法是找到相同的包,然后移除掉,我找个网上那些办法:“添加依赖compile com.android.support:multidex:1.0.1,让<em>app</em>lication继承MultiDexApplication”,这些办法我都试了,都没能解决!当然每...
Error:Execution failed for task ':app:transformDexArchiveWithExternalLibsDexMergerForBaiduDebug'.
Error:Execution <em>failed</em> for <em>task</em> ':<em>app</em>:transformDexArchiveWithExternalLibsDexMergerForBaiduDebug'.&amp;gt; java.lang.RuntimeException: com.android.builder.dexing.DexArchiveMergerException: Unable to merge ...
AndroidStudio Error:Execution failed for task ':app:transformClassesWithDexForDebug'. 錯誤解決方法
使用AndroidStudio遇到Error:Execution <em>failed</em> for <em>task</em> ‘:<em>app</em>:transformClassesWithDexForDebug’.,解决方法是把第三方jar放到libs目录下,研究了好长时间!
Error:Execution failed for task ':app:transformClassesWithDexForDebug'.解决方法
添加multiDexEnabled true 给应用程序的build.gradle文件。 defaultConfig { multiDexEnabled true }
Android Error:Execution failed for task ':app:transformClassesWithDexForRelease'错误小记
今天在调试的时候,遇到一个奇葩问题,在一台魅族手机上可以正常编译运行,但是在HTC手机上却始终无法编译成功,错误如下 一个dex文件超过64k错误,一个Error:Execution <em>failed</em> for <em>task</em> ':<em>app</em>:transformClassesWithDexForRelease'错误,也是够蛋疼的。查阅发现这个错误是由于包重复导致的,果不其然,我在lib文件夹下导入了or
Error:Execution failed for task ':app:transformDexArchiveWithExternalLibsDex
只需要添加这句话就可以解决该问题。。。
Error:Execution failed for task ':app:transformClassesWithDexForDebug&#
Error:Execution <em>failed</em> for <em>task</em> ':<em>app</em>:transformClassesWithDexForDebug&#     3个错误non-zero exit value 1; non-zero exit value 2; non-zero exit value 3 Error:Exec
Error:Execution failed for task ':app:transformDexArchiveWithExternalLibsDex报错
原来的项目可以正常运行的,但升级到AndroidStudio 3.0后就有问题了。APP在Clear时没有报错,但一安装到手机上就报错了。 Error:Execution <em>failed</em> for <em>task</em> ':<em>app</em>:transformDexArchiveWithExternalLibsDexMergerForDebug'. > com.android.builder.dexing.DexArc
AndroidStudio:Execution failed for task ':app:transformDexArchiveWithExternalLibsDexMergerForDebug'.
出现Execution <em>failed</em> for <em>task</em> ‘:<em>app</em>:transformDexArchiveWithExternalLibsDexMergerForDebug’.的情况通常是V4或者V7包的重复。此时需要仔细查看依赖的Jar包是否重复添加。
解决Error:Execution failed for task ':app:transformClassesWithJarMergingForDebug'问题
在开发的时候,经常遇到 Error:Execution <em>failed</em> for <em>task</em> ':<em>app</em>:transformClassesWithJarMergingForDebug'. > com.android.build.api.transform.TransformException: java.util.zip.ZipException: duplicate entry: andr
Execution failed for task':app:processDebugResources'错误的一般解决方案
AndroidStudio中运行项目的时候出现Execution <em>failed</em> for <em>task</em>':<em>app</em>:processDebugResources' &amp;gt;java.io.IOException:Could not delete path:'C:\Users\acer.......的错误如下截图: 分析了一下原因是因为之前在lib下引入一个包,由于不需要给删掉了,结果就是原来打的de...
BUG解决思路-AndroidStudio-transformDexArchiveWithExternalLibsDexMergerForDebug 问题的完美定位(依赖包重复)
程序出现问题,自然而然想到的看log,然后定位问题在哪里。gradle作为一门脚本语言,也可以说是一门编程语言,  通过gradle 构建程序如果失败,最好的解决方式当然也是看log,然后找出问题所在,具体的方式如下几个步骤: gradle中jar冲突问题,从这里是看不出任何原因  打开 gradle consonle, 找到如下圈圈所示位置(Run with –stacktrace),然后...
jar冲突 - app:transformDexArchiveWithExternalLibsDexMergerForDebug
再引入多种第三方框架时候。很容易报这个异常:<em>app</em>:transformDexArchiveWithExternalLibsDexMergerForDebug 如下图: 归结原因就是 重复的jar包或者资源导致的。 下面说一下解决办法。 方法一:如果知道是哪个jar ,直接删除 方法二:在<em>app</em>的build.gradle文件中的 defaultConfig添加: defaultConfi...
transformDexArchiveWithExternalLibsDexMergerForDebug 问题的完美定位[转载]
地址:transformDexArchiveWithExternalLibsDexMergerForDebug – double Shift:全局查找,这个查看和Alt+H稍稍有些不同,这个是全局文件查找,到文件名称层面。 exclude 剔除掉多余的包 场景一 要移除的jar包不在aar包中的classes.jar中 直接把aar包里的Jar打包的时候给去掉,就像下面这这样。...
解决 运行报错 Error:Execution failed for task ':app:transformDexArchiveWithDexMergerForDebug'.
AS 3.0.1 工程依赖module时运行报错 : Error:Execution <em>failed</em> for <em>task</em> ':oneCam:preDebugAndroidTestBuild'. &gt; Conflict with dependency 'com.android.support:support-annotations' in project ':oneCamera'. Resolved...
app:transformDexArchiveWithExternalLibsDexMergerForDebug错误
1、在使用别人写好的jar包时,经常会出现这个错误,错误原因是你引用的j程序的包和你本身程序的包引入相同的jar包了2、将自己的包删除后重新编译即可...
Execution failed for task ':app:transform Dex Archive With ExternalLibs Dex MergerFor Debug'.
我在接入阿里云的hotfix热修复时运行项目出现了: Error:FAILURE: Build <em>failed</em> with an exception. * What went wrong: Execution <em>failed</em> for <em>task</em> ':<em>app</em>:transformDexArchiveWithExternalLibsDexMergerForDebug'. &amp;gt; java.lang.Runt...
打包时报:app:transformDexWithDexForRelease
原因:最新的ADT和SDK Tool在将jar转化成dex的时候,可能会合并类的代码,这将导致巨大的类;类中的每一个方法都分配有一个id,字节码中以id标识和调用方法;早期的Dalvik VM内部使用short类型变量来标识方法的id,最大值限制在65535。当方法数超过65535,则会报该错误。解决方法:在build.gradle中dexOptions增加jumboMode trueandroi...
【已解决】app:transformDexArchiveWithDexMergerForDebug
defaultConfig { multiDexEnabled true }  
ionic打包出现 What went wrong: A problem occurred configuring root project 'android'
打包ionic项目的时候,出现上面错误,谁遇到过帮一下忙,谢谢!
Multiple dex files define Lrx/android/plugins/RxAndroidPlugins;
Error:Execution <em>failed</em> for <em>task</em> ':<em>app</em>:transformDexArchiveWithDexMergerForDebug'. &amp;gt; com.android.build.api.transform.TransformException: com.android.dex.DexException: Multiple dex files define Lrx/an...
错误记录:Error while merging dex archives(Program type already present )
引入了新的jar包和代码,再build时就报出了这个错误,查了一些资料解决了问题。这个是stackoverflow上关于这个问题的讨论,也许会有参考效果:https://stackoverflow.com/questions/46267621/unable-to-merge-dex-----------------------------------------------------------...
求助各位大神,导入别人的项目报DexArchiveMergerException错误和(图)
-
报错:NoSuchMethodError: No virtual method load;Error while merging dex archives;Unable to merge dex等
问题起因:项目添加glide-transformations开源框架依赖后导致莫名的报错:NoSuchMethodError: No virtual method load;Error while merging dex archives;Unable to merge dex等,报错信息的不够精确和诡异性导致我放弃通过阅读log来找问题,于是就有了下面的艰辛历程 添加的依赖:implement...
com.android.builder.dexing.DexArchiveMergerException: Error while merging dex archives:
构建项目时报错:  导致错误的根源:   解决方法:参考我的一篇博文https://blog.csdn.net/qq_41940550/article/details/82254700  报错信息如下: org.gradle.api.<em>task</em>s.TaskExecutionException: Execution <em>failed</em> for <em>task</em> ':<em>app</em>:transformDe...
AndroidStudio运行报DexArchiveMergerException
最近接手一个维护项目,集成UMeng的统计功能,集成顺利,但在运行的时候,报如下异常: org.gradle.api.<em>task</em>s.TaskExecutionException: Execution <em>failed</em> for <em>task</em> ':<em>app</em>:transformDexArchiveWithExternalLibsDexMergerForDebug'. at org.gradle.api.inte...
问题:com.android.builder.dexing.DexArchiveMergerException: Unable to merge dex
记一个让我头疼了一天的问题,网上搜了搜,解决方案一大堆,但是好像并不适用。下面贴一下错误的log: 我使用的gradle tools版本是3.0.1 * What went wrong: Execution <em>failed</em> for <em>task</em> ':example:transformDexArchiveWithExternalLibsDexMergerForDebug'. &amp;amp;gt; java.lan...
Android studio 3.0 com.android.builder.dexing.DexArchiveMergerException: Error while merging dex ar
Android报错集锦之二:Android studio 3.0 com.android.builder.dexing.DexArchiveMergerException: Unable to mer &amp;amp;amp;amp;lt;div class=&amp;amp;amp;quot;article-info-box&amp;amp;amp;quot;&amp;amp;amp;amp;gt; &amp;amp;amp;amp
com.android.builder.dexing.DexArchiveMergerException: Unable to merge dex
错误提示: Error:Execution <em>failed</em> for <em>task</em> ':<em>app</em>:transformDexArchiveWithExternalLibsDexMergerForDebug'.> java.lang.RuntimeException: com.android.builder.dexing.DexArchiveMergerException: Unable to merge
如何解决升级到android studio 3.0后编译报错.dexing.DexArchiveMergerException: Unable to merge
android studio 升级到3.0.1后,以前编译成功的工程,编译报错。网上各种攻略都尝试了,仍然不能解决问题,求高手支招。 Error:Execution <em>failed</em> for <em>task</em> '
无法正常编译错误Compilation failed to complete
发现了一个不错的库可以实时查看和修改布局。uetool 于是就加入到了依赖,谁想编译时却出现了错误。 以下是部分错误片段 org.gradle.api.<em>task</em>s.TaskExecutionException: Execution <em>failed</em> for <em>task</em> ':<em>app</em>:transformDexArchiveWithExternalLibsDexMergerForDebug'. ...
AS报错Unable to merge dex
错误信息:Error:Execution <em>failed</em> for <em>task</em> ':<em>app</em>:transformDexArchiveWithExternalLibsDexMergerForDebug'. > java.lang.RuntimeException: com.android.builder.dexing.DexArchiveMergerException: Unable to merge dex
Android Studio 编译常见问题解决办法
1.dexDebug ExecException finished with non-zero exit value 2 需要在gradle中配置下面的代码,原因是引用了多个libraries文件 defaultConfig { multiDexEnabled true } 2.Exe
错误:com.android.builder.dexing.DexArchiveMergerException: Unable to merge dex
解决办法:我依赖的包的版本是26.0.0-alpha1,那么无论是<em>app</em>还是引入的module都统一使用26.0.0-alpha1;在<em>app</em>的build.gradle加上一段代码即可:configurations.all { resolutionStrategy.eachDependency { DependencyResolveDetails details -&amp;gt; ...
org.apache.http.legacy.jar与一些第三方冲突问题 Execution failed for task ':app:transformDexArchiveWithExternal
先上错误目录吧 * What went wrong: Execution <em>failed</em> for <em>task</em> ':<em>app</em>:transformDexArchiveWithExternalLibsDexMergerForDebug'. &amp;gt; com.android.builder.dexing.DexArchiveMergerException: Error while merging dex ar...
导入同样的依赖导致一系列的出错:错误1:Program type already present: android.support.v4.view.ViewPager$SavedState$1;
导入同样的依赖导致一系列的出错:错误1:Program type already present: android.support.v4.view.ViewPager$SavedState$1;错误2:Execution <em>failed</em> for <em>task</em> ':<em>app</em>:transformDexArchiveWithExternalLibsDexMergerForDebug'.;DexArchiveMe...
com.android.builder.dexing.DexArchiveMergerException: Unable to merge dex 异常处理
我们在开发过程中避免不了会引入第三方或我们自己生成的jar包或库,本文就讲述一下,引入的一个异常处理。异常:Error:Execution <em>failed</em> for <em>task</em> ':<em>app</em>:transformDexArchiveWithExternalLibsDexMergerForDebug'.&amp;gt; java.lang.RuntimeException: java.lang.RuntimeExce...
RuntimeException: com.android.builder.dexing.DexArchiveMergerException: Unable to merge dex解决方法
在Android开发过程中都避免不了要集成第三方的项目、集成完之后今天碰到这个令人我非常不开心的transformClassesWithDexForDebug Exception、详细的Log如下: Error:java.lang.RuntimeException: java.lang.RuntimeException: java.lang.RuntimeException: com.andr...
java.lang.RuntimeException: com.android.builder.dexing.DexArchiveMergerExcep 错误
你好! 我在使用github上的一个开源项目, Android-Debug-Database的时候build报错 : Error:Execution <em>failed</em> for <em>task</em> ':<em>app</em>:tra
Android studio报错:transformDexArchiveWithExternalLibsDexMergerForDebug
在依赖项目module时,出现如下报错: org.gradle.api.<em>task</em>s.TaskExecutionException: Execution <em>failed</em> for <em>task</em> ':<em>app</em>:transformDexArchiveWithExternalLibsDexMergerForDebug'. at org.gradle.api.internal.<em>task</em>s.<em>execution</em>....
Error:app:transformDexArchiveWithExternalLibsDexMergerForDebug'.
com.android.builder.dexing.DexArchiveMergerException: Unable to merge dex Android开发过程中,运行项目出现这个错误时,说明你重复引用了依赖库。这个时候你就要检查下lib下和build.gradle下是否引用了相同的库了。 一般造成这种异常的情况包括: 1.以lib形式引入了相同的jar 2.以lib形式、mav...
Execution failed for task ':app:transformDexArchiveWithExternalLibsDexMergerForDebug' 错误
有重复包 File–&amp;gt;Project Structure—&amp;gt;<em>app</em>----&amp;gt;Dependencies中删除下面这个包,再次运行就好了
github项目导入Android studio 出现的问题及解决
前言 刚用AS的时候,真心觉得坑不要太多,尤其是导入项目的时候,所以特此整理一些错误信息,方便以后查询和修改 ps:很多错误,如果重新在AS里创建一个project,自己看着对应修改基本上就能解决问题,大多问题是新旧版本不一致或者jar包冲突导致,多google搜索,一般都是可以解决的. 错误一 Error:(19, 0) Gradle DSL method not found...
Error:Execution failed for task ':app:transformResourcesWithMergeJavaResForDebug'. > com.android.bui
在进行android json解析时出现以下错误: Error:Execution <em>failed</em> for <em>task</em> ':<em>app</em>:transformResourcesWithMergeJavaResForDebug'. > com.android.build.api.transform.TransformException: com.android.builder.packaging.Dupli
AS中运行项目时出现Error:Execution failed for task ':app:transformClassesWithDexForDebug'...问题解决
今天被一个问题搞破了头。 在AS中运行项目是出现如下错误:          Error:Execution <em>failed</em> for <em>task</em> ':<em>app</em>:transformClassesWithDexForDebug'. > com.android.build.api.transform.TransformException:
关于“Unable to execute dex: Cannot merge new index 65576 into a non-jumbo instruction!”
在编辑运行比较大的项目时可能会出现该问题,控制台会打印: Unable to execute dex: Cannot merge new index 65576 into a non-jumbo instruction! Conversion to Dalvik format <em>failed</em>: Unable to execute dex: Cannot merge new index 65576
Android 打包 Execution failed for task ':app:transformClassesWithDexForRelease' 解决
今天打包出现了Execution <em>failed</em> for <em>task</em> ':<em>app</em>:transformClassesWithDexForRelease' 的问题导致打包失败,上网查了一下说是包冲突导致的,那就好办了,直接如下图搞搞就OK了。
抽奖程序源码下载
抽奖程序,可支持多组号码抽奖,抽奖完毕自动保存抽奖结果。此程序可用于春节年会抽奖。。。 全部源码分享,希望对菜鸟们有帮助。 相关下载链接:[url=//download.csdn.net/download/jiudian66/4828298?utm_source=bbsseo]//download.csdn.net/download/jiudian66/4828298?utm_source=bbsseo[/url]
XmlBeans学习下载
xmlbeans是目前最好的读写xml文件的工具,快速准确,并可以对xml文档的结构进行验证。 相关下载链接:[url=//download.csdn.net/download/hg_z2010/3771345?utm_source=bbsseo]//download.csdn.net/download/hg_z2010/3771345?utm_source=bbsseo[/url]
Oracle分页存储过程下载
Oracle分页存储过程,里面包含C#调用代码实例; 相关下载链接:[url=//download.csdn.net/download/junfeng120125/4048720?utm_source=bbsseo]//download.csdn.net/download/junfeng120125/4048720?utm_source=bbsseo[/url]
相关热词 c# stream 复制 android c# c#监测窗口句柄 c# md5 引用 c# 判断tabtip 自己写个浏览器程序c# c# 字符串变成整数数组 c#语言编程写出一个方法 c# 转盘抽奖 c#选中treeview
我们是很有底线的