ld: symbol(s) not found for architecture armv7 [问题点数:100分]

Bbs1
本版专家分:0
结帖率 0%
其他相关推荐
iOS :undefined symbols for architecture x86_64错误解决方案
先让大家看一下,我报错的截图 我在网上查了一下,这个错误还是比较常见,原因就是少框架,少静态库了. 所以解决方案就是
翻譯:Xcode的建置設定Build Active Architecture Only(Xcode Build Active Architecture Only
Xcode的建置設定Build Active Architecture Only今天在Stackoverflow上看到某個問題,讓我想起在Xcode 3.2.2裡,有些新加入的建置設定,值得在這裡說明一下。隨著iPhone/iPod Touch新型機種推出,以及iPad的加入,你可以決定要將軟體編譯成哪一種處理器架構的格式,下面的設定,都放在target info的標籤Build之下(在targe...
ios 真机调试遇到的错误: ld: symbol(s) not found for architecture arm64的解决办法
错误信息如下: Undefined symbols for architecture armv7s:   "_OBJC_CLASS_$_BaiduMobStat", referenced from:       objc-class-ref in BaiduMobStatAppDelegate.o       objc-class-ref in MyPageLogViewC
ld: symbol(s) not found for architecture armv7s
XCODE4升级到XCODE5编译就不通过了错误如下: ld: warning: directory not found for option '-L/Users/paul/Android/baidu_tongji_source/ios-sdk/BaiduMobStatSample/../BaiduMobStat/DerivedData/BaiduMobStat/Build/Products/D
symbol(s) not found for architecture arm64解决办法
symbol(s) not found for architecture arm64 解决办法
iOS symbol(s) not found for architecture armv7
symbol(s) not found for architecture armv7 不同指令集armv6、armv7armv7s、arm64对应不同型号的iOS设备: armv6 iPhone、iPhone 3G iPod 1G、iPod 2G armv7 iPhone 3GS、iPhone 4 iPod 3G、iPod 4G、iPod 5G iPad、iPad 2、iPad 3、iPa...
qt调用xcode写的库出错symbol(s) not found for architecture armv7
我有一个程序。是人家给的。xcode写的库,xcode的示例。运行正常。我自己有个程序用qt写的,写了很久了。现在想把这部分程序加到我的程序里。我用qt调用库出现这样的总是: :-1: error:
[绍棠] SYMBOL(S) NOT FOUND FOR ARCHITECTURE ARMV7
如果真机调试就是 undefined symbols for architecture armv7错误! 发生这种错误通常是project.pbxproj这个文件引起的,尤其在多人合作开发的时候,svn提交不规范可能导致project.pbxproj发生错误,导致文件的引用不在project.pbxproj文件中。 xcode项目import文件会根据project.pbxproj来查
symbol(s) not found for architecture arm64
更新的收遇到了: symbol(s) not found for architecture arm64 解决办法: 将 Build Active Architecture Only 设置成 No
ios Symbol(s) not found for architecture arm64总结 含隐藏错误cocoapods
ios Symbol(s) not found for architecture arm64总结 含隐藏错误cocoapods
iOS之Undefined symbols for architecture armv7问题解决方法
我们在编译代码时,常常出来下面这样的错误
not found FileProvider for architecture armv7
我这是接第三方SDK的时候出现的问题 第三方xcode使用的是9.0版本以上   本地版本是8.0 我这边的解决办法是9.0的FileProvider.framework,FileProviderUI.framework,IOSurface.framework三个库文件拷贝到本地下  /Applications/Xcode.app/Contents/Developer/Platforms
framework not found Metal for architecture armv7/armv7s #66
framework not found Metal for architecture armv7/armv7s#66
Undefined symbols for architecture armv7解决方案
http://stackoverflow.com/questions/6429494/undefined-symbols-for-architecture-armv7 点击打开链接 Undefined symbols for architecture armv7: "_deflateEnd", referenced from: -[ASIDataCompressor
cocoa pods ld: symbol(s) not found for architecture i386
原文链接:http://stackoverflow.com/questions/27286226/undefined-symbols-for-architecture-armv7-for-cocoapods-libraries 使用cocoa pods管理第三方库的时候编译错误,ld: symbol(s) not found for architecture i386,解决办法:target->
IOS开发之添加第三方lib或从其他工程引入lib时的链接错误:ld: symbol(s) not found for architecture i386
首先要确保正确的添加步骤 1)拷贝到新project目录下 2)添加到工程里 3)在新工程的targets->Build Phases->target dependencies 点击+ 添加lib 3) 在新工程的targets->Summary->Linked Frameworks and Libraries 点击+ 添加lib
iOS解决两个静态库的冲突 duplicate symbol
build setting->other linker flag 把 -all_load换成-ObjC =============== 参考 http://blog.csdn.net/slowfei/article/details/9137811
Xcode技巧:项目导入外部文件后编译运行出现Undefined symbols for architecture x86_64错误
原文链接地址:http://www.xcoder.cn/?p=272 当我们在一个项目中想使用外部其他项目的一个类时,可以在项目中直接添加类文件到项目中。但是,在编译的时候出现了这样的错误: Undefined symbols for architecture x86_64:   "_OBJC_CLASS_$_Per
使用高德定位的SDK后集成编译报错
导入高德定位SDK编译报错,系统库也导入了,可是就是编译不通过一直报如下错误: Undefined symbols for architecture arm64:   "_OBJC_CLASS_$_CTTelephonyNetworkInfo", referenced from:       objc-class-ref in AMapFoundationKit(AMapFoun
百度语音用法小结
这两天在使用百度语音,遇到一个很坑爹的问题,把静态库加入工程后,总是会出现错误,错误如下, ld: warning: directory not found for option '-L/Users/nind/XcodeProjects/BaiduYuyinDemo/libBDVoiceRecognitionClient' Undefined symbols for archite
iOS调试常见错误 如:symbol(s) not found for architecture x86_64
原文出处:http://blog.csdn.net/o_ocm/article/details/50198909 1、框架导入方式: Targets—>Build Phases—>Link Binary With Libraries 中 点“+”导入系统的或Add Other导入外部的 ,  资源文件直接拖入左边文件夹中 2、文件路
ld: symbol(s) not found for architecture x86_64
加入一第三方库文件提示ld: symbol(s) not found for architecture x86_64  通常是第
[iOS]编译报错:ld: symbol(s) not found for architecture x86_64
最近经常遇到这种编译错误:ld: symbol(s) not found for architecture x86_64 网上有许多关于这个错误的,有的说是缺少依赖库,有的说在Build Setting-->Linking-->Other Linker Flags添加-licucore,但是都没有解决问题,最后找到一个说是缺少文件的引用,缺少哪个文件? 从错误信息的""_OBJC_CL
解决 Mac OS X 下 Nginx 编译报错 symbol(s) not found for architecture x86_64
在 Mac OS X El Capitan(10.11) 下编译安装 Nginx 1.8.0 并 --with-http_ssl_module 时, 报错 ld: symbol(s) not found for architecture x86_64 clang: error: linker command failed with exit code 1 (use -v to see invoc
iOS开发缺少framework对应错误提示
StoreKit.frameworkUndefined symbols for architecture i386: "_OBJC_CLASS_$_SKPayment", referenced from: objc-class-ref in Parse(PFPurchase.o) "_OBJC_CLASS_$_SKPaymentQueue", referenced from: objc-class-
Xcode下配置Caffe遇到的坑以及解决办法
本人参考http://blog.csdn.net/baobei0112/article/details/50954934#comments进行配置 中途遇到了一些问题如下 1、can not find openblas 不知为什么我当时明明已经安装过了,还是报这个错,通过下两个语句选择一个语句执行即可 brew install  homebrew/science/openb
sdl库使用时遇到的问题
1. Undefined symbols for architecture x86_64 “_main”问题在使用sdl库的时遇到如下问题: Undefined symbols for architecture x86_64: "_main", referenced from: __start in crt1.o (maybe you meant: _SDL_ma
iOS7.1 编译报错 解决方案 体会
OS升级到 iOS 7.1 了 ,开发人员必须与时俱进。果断下载更新了xcode5.1版本 ,试运行了一下已上线的应用,哇 报错了!好头疼 贴下报错地方: 都是关于第三方类库报的错 比如parse、shareSDK Undefined symbols for architecture x86_64:   "_OBJC_CLASS_$_QQApiInte
小案例-导入支付宝接口时经常出现这样的小错误"_OBJC_CLASS_$_UTDevice"
在支付宝SDK导入后,会报下面的错误,请问怎么解决呀? Undefined symbols for architecture armv7:   "_OBJC_CLASS_$_UTDevice", referenced from:       objc-class-ref in AlipaySDK ld: symbol(s) not found for architecture armv
iOS 编译含C++代码出现ld: symbol(s) not found for architecture i386错误之解决
最近项目需要搭建自己的IM服务器,在快速配置好Openfire之后,开始研究使用gloox开发XMPP客户端实现通信, 先下载gloox源码,然后./configure,make ,sudo make install,在/usr/local/下找到头文件夹和静态库,加到项目中,然后加入openssl库,编写测试代码,编译,报错:XXX not being for architecture
symbol(s) not found for architecture armv7
Undefined symbols for architecture i386: “_OBJC_CLASS_$_XXX”, referenced from: objc-class-ref in XXX ld: symbol(s) not found for architecture i386 clang: error: linker command failed with ex
found FileProvider for ..."解决方法">"...not found FileProvider for ..."解决方法
使用xcode9打包出来的项目,放到xcode8中去运行,就会报错。”Framework not found FileProvider for architecture x86_64”解决方法一:升级xcode8到xcode9 解决方法二:复制Xcode9的 FileProvider到Xcode8中
LD: SYMBOL(S) NOT FOUND FOR ARCHITECTURE ARMV7
解决方法点击工程,在主界面中点击Build Phases,根据提示信息“XXX”来判断缺少什么文件,一般如果缺少自定义的文件,Complie Sources下没有XXX文件,那么就在Complie Sources中加入该文件。如果缺少类库,则在Link Binary With Libraries中加入该类库。   又或者是: 一般真机调试时,如果报armv7错误,一般都是因为armv7指令集
错误总结:Undefined symbols for architecture
Undefined symbols for architecture 错误总结
Framework not found IOSurface for architecture arm64 解决方案
/Applications/Xcode.app/Contents/Developer/Platforms/iPhoneOS.platform/Developer/SDKs/iPhoneOS.sdk/System/Library/Frameworks目录下的IOSurface.framework、FileProvider.framework拷到Xcode8中相应目录下即可。 资料中包括iPhoneSimulator 和 iPhoneOS的.
xcode编译时,有第三方库时,编译设置build active architecture only问题
1、http://blog.csdn.net/dengdengxiximeimei/article/details/8845621   关于Build Active Architecture Only属性 2013-04-24 16:54 153人阅读 评论(0) 收藏 举报 这个属性设置为yes,是为了debug的时候编译速度更快,它只编译当前的architectur
关于iOS使用个推来实现消息推送时出现ld: framework not found FileProvider错误的处理
按照个推的官方文档配置项目时候,出现了如下报错: ld: framework not found FileProvider for architecture armv7 clang: error: linker command failed with exit code 1 (use -v to see invocation) 找了整个项目都没有发现哪里使用了FileProvider这个基本...
导入讯飞库时 遇到的问题
Undefined symbols for architecture x86_64:   "_OBJC_CLASS_$_CNContactStore", referenced from:       objc-class-ref in iflyMSC(IFlyContact.o)   "_OBJC_CLASS_$_CNContactFetchRequest", referenced from...
(更新)汇总:ios开发出现Undefined symbols for architecture xxx问题的解决办法
(此贴为更新贴,可以直接跳转到分割线之后看) 此前公司项目中做一个实时监控的app 在xcode运行时,碰到了如下截图的问题: 关键字: _VTDecompressionSessionInvalidate、_VTDecompressionSessionDecodeFrame、_VTDecompressionSessionCreate 直接在工程的bulid phases中引入Vide...
Xcode 升级后,常常遇到的遇到的警告、错误,解决方法
Xcode 升级后,常常遇到的遇到的警告、错误,解决方法 从sdk3.2.5升级到sdk 7.1中间废弃了很多的方法,还有一些逻辑关系更加严谨了。 1,警告:“xoxoxoxo”  is deprecated 解决办法:查看xoxoxoxo的这个方法的文档,替换掉这个方法即可。 2,警告:Declaration of "struct sockaddr" will not be visi
Framework not found IOSurface for architecture arm64(不能设为免费?)
Framework not found IOSurface for architecture arm64所需 IOSurface.framework、FileProvider.framework
ios openCV遇到的一些坑
欢迎使用Markdown编辑器写博客本Markdown编辑器使用StackEdit修改而来,用它写博客,将会带来全新的体验哦: 这两天需要用openCV做一些东西,第一次接触这个东西,然而再导入到项目的时候报错不断,将我遇到的错误解决方法分享出来,以免更多的人在这里浪费时间: (1)将加入openCV代码的.m文件改成.mm文件,然后要加上libc++.dylib到other link编译选项中
从Xcode10不再支持libstdc++说起
Linux编程点击右侧关注,免费入门到精通!作者丨欧阳大哥2013https://www.jianshu.com/p/44915099abaf众所周知从Xcode10起,...
Mac OS X下编译并搭建ffmpeg开发环境及常见错误处理
首先官网下载源码文件:http://www.ffmpegmac.net/,注意点击“Download Now!"字样下面的“sourcecode”进行下载。下载后是一个.7z的压缩包,可以下载“The Unarchiver”程序进行解压,上传到资源栏里了,http://download.csdn.net/detail/enter_/9629936 这里有官网的编译方法:https://trac.
[绍棠] ios常见问题解决
iOS问题中经常会遇到各种问题, 于是就将各种问题做了下汇总, 希望能帮到你们
关于导入百度导航SDK报错以及解决方案
1.由于工程中使用的百度地图的其他SDK在加入百度导航SDK时报如下错误: Undefined symbols for architecture arm64:   "_OpenSSL_add_all_algorithms", referenced from:       _baidu_vi::BNCVSocketMan::BNCVSocketMan() in libbaiduNaviSDK.
【Unity基础知识之二】支持iOS架构 armv6 armv7 armv7s arm64
目前ios的指令集有以下几种: armv6 iPhone iPhone2 iPhone3G 第一代和第二代iPod Touch armv7 iPhone4 iPhone4S armv7s iPhone5 iPhone5C arm64 iPhone5S  机器对指令集的支持是向下兼容的,因此armv7的指令集是可
Qt下使用mac下编译好的OSG库
mac下编译osg 3.4.0一开始没成功,据说64位的OS X不能正常使用QT,但是我编译动态库的时候没有反选OSG_USE_QT,编译成功了,osgviewerQt例子也跑起来了,需要在cmake中加入 set(DESIRED_QT_VERSION "5" CACHE STRING "") set(CMAKE_PREFIX_PATH "/Users/Qt5.11.1/5.11.1/clang_...
iOS-Undefined symbols for architecture x86_64-- 调适萤石摄像头驱动程序--萤石开放平台
Undefined symbols for architecture x86_64 报错如下 Undefined symbols for architecture x86_64: "_OBJC_CLASS_$_EZCloudRecordFile", referenced from: objc-class-ref in EZRecordCell.o obj
百度地图导航集成 arm64 不兼容问题
百度导航集成下载时的so库只有 arm百度地图定位的so库有 arm armv7 arm64 x86 等由于大多数情况下app会需要用到不同的arm架构, 只使用arm的架构是不满足我们的所以建议先下载自定义的百度地图定位导航 lib  然后下载自定义的百度地图定位lib, 将该文件下的armv7 等覆盖...
iOS bugly集成报错
iOS bugly手动集成文档真实烂。 集成的时候一堆错误: Undefined symbols for architecture arm64:  “OBJC_CLASS$_JSContext”, referenced from:  objc-class-ref in Bugly(libBugly.a-arm64-master.o)  ld: symbol(s) not found
关于友盟社会化分享框架的一些使用心得
现在很多移动端的开发者都会在app的应用中接入第三方的平台分享功能,我在使用过程中当然会首先去这些网站上去看集成的说明文档,在这里就不得不吐槽了,集成文档真的有用心在写么?!废话不多说,下面言归正传。 很多时候在集成这些文档的时候肯定会导入第三方架包,往往我们编译出错的问题也都是出现在这里,首先你要明白编译器只是智能在编译,编译出错的结果提示有时候不是你问题错误的根源,如果一味的按照编译器的出错
升级Xcode到6.1之后使用iPhone6真机测试cocos2d-x报错不支持arm64的解决方案(转)
转载请注明出处http://blog.csdn.net/wjlpld/ 谢谢大家         最近收入iPhone6之后将Xcode顺便升级到6.1版本,编译cocos2d-x 3.2的Helloworld项目时报错如下                          Undefined symbols for architecture arm64:          "_WebPGetFe
MacOS 安装 convnet的几个问题
1. 类似fatal error: 'jpeglib.h' file not found或者 X11/Xlib.h找不到这种文件找不到的问题。   原因:该文件引入路径不对,可能是电脑上不存在这类文件,更多可能是该类文件指向不对。    解决方法:此时一般需要先找出该文件所在位置,然后再建立相应的映射,如软链接ln -s XXX XXX这种做法 2.编译convnet时,报uint没定义这种
ios 手动倒入第三方报错
Undefined symbols for architecture x86_64:   "_kTTTStrikeOutAttributeName", referenced from:       ___29-[ViewController viewDidLoad]_block_invoke in ViewController.o   "_OBJC_CLASS_$_TTTAttributed
iOS 开发过程中遇到的那些奇葩的坑
1.打印异常:dyld: lazy symbol binding failed: Symbol not found: _objc_unsafeClaimAutoreleasedReturnValue; 2.程序编译正常、运行正常但是打包时候报错,异常信息如下:Undefined symbols for architecture armv7:
导入SDwebImage到工程中运行时出现如下错误
SDwebImage放入工程中运行时就出现如下错误,之前导入外部文件也会出现这样的问题,这个是什么导致的? Undefined symbols for architecture i386:   "_OBJC_CLASS_$_MKAnnotationView", referenced from:       l_OBJC_$_CATEGORY_MKAnnotationV
Caffe 安装错误记录及解决办法【转】
from:http://blog.csdn.net/lien0906/article/details/46816243 1)Fatal error : 'tr1/tuple' file not found 出现该问题有两种情况,可以先尝试下面的链接:https://github.com/BVLC/caffe/issues/1358 如果不行,那说明是 Makefile文件除了问
iOS9 上支付宝AlipaySDK编译错误解决办法
编译的错误: ld: warning: directory not found for option ‘-L/Users/XXX/Downloads/ios’ ld: ‘/XXX/Common/ALiPay/AlipaySDK.framework/AlipaySDK’ does not contain bitcode. You must rebuild it with bitcode enab
iOS OpenCV我安装遇到的问题和解决办法
1.直接通过Build phases -> Link binary with Libraries 添加opencv2.framework 2.可能出现如下错误:  Undefined symbols for architecture x86_64:  "_jpeg_free_large", referenced from:  _free_pool in opencv2(jmemmg
腾讯移动游戏平台SDK(MSDK) ios版Ane扩展 过程中所遇到的问题
本文记录了在开发 腾讯移动游戏平台SDK(MSDK) ios版Ane扩展 过程中所遇到的问题 文中很多问题都是基础的问题、对object c和xcode配置了解不深入导致的。(没办法,开发ane的程序员大部分都是做ActionScript的,一般对c/c++都没有开发经验) 问题一、编译报错:Unexpected ‘@’ in program 代码如下: @try{
黑马程序员-XCODE6.1.1的使用
mac及xcode的使用
最新ShareSdk简洁版集成注意事项(IOS)
集成过程遇到的问题工程跑不起来文件都按照官方文档拖拽进去、依赖的系统框架也都添加完毕,提示找不到引用框架。 出现此问题是因为虽然你把文件拖进去了,但工程仍找不到你引用框架所在的位置,我用的是xcode7.0测试版本,估计其他版本不会出现这个问题。解决办法如下: 找到工程中的这两项(默认是空的) 分别添加拖拽文件夹锁在的目录: Framework Search Paths Lib
Xcode8不升级支持升级包IOSurface和FileProvider
在通过网络或者别人给传的项目可能是由高级版本的Xcode创建的项目,在本地运行时报错一些必要的framework缺失 如 IOSurface.framework 、FileProvider.framework 报错信息如下 Framework not found IOSurface for architecture arm64 下载地址如下   https://download.csdn...
ios编译RegexKitLite的时候报错解决方法
工程在不小心删除了一个链接库的情况下,突然出现了下面错误: Undefined symbols for architecture i386: "_u_errorName", referenced from: _rkl_NSExceptionForRegex in libPods.a(RegexKitLite.o) _rkl_makeNSError in libPods
报错处理(二)第三方shareSDK-MOB
Undefined symbols for architecture x86_64:   "_crc32", referenced from:       +[MOBFData valueByCRC32Data:] in MOBFoundation(MOBFData.o)   "_deflate", referenced from:       +[MOBFData com
mac php brew install ld:symbol(s) not found for architecture x86_64
brew install php56rn==> Installing php56 from josegonzalez/homebrew-phprn==> Downloading https://www.php.net/get/php-5.6.4.tar.bz2/from/this/mirrorrnAlready downloaded: /Library/Caches/Homebrew/php56-5.6.4rn==> Patchingrn==> ./configure --prefix=/usr/local/Cellar/php56/5.6.4 --localstatedir=/usr/local/var --sysconfdir=/usr/local/etc/php/5.6 --with-config-file-rn==> makern ...rnld: symbol(s) not found for architecture x86_64rnclang: error: linker command failed with exit code 1 (use -v to see invocation)rnmake: *** [libs/libphp5.bundle] Error 1rnmake: *** Waiting for unfinished jobs....rnrnREAD THIS: http://git.io/brew-troubleshootingrnIf reporting this issue please do so at (not Homebrew/homebrew):rn https://github.com/josegonzalez/homebrew-php/issuesrnrn求助:有人知道怎么回事吗?
EOS入门指南-PART1 环境搭建
本文作为系列第一篇文章,主要介绍了如何搭建EOS本地环境、运行节点并并进行简单的交互:如创建钱包。 note:笔者用的是macOS系统。 EOS主网正式上线,想必大家都很激动吧。我的第一感觉是,虽然EOS离自己的目标仍然还有一段路要走,但是它依然是被寄予厚望的公链项目。现在似乎是更加深入了解EOS的好时候,一开始,我们会学习一些和EOS平台交互的简单操作。 在正式开始之前,有...
Xcode8 使用CoreData生成对象文件出现编译错误解决方案
问题描述:duplicate symbol _OBJC_CLASS__Person in:/Users/suruikeji/Library/Developer/Xcode/DerivedData/CoreData_Demo-gwbqmxvuoisdjsekqjhmlknqktgk/Build/Intermediates/CoreData_Demo.build/Debug-错误信息:iphonesim
机器学习mxnet mac下编译问题
机器学习库mxnet,这个库是c++编写的,需要先编译再使用,步骤稍微多些 1.下载代码先 git clone --recursive https://github.com/dmlc/mxnet 2.依赖库编译 brew update brew tap homebrew/science brew install opencv brew install openblas 3.配置
项目中某些静态库缺少,或者编译环境的问题造成的相关编译错误(Undefined symbols for architecture x86_64:)
项目工程中导入了很多库,有时候会出现一些问题,解决办法如下: 解决办法: 选中Targets—>Build Settings—>Architectures 把build active architectures only 改为 NO,把的Valid Architectures选项中的arm64参数删掉就可以了,或者:双击Architectures,选择other,删除$(AR
百度地图SDK使用过程中的那些坑
使用跟demo相同的Key,并且联网成功,授权成功,但是在初始化地图的时候提示引擎初始化失败,解决方法:检查SDK中的资源文件mapapi.bundle是否导入,如果没有导入,导入即可。 由于百度地图的SDK分为模拟器上使用的SDK和真机上使用的SDK,如果不慎将SDK导错(比如,在真机测试时,导入了模拟器上使用的SDK),会出现以下错误: 将在模拟器上,使用真机SDK,出现的错误,
iOS Build失败的一些原因(持续补充)
失败信息: Undefined symbols for architecture x86_64:   "_deflate", referenced from:       -[NSData(Ifeng) gzippedDataWithCompressionLevel:] in NSData+Ifeng.o   "_deflateEnd", referenced from:       -
报错处理(三)
Undefined symbols for architecture x86_64:   "_OBJC_CLASS_$_JPUSHRegisterEntity", referenced from:       objc-class-ref in AppDelegate.o   "_OBJC_CLASS_$_JPUSHService", referenced from:
CAF转换MP3的lame库编译问题解决
最近在使用lame库将CAF转换为MP3时遇到一个编译错误,此时的模拟器处于64bit位环境下。本文给出解决方法,并估计原因所在。
ndk 编译常见错误-你懂得
=====================error:Compile++ thumb : AndroidCamera <= bufferqueue.cpp jni/newBuffer/bufferqueue.cpp:10:17: fatal error: queue: No such file or directory***Answer:添加Application.mk:APP_CFLAGS +
ios导入静态库时报错:"_OBJC_CLASS_$_"
报错:"_OBJC_CLASS_$_"  ld: warning: ignoring file test/libXXX.a, file was built for archive which is not the architecture being linked (x86_64): test/libXXX.a Undefined symbols for architecture x86_64:
直播用的IJKMediaFramework.framework的生成步骤
github的地址: https://github.com/Bilibili/ijkplayer 1:现在在这个文件 首先进行这些步骤的操作,编译时间较长: Build iOS git clone https://github.com/Bilibili/ijkplayer.git ijkplayer-ios cd ijkplayer-ios ./ini
Mac symbol(s) not found for architecture x86_64 ?
Mac编译 symbol(s) not found for architecture x86_64 ?修改rnrnunamernDarwin Kernel Version 15.3.0: Thu Dec 10 18:40:58 PST 2015; root:xnu-3248.30.4~1/RELEASE_X86_64 x86_64rngcc -lncurses -o "veto_mq_server" ./src/veto_mq_server.ornUndefined symbols for architecture x86_64:rn"_zmq_bind", referenced from:rn_main in veto_mq_server.orn"_zmq_ctx_new", referenced from:rn_main in veto_mq_server.orn"_zmq_recv", referenced from:rn_main in veto_mq_server.orn"_zmq_send", referenced from:rn_main in veto_mq_server.orn"_zmq_socket", referenced from:rn_main in veto_mq_server.ornld: symbol(s) not found for architecture x86_64rnrnclang: error: linker command failed with exit code 1 (use -v to see invocation)rn引用了第三方库ZMQrn/usr/local/include/rn-rw-r--r--@ 1 root admin 844 Mar 10 15:00 zmq_utils.hrnrn-rw-r--r--@ 1 root admin 16613 Mar 10 15:00 zmq.hrn/usr/local/lib/rnlrwxr-xr-x 1 yanrui admin 43 Mar 18 2015 libzmq.4.dylib -> ../Cellar/zeromq/4.0.5_2/lib/libzmq.4.dylibrn-rwxr-xr-x 1 root admin 958 Mar 10 15:00 libzmq.larnlrwxr-xr-x 1 root admin 14 Mar 10 15:00 libzmq.dylib -> libzmq.5.dylibrn-rw-r--r-- 1 root admin 23545352 Mar 10 15:00 libzmq.arn-rwxr-xr-x 1 root admin 602308 Mar 10 15:00 libzmq.5.dylibrnrn![图片说明](https://img-ask.csdn.net/upload/201603/11/1457661164_327576.png)
库文件存,ld报错找不到
项目中遇到一个问题,库是已经编译好的库,用-L选项,编译缺提示找不到库文件,如下: not found (try using -rpath or -rpath-link) 在网络上找到答案,感谢万能的google: When you see the following kind of errors during cross compilation (linking phase): ld
友盟库报错处理
报错信息:Undefined symbols for architecture i386: "___gxx_personality_v0", referenced from: Dwarf Exception Unwind Info (__eh_frame) in TencentOpenAPI(AppidConvert.o) ld: symbol(s) not found for a
iPhone 6 Plus真机调试时遇到的问题
在iPhone 6 Plus上跑的时候遇到了这么一个错误:ld can't link with a main executable file for architecture armv7,然后就各种改啊改啊,因为我明明已经把arm64加入了豪华午餐阵容了呀,为啥还提示我不允许在64位处理器上跑啊?这不科学! 然后就是各种Google呗,唔,搜到了两个解决方案: 一、 http://st
iOS 处理第三方库冲突
出现的错误大概是这样的,这是报的错误 duplicate symbol _OBJC_METACLASS_$_armdec in:  /Users/XXXX/Desktop/XXXX/XXXX/libplayctrl.a(armdec.o)  /Users/XXXX/Desktop/XXXX/EZOpenSDK/libEZOpenSDK.a(armdec.o)  duplicate sy
使用cocoapods添加的库和不支持arm64的API真机调试问题
使用shareSDK来做第三方分享,模拟器运行良好,但是真机一直报错,好像是不支持64位,昨天一天都是在调试bug,一直错误不断!
iOS 关于银联支付问题
1、调试时打开银联控件后卡在加载界面,报错信息:'NSInvalidArgumentException',reason: '-[__NSCFConstantString newSizeWithFont:...       解决方法:首先在other link配置添加-ObjC,没有解决问题的话尝试改为-force_load$(PROJECT_DIR)/libUPPayPlugin.a,即-for
mac OS X 10.10更新gcc 4.9.1后默认无法编译连接的问题
MAC OS X10.10升级前使用的低版本的gcc(好像是4.7.x),正常编译可以完成,不过会出现警告: couldn't understand kern.osversion `14.0.0' 网友说好像是Xcode版本过低(使用的是Xcode6 beta4),现在正在升级Xcode 6.1。与此同时,使用HomeBrew升级最新的gcc 4.9.1(X86_64)。后来编译时发现gc
shareSDK遇到的问题及解决方法
第一个,找不到 /**      连接QQ空间应用以使用相关功能,此应用需要引用QZoneConnection.framework      http://connect.qq.com/intro/login/上申请加入QQ登录,并将相关信息填写到以下字段            如果需要实现SSO,需要导入TencentOpenAPI.framework,并引入QQApiInte
关于添加私有库后ld: framework not found 的问题
问题:在添加私有库后已经在Bulid setting的framework search中添加了私有库的寻找路径$(PROJECT_DIR)/Pro_Name仍然显示ld: framework not found
【Mac/iOS】动态和静态FrameWork
文档描述: 本文介绍了开发Mac和iOS的FrameWork的方法,清晰明了,后半部分有详细步骤。 开发中我们会使用到第三方的SDK,有的时候也会将整个系统的公用的功能的抽象出来成为FrameWork,我们只需要暴露对外的接口,使用者只需要调用接口,对于内部实现的过程不需要维护,可以以库的形式进行封装,只暴露出头文件。库(FrameWork)是编译好的二进制文件,编译的时候只需要
Xcode 10 兼容遇到的坑和解决方法
$(TeamIdentifierPrefix) Xcode 10 已知 Bug,无法自动替换。 Workaround 可以手动将 entitlements 文件的 Pass Type ID 值设置为 mobileversion 文件中com.apple.developer.pass-type-identifiers 对应值。 libstdc++ Xcode 10 取消了内置支持的 lib...
鸡毛蒜皮集锦
打算纪录一下各种鸡毛蒜皮的小错误,过段时间回头看看有没有用 1. MAC篇 MAC OX 10.8.2 ML, Xcode Xcode 4.5.1 (Build version 4G1004) 1.1 undefined symbols for architecture x86_64:  "_omp_get_thread_num", referenced from:.... Sol
iOS -- 接入微信SDK包报错
一、Undefined symbols for architecture arm64: "_kSecReturnData", referenced from: +[WXOMTAKeyChain load:] in libWeChatSDK.a(MTAKeyChain.o) "_kSecMatchLimitOne", referenced from: +[WXOMTAK
iOS 制作自己的FrameWork遇到的一些问题 以及FrameWork通过包合并支持arm64 armv7 i386 架构
FrameWork通过包合并支持arm64 armv7 i386 架构
armv6或者armv7或模拟器可以运行,真机不能运行
最后解决办法: 把Architectures 改为armv6 或 armv7.就可以了。 What is ARMv7? It's a new CPU architecture of iPhone. Make some apps run faster. What does ARMv7 to do with me? Here is a post by most_Uniqu
使用ASIHTTPRequest的ASIDataCompressor与ASIDataDecompressor进行gzip压缩与解压缩,出现的问题
导入系统的libbz2.1.0.tbd 导入头文件#import 从网上找的gzip压缩与解压缩方法 如:http://my.oschina.net/u/1244672/blog/185175 编译后,报错: Undefined symbols for architecture x86_64:   "_deflate", referenced from:       +[J
ARMv7-AR Architecture Reference Manual.pdf
ARMV7参考手册,2008年版
Unity3d使用高通Vuforia发布IOS工程遇见缺少插件问题解决
1、检查Build Settings->Search Paths->Library Search Paths。Xcode中有可能讲斜杠弄反了,Libraries/Plugins\iOS 要改过来。 2、在General中添加Security.framework.
我们是很有底线的