安装embarcaderoXE8失败 [问题点数:0分]

Bbs1
本版专家分:0
结帖率 0%
Bbs6
本版专家分:5783
Bbs3
本版专家分:579
Blank
红花 2019年2月 C++ Builder大版内专家分月排行榜第一
2017年12月 C++ Builder大版内专家分月排行榜第一
2016年12月 C++ Builder大版内专家分月排行榜第一
2016年11月 C++ Builder大版内专家分月排行榜第一
2016年9月 C++ Builder大版内专家分月排行榜第一
2016年8月 C++ Builder大版内专家分月排行榜第一
Bbs1
本版专家分:0
Bbs7
本版专家分:20280
Blank
红花 2019年2月 其他开发语言大版内专家分月排行榜第一
2019年1月 Delphi大版内专家分月排行榜第一
2018年8月 Delphi大版内专家分月排行榜第一
2018年7月 Delphi大版内专家分月排行榜第一
2018年4月 Delphi大版内专家分月排行榜第一
2018年3月 Delphi大版内专家分月排行榜第一
Blank
黄花 2016年11月 Delphi大版内专家分月排行榜第二
Blank
蓝花 2011年10月 其他开发语言大版内专家分月排行榜第三
2010年8月 其他开发语言大版内专家分月排行榜第三
2007年5月 其他开发语言大版内专家分月排行榜第三
Bbs1
本版专家分:0
Arduino安装失败方法
Arduino 在win7系统下 <em>安装</em>arduino驱动<em>失败</em>的解决方法
安装SCOM2007R2报表服务器 失败(卡住不动)
<em>安装</em>SCOM2007R2报表服务器 <em>失败</em>(卡住不动)
Linux安装virtualbox失败(请用这命令)
Linux<em>安装</em>virtualbox<em>失败</em>(请用这命令)
SQL 2008R2 安装重启失败处理
SQL <em>安装</em>时提示重启检测<em>失败</em>,重启后仍然提示检测<em>失败</em>处理reg文件
eclipse绑定sts
<em>安装</em>sts弄了好久一直加载<em>失败</em>,使用最新版的eclipse4.8<em>安装</em>sts一直<em>失败</em>,这个版本是4.7的,给大家分享下
open-vm-tools
open-vm-tools 解决Fedora core 9<em>安装</em>vmware-tools<em>失败</em>的问题.
reset_minimal.zip
解决Flash Player 10 <em>安装</em>时提示注册<em>失败</em>的解决方法
VMware Uninstal Documents
<em>安装</em>,卸载或重装Vmware Workstation时<em>失败</em>的官方解决方案
oracle 11g安装先决条件检查全部失败,BIEE11G 解决办法
oracle 11g<em>安装</em>先决条件检查全部<em>失败</em>,BIEE11G 解决办法
sql server 2000安装问题集
<em>安装</em>sql server 2000 常见的导致<em>失败</em>的问题集合
SQL 2005安装失败 性能监视器问题解决方案
<em>安装</em>sql2005过程<em>失败</em>,其中性能监视器问题解决方法总结
win7旗舰版系统360浏览器安装扩展插件失败原因和三种解决方法
win7旗舰版系统360浏览器<em>安装</em>扩展插件<em>失败</em>原因和三种解决方法
oracle 11g安装先决条件检查全部失败解决办法
oracle 11g<em>安装</em>先决条件检查全部<em>失败</em>解决办法
pgsql安装,绿色
pgsql 绿色版本<em>安装</em>。穿了三次都<em>失败</em>了。
sql 重启失败
sql server <em>安装</em>时提示重启计算机<em>失败</em>
智能手机USB补充文件
智能手机<em>安装</em>驱动的时候<em>失败</em>时用的补充文件
PCCAD2008驱动安装工具
PCCAD2008 64位电脑<em>安装</em>,需要这个小工具,否则破解<em>失败</em>
face_landmark_model.dat
<em>安装</em>opencv_contrib过程中下载face_landmark_model.dat<em>失败</em>。下载此文件。
orcale12c安装完成,初始登录教程
初始<em>安装</em>后,登录<em>失败</em>的可以参考本文档
IE6升级IE8失败解决办法,亲测有效
IE8<em>安装</em>更新总是<em>失败</em>,一上午才搞定,与大家分享
red hat或centos7下安装gcc6.4.0
在centos7或Linux下<em>安装</em>gcc-6.4.0.red hat下<em>安装</em>可能<em>失败</em>,如果<em>失败</em>修改yum源(我上传了,下载即可)。以root运行脚本。(我已经试过了,成功。但后来又修改了一下,没试过修改后的,可能<em>失败</em>,你看着办)
解决安装mysql到最后一步start service失败的方法
解决<em>安装</em>mysql到最后一步start service<em>失败</em>的方法
sql server2008
SqlServer2008<em>安装</em>时系统配置检查器重新启动计算机<em>失败</em> 解决方法
python 环境配置包
解决在<em>安装</em>python过程中打开<em>失败</em>工具,更新windows的系统补丁。
SBT Idea插件
在线<em>安装</em>sbt总是<em>失败</em>,只好收藏了一个离线<em>安装</em>包。帮助大家快速<em>安装</em>
mac 10.6.3 mach_kernel 破解内核
<em>安装</em> 原版 mac 10.6.3 <em>失败</em>的 替换该破解内核 能<em>安装</em>成功
Websphere6[1].1集群安装和配置最终
整理的IBM websphere6集群的<em>安装</em>与配置过程,详细记载了<em>安装</em>体会,是<em>失败</em>和经验的总结。
wincc6.2安装时报错“kb929046 安装程序错误 迁移相关的软件包失败
解决问题:<em>安装</em>wincc6.2报错“kb929046 <em>安装</em>程序错误 迁移相关的软件包<em>失败</em>”
compat-db-4.2.52-5.1.i386.rpm
redhhat as 5服务器<em>安装</em>oracle10g所要用到的<em>安装</em>包,没有它,你<em>安装</em>oracle必定<em>失败</em>
Windows Install Clean Up.zip
清除<em>安装</em>与反<em>安装</em><em>失败</em>程序信息,itunes<em>安装</em>时网络路径什么的时候可以用到
OFFICE 2007 暴力卸载
OFFICE 2007 暴力 卸载。 用于<em>安装</em>Office 2007<em>失败</em>或重<em>安装</em>时,无法正确<em>安装</em>的清理工作。
SQL Server 安装清除工具
你<em>安装</em>SQL SERVER<em>失败</em>后想要再<em>安装</em>时总会<em>安装</em>不上。 这个工具能帮到你。
安装程序启动安装引擎失败
WIN2000+SP4 <em>安装</em>或删除应用程序出现‘<em>安装</em>程序启动<em>安装</em>引擎<em>失败</em>’,无毒,用过SFC/SCANNOW修复。
VS2017离线安装时程序包清单验证失败 解决办法
VS2017离线<em>安装</em>时程序包清单验证<em>失败</em> 解决办法,<em>安装</em>证书后<em>安装</em>出现“程序包清单验证<em>失败</em>” ,关闭校验后,删除离线包内的cs_installer。opc文件 用此文件替换 ,再次运行<em>安装</em>即可通过
安装QQ时创建目录失败的解决办法
原因:一般是系统缺失了一个 叫做msvcr100.dll的文件 解决办法:去360卫士的人工服务里 搜索 msvcr100,会出现一个立即修复的选项,点击 修复完成 重新<em>安装</em>即可!...
sql sever安装完成但失败后的正确姿势
以前装sql sever都挺顺利的,前一阵子因为装固态硬盘重装了系统之后装sql就遇见了很多问题,也就有了这次的学习机会。。。    这次装sql经历了<em>安装</em><em>失败</em>,重装系统——<em>安装</em><em>失败</em>卸载sql,重装系统——<em>安装</em><em>失败</em>,找到原因,成功。来来回回查看了很多资料倒也学会了将sql卸载干净的办法:完美卸载sql。到最后<em>安装</em>成功,我只想说:别冲动,重装系统不能解决所有问题。
redhat安装JDK失败
Error: dl failure on line 864 Error: failed /home/jiangyang/jdk1.7.0_21/jre/lib/i386/client/libjvm.so, because /home/jiangyang/jdk1.7.0_21/jre/lib/i386/client/libjvm.so: cannot restore segment prot
pip安装uwsgi失败
时间:2018年8月16日 PIP<em>安装</em>uwsgi<em>失败</em> 系统:centos 6 / 7 python 3.6 错误: collect2: error: ld returned 1 exit status * error linking uWSGI * 需要装的是集成包 anaconda conda config –add channels conda-forg...
win10安装oracle数据库失败
首先声明一下,按照这个步骤是错误的,<em>安装</em>不成功..所以看客可以借鉴着看看,但不要学Window10<em>安装</em>数据库Oracle 11g注意事项: 因为在本文<em>安装</em>时,遇到了一点儿问题,所以就耽误了一点儿. 全局数据库名:ttd 密码utp      wg_pro/root123    Oracle<em>安装</em>将2/2两个文件,同时选中,解压到当前文件夹,得到一个文件. 进入database,此时会进行oracle...
npm安装axios失败
有大佬帮忙解决下嘛!!!! 感谢!!!!
安装oracle9.2 for linux失败
在<em>安装</em>oracle Database configuration Assistant的时候。rn出现错误,提示为:rnrn‘/etc/oratab' file doesn't existrnrnORA-27/23: unable to attach to shared memory segmentrnrn小弟第一次在linux下装oraclern请大侠告诉我问题出在什么地方好吗?rn
安装SqlServerExpress失败
在装有mcafee 杀毒软件的机器上<em>安装</em>SqlserverExpress,出现错误[img=http://hi.csdn.net/attachment/201101/20/1113115_1295512658J4Tj.png][/img]rn有2台机器<em>安装</em>了mcafee,都出现这个情况,由于客户比较特殊,无法现场调试,并且不能删除mcafee杀毒软件rn以下是<em>安装</em>日志:有懂的帮看看rn[code=C#]rnThe following properties have been set:rnProperty: [AdminUser] = true booleanrnProperty: [ProcessorArchitecture] = Intel stringrnProperty: [VersionNT] = 5.1.3 versionrnRunning checks for package '.NET Framework 2.0', phase BuildListrnRunning external check with command line "C:\DOCUME~1\ADMINI~1.SZJ\LOCALS~1\Temp\VSD29C.tmp\dotnetfx\dotnetchk.exe" -lcid:2052rnProcess exited with code 2rnSetting value '2 int' for property 'DotNetInstalled'rnReading value 'Version' of registry key 'HKLM\Software\Microsoft\Internet Explorer'rnRead string value '6.0.2900.5512'rnSetting value '6.0.2900.5512 string' for property 'IEVersion'rnThe following properties have been set for package '.NET Framework 2.0':rnProperty: [DotNetInstalled] = 2 intrnProperty: [IEVersion] = 6.0.2900.5512 stringrnRunning checks for command 'dotnetfx\instmsia.exe'rnResult of running operator 'ValueExists' on property 'VersionNT': truernResult of checks for command 'dotnetfx\instmsia.exe' is 'Bypass'rnRunning checks for command 'dotnetfx\WindowsInstaller-KB893803-v2-x86.exe'rnResult of running operator 'ValueExists' on property 'Version9x': falsernResult of running operator 'VersionLessThan' on property 'VersionNT' and value '5.0.3': falsernResult of running operator 'VersionGreaterThanOrEqualTo' on property 'VersionMsi' and value '3.0': truernResult of checks for command 'dotnetfx\WindowsInstaller-KB893803-v2-x86.exe' is 'Bypass'rnRunning checks for command 'dotnetfx\dotnetfx.exe'rnResult of running operator 'ValueNotEqualTo' on property 'DotNetInstalled' and value '0': truernResult of checks for command 'dotnetfx\dotnetfx.exe' is 'Bypass'rnRunning checks for command 'dotnetfx\langpack.exe'rnResult of running operator 'ValueEqualTo' on property 'DotNetInstalled' and value '2': truernResult of checks for command 'dotnetfx\langpack.exe' is 'Bypass'rn'.NET Framework 2.0' RunCheck result: No Install NeededrnRunning checks for package 'Windows Installer 3.1', phase BuildListrnThe following properties have been set for package 'Windows Installer 3.1':rnRunning checks for command 'WindowsInstaller3_1\WindowsInstaller-KB893803-v2-x86.exe'rnResult of running operator 'VersionGreaterThanOrEqualTo' on property 'VersionMsi' and value '3.1': truernResult of checks for command 'WindowsInstaller3_1\WindowsInstaller-KB893803-v2-x86.exe' is 'Bypass'rn'Windows Installer 3.1' RunCheck result: No Install NeededrnRunning checks for package 'SQL Server 2005 Express Edition', phase BuildListrnRunning external check with command line "C:\DOCUME~1\ADMINI~1.SZJ\LOCALS~1\Temp\VSD29C.tmp\SqlExpress\SqlExpressChk.exe"rnProcess exited with code 1rnSetting value '1 int' for property 'SQLExpressInstalled'rnThe following properties have been set for package 'SQL Server 2005 Express Edition':rnProperty: [SQLExpressInstalled] = 1 intrnRunning checks for command 'SqlExpress\sqlexpr32.exe'rnResult of running operator 'ValueEqualTo' on property 'SQLExpressInstalled' and value '0': falsernResult of running operator 'VersionGreaterThanOrEqualTo' on property 'VersionNT' and value '5.1': truernResult of checks for command 'SqlExpress\sqlexpr32.exe' is 'Bypass'rnRunning checks for command 'SqlExpress\sqlexpr32.exe'rnResult of running operator 'ValueEqualTo' on property 'SQLExpressInstalled' and value '0': falsernResult of running operator 'VersionLessThan' on property 'VersionNT' and value '5.1': falsernResult of running operator 'ValueEqualTo' on property 'AdminUser' and value 'false': falsernResult of running operator 'ValueExists' on property 'Version9x': falsernResult of running operator 'VersionLessThan' on property 'VersionNT' and value '5.1.2': falsernResult of running operator 'ValueNotEqualTo' on property 'ProcessorArchitecture' and value 'Intel': falsernResult of checks for command 'SqlExpress\sqlexpr32.exe' is 'Install'rn'SQL Server 2005 Express Edition' RunCheck result: Install NeededrnEULA for components 'SQL Server 2005 Express Edition' was accepted.rnCopying files to temporary directory "C:\DOCUME~1\ADMINI~1.SZJ\LOCALS~1\Temp\VSD29C.tmp\"rnCopying from 'C:\Documents and Settings\Administrator.SZJHCWB-B175\桌面\某软件系统<em>安装</em>包\SqlExpress\sqlexpr32.exe' to 'C:\DOCUME~1\ADMINI~1.SZJ\LOCALS~1\Temp\VSD29C.tmp\SqlExpress\sqlexpr32.exe'rnRunning checks for package 'SQL Server 2005 Express Edition', phase BeforePackagernRunning external check with command line "C:\DOCUME~1\ADMINI~1.SZJ\LOCALS~1\Temp\VSD29C.tmp\SqlExpress\SqlExpressChk.exe"rnProcess exited with code 1rnSetting value '1 int' for property 'SQLExpressInstalled'rnThe following properties have been set for package 'SQL Server 2005 Express Edition':rnProperty: [SQLExpressInstalled] = 1 intrnRunning checks for command 'SqlExpress\sqlexpr32.exe'rnResult of running operator 'ValueEqualTo' on property 'SQLExpressInstalled' and value '0': falsernResult of running operator 'VersionLessThan' on property 'VersionNT' and value '5.1': falsernResult of running operator 'ValueEqualTo' on property 'AdminUser' and value 'false': falsernResult of running operator 'ValueExists' on property 'Version9x': falsernResult of running operator 'VersionLessThan' on property 'VersionNT' and value '5.1.2': falsernResult of running operator 'ValueNotEqualTo' on property 'ProcessorArchitecture' and value 'Intel': falsernResult of checks for command 'SqlExpress\sqlexpr32.exe' is 'Install'rn'SQL Server 2005 Express Edition' RunCheck result: Install NeededrnVerifying file integrity of C:\DOCUME~1\ADMINI~1.SZJ\LOCALS~1\Temp\VSD29C.tmp\SqlExpress\sqlexpr32.exernWinVerifyTrust returned 0rnFile trustedrnInstalling using command line '"C:\DOCUME~1\ADMINI~1.SZJ\LOCALS~1\Temp\VSD29C.tmp\SqlExpress\sqlexpr32.exe" -q /norebootchk /qn reboot=ReallySuppress addlocal=all instancename=SQLEXPRESS SQLAUTOSTART=1'rnProcess exited with code 1067rnStatus of package 'SQL Server 2005 Express Edition' after install is 'InstallFailed'rnrn[/code]rn
安装sql2005失败
系统是win2003 sp2 rn已装有iis和framework rnrn在<em>安装</em>初始化的时候,native client能<em>安装</em>成功, rn下一个 <em>安装</em>程序支持组件一闪就没有了,也不报具体错误rnrn以下是<em>安装</em>日志: rnMicrosoft SQL Server 2005 Setup beginning at Thu May 14 15:56:41 2009 rnProcess ID : 1068 rnH:\setup.exe Version: 2005.90.1399.0 rnRunning: LoadResourcesAction at: 2009/4/14 15:56:41 rnComplete: LoadResourcesAction at: 2009/4/14 15:56:41, returned true rnRunning: ParseBootstrapOptionsAction at: 2009/4/14 15:56:41 rnLoaded DLL:H:\xmlrw.dll Version:2.0.3604.0 rnComplete: ParseBootstrapOptionsAction at: 2009/4/14 15:56:41, returned true rnRunning: ValidateWinNTAction at: 2009/4/14 15:56:41 rnComplete: ValidateWinNTAction at: 2009/4/14 15:56:41, returned true rnRunning: ValidateMinOSAction at: 2009/4/14 15:56:41 rnComplete: ValidateMinOSAction at: 2009/4/14 15:56:41, returned true rnRunning: PerformSCCAction at: 2009/4/14 15:56:41 rnComplete: PerformSCCAction at: 2009/4/14 15:56:41, returned true rnRunning: ActivateLoggingAction at: 2009/4/14 15:56:41 rnComplete: ActivateLoggingAction at: 2009/4/14 15:56:41, returned true rnDelay load of action "DetectPatchedBootstrapAction" returned nothing. No action will occur as a result. rnAction "LaunchPatchedBootstrapAction" will be skipped due to the following restrictions: rnCondition "EventCondition: __STP_LaunchPatchedBootstrap__1068" returned false. rnRunning: PerformSCCAction2 at: 2009/4/14 15:56:41 rnLoaded DLL:C:\WINDOWS\system32\msi.dll Version:3.1.4000.4042 rnLoaded DLL:C:\WINDOWS\system32\msi.dll Version:3.1.4000.4042 rnComplete: PerformSCCAction2 at: 2009/4/14 15:56:41, returned true rnRunning: PerformDotNetCheck at: 2009/4/14 15:56:41 rnComplete: PerformDotNetCheck at: 2009/4/14 15:56:41, returned true rnRunning: ComponentUpdateAction at: 2009/4/14 15:56:41 rn
npm安装一些包失败
使用npm<em>安装</em>一些包<em>失败</em>了的看过来(npm国内镜像介绍)  发布于 3年前  作者 wppept  26913 次浏览  最后一次编辑是 7个月前 这个也是网上搜的,亲自试过,非常好用! 镜像使用方法(三种办法任意一种都能解决问题,建议使用第三种,将配置写死,下次用的时候配置还在): 1.通过config命令 npm config set registry
安装sql失败
本来一直用得好好的,后来装了一个数据库管理系统,sql就无法登陆了.rn现在把它谢栽了.重新<em>安装</em>,到最后一部,显示配置服务器的时候<em>失败</em>.rn
python2.6下安装py2exe失败
正常<em>安装</em>完之后,导入模块的时候提示如下错误,请看下是什么原因rnrn<em>安装</em>的版本为:py2exe-0.6.9.win32-py2.6.exernrn>>> import py2exernrnTraceback (most recent call last):rn File "", line 1, in rn import py2exern File "E:\python2.6\Lib\site-packages\py2exe\__init__.py", line 67, in rn import distutils.dist, distutils.core, distutils.command, build_exe, sysrn File "E:\python2.6\Lib\site-packages\py2exe\build_exe.py", line 16, in rn import setsrn File "E:\python2.6\lib\sets.py", line 85, in rn stacklevel=2)rn File "E:\python2.6\lib\warnings.py", line 29, in _show_warningrn file.write(formatwarning(message, category, filename, lineno, line))rnTypeError: idle_formatwarning_subproc() takes exactly 4 arguments (5 given)rn
anaconda3安装dlib失败
各位大侠,我是小白,最近在使用anaconda<em>安装</em>dlib的时候总是<em>失败</em>,<em>失败</em>截图如下rn[img=https://img-bbs.csdn.net/upload/201804/29/1524981410_182967.jpg][/img]rn请问这该怎么解决啊,谢谢各位了。
centos7安装mysql失败
之前有误解,直接将mariadb删除,再重新<em>安装</em>mysql即可,因为centos默认使用mariadb
安装eclipse时失败
我在<em>安装</em>eclipse时出现了Installation failed with an error,以下是具体的错误,但是本人菜鸟看不懂,求大神帮忙解决! [2019-01-22 18:51:22] Executing bootstrap tasks [2019-01-22 18:51:22] Java™ SE Runtime Environment 11.0.2+9-LTS [2019-01-22...
NPM安装Mysql失败
1. 简介 最近在写nodejs的时候,忽然发现找不到mysql包,重新<em>安装</em>的时候报了错,后来在网上辗转搜索终于找到了解决办法。 image.png 2. 解决 方法一: 进入use/用户名/AppData/Roaming/npm文件夹下,在这个位置进行<em>安装</em>。 比如我的是: C:\Users\PC-0775\AppData\Roaming\...
安装home-brew失败,解决方法
http://www.zhihu.com/question/35928898/answer/66926256 以下操作会造成其他信息的删除,请慎重使用 <em>安装</em><em>失败</em>, 执行以下脚本卸载, /usr/bin/ruby -e &quot;$(curl -fsSL https://raw.githubusercontent.com/Homebrew/install/maste...
安装Flask-Bcrypt失败的问题
No package 'libffi' found 系统没有<em>安装</em>必须的开发包的缘故。一般多见于Debian系系统. 解决方案: apt-cache search libffi | grep dev apt-get install libffi-dev ... 还是没有相关依赖包,应该只用<em>安装</em>一个就可以了 apt-get install python3-de...
安装sass失败,解决方法
转载http://www.w3cplus.com/sassguide/install.html ruby<em>安装</em> 因为sass依赖于ruby环境,所以装sass之前先确认装了ruby。先导官网下载个ruby 在<em>安装</em>的时候,请勾选Add Ruby executables to your PATH这个选项,添加环境变量,不然以后使用编译软件的时候会提示找不到ruby环境
安装mysql初始化失败
root@bigdata-159:mysql# ./bin/mysqld -- defaults-file=/etc/my.cnf --initialize --user=mysql./bin/mysqld: error while loading shared libraries: libaio.so.1: cannot open shared object file: No such file...
pip安装模块失败
此情况只用于网络不畅的<em>安装</em>模块背景: 总出现红色的 Could not find a version that satisfies the requirement pymongo(from version:) 你可能会遇到下面这样的情况: 是因为网络的问题,要使用国内的镜像源来加速 解决办法: 你需要的是在你的命令行下面添加一句 例如:原本执行的命
InstallUtil安装服务失败
在初始化<em>安装</em>时发生异常: System.IO.FileNotFoundException: 未能加载文件或程序集“file:///C:\Users\**\Documents\Visual”或它的某一个依赖项。系统找不到指定的文件   解决方法: 1.右键以管理员方式运行CMD 2.使用CD命令定位到**.exe所在目录 3.C:\Windows\Microsoft.NET\Framew
安装vs2010失败
无法<em>安装</em>.net framework 4.0     问题解决:  在网上看到很多人同样的问题,有些甚至要重新<em>安装</em>操作系统,大多是<em>安装</em>了简化版本的操作系统引起的。  问题产生原因:看了事件日志,总于找出来了,问题在注册表 解决办法如下:  1  在运行里键入“regedit”  2 在注册表里的HKEY_LOCAL_MACHINE\SOFWARE\  Microsoft\ I
win7安装vs2012失败
win7<em>安装</em>vs2012<em>失败</em>。提示WebDeploy/WebDeploy_x64.msi 无效驱动器,无法<em>安装</em>。   网上搜索到解决办法:   第一关闭杀毒软件。   第二把系统时间调整到7月(因为vs2012好像打什么补丁了)。   第三在vs<em>安装</em>界面现在从网络下载。   然后自己尝试<em>安装</em>成功。
安装github失败问题
这两天在下载gitub客户端的时候遇到了问题,尽管我已经翻墙了,但是在下载<em>安装</em>github客户端时,总是下载到一半就<em>失败</em>了,反反复复几次,让人心烦。经过反复操作,结合几个网友的方法,终于能够下载下来。为了免去麻烦,我将下载的github for windows打包存在云盘中,大家可以先下载试试,如果下载的不可行 再使用下面的方法。下载地址:http://pan.baidu.com/s/1qXYpw
安装eclipse插件失败
一。问题   1.<em>安装</em>eclipse插件<em>失败</em>,打不开Eclipse      解决: a.删除整个目录/eclipse/configuration/org.eclipse.update/,重启Eclipse                  b 、在启动Eclipse时带上 -clean参数  如:d:/eclipse/eclipse.exe -clean  c 、 如果Eclipse启动找不到插件了,解决办法: 在/configura
解决安装gevnet失败
用pip install gevent==1.0.1时,一直<em>失败</em>。错误     14 warnings and 1 error generated.     error: command 'cc' failed with exit status 1 查了下,用以下命令<em>安装</em>成功 CFLAGS='-std=c99' pip install gevent==1.0.1
apt-get安装总是失败
apt-get clean 删除 /var/cache/apt/archives下的文件
mac终端安装homebrow失败
mac终端<em>安装</em>homebrow很简单 敲入此行命令即可 /usr/bin/ruby -e "$(curl -fsSL https://raw.githubusercontent.com/Homebrew/install/master/install)" 但若<em>安装</em><em>失败</em>,迟迟不出现installation successful, 只进行到这一步 HEAD is now at 75d0321
阿里云服务器安装数据库失败
最近笔者在阿里新购了一台1g1核的Windows server 2008R2服务器,无奈ssql2014怎么都装不上。 首先排除了系统不支持的原因,因为笔者在腾讯云也有一台相同配置的服务器,也是装的ssql2014。 耗时一天,终于让笔者找到了问题,阿里云的服务器默认是没有虚拟内存的,所以一直都装不上。设置好虚拟内存就好啦
安装docker失败记录
安装 magenta 失败:rtmidi
部分报错信息:   src/RtMidi.cpp:1101:28: fatal error: alsa/asoundlib.h: No such file or directory   compilation terminated.   error: command 'gcc' failed with exit status 1      -----------------------...
安装tesseract_ocr失败解决方案
<em>安装</em>tesseract_ocr<em>失败</em>解决方案问题是缺少Microsoft Visual C++ 14.o is requeired直接去给的网址 http://landinghub.visualstudio.com/visual-cpp-build-tools 选择一个版本下载<em>安装</em>在<em>安装</em>Mircosoft 的时候报错需要。Net Framework4.5.1或更高的版本 所以直接<em>安装</em>.Net Fram
安装CE6.0SDK失败(转)
前几天一直在测试VS2005下WinCE6.0中文模拟器的使用,基本上没有问题了。今天便在VS2008中<em>安装</em>了一下WinCE6.0中文模拟器的SDK,又遇到了一些小问题,贴出来跟大家分享一下,也算是对单机搭建WinCE开发环境的一个补充。 第一次<em>安装</em>时,一路默认,开始一切正常,到<em>安装</em>快完成的时候出现了状况,先后出现了下面的两个提示,点完OK后就Roll Back了。
Pyswat安装pillow失败
single version externally managed compile failed 解决方案: 1)升级pip:python -m pip install –upgrade pip 2)重新<em>安装</em>pillow库:pip2 install pillow即可
安装pip失败解决方法:
解决pip<em>安装</em><em>失败</em>方法 问题描述 下列软件包有未满足的依赖关系: python-pip : 依赖: python-pip-whl (= 8.1.1-2) 但是 8.1.1-2ubuntu0.4 正要被<em>安装</em> 依赖: python:any (&amp;lt; 2.8) 依赖: python:any (&amp;gt;= 2.7.5-5~) 推荐: python-all-dev (&amp;gt;= 2.6) 但是它将不会被安...
安装oracle数据库失败问题
其他服务可以装上,但就在装数据库的时候,出现ora-12571:TNS:包写入程序<em>失败</em>rn已经试过7,8次了都如此啊,请达人帮忙。
安装mysql server失败
1: Action 20:48:27: INSTALL. 1: 1: MySQL Server 5.7 2: {F08E9C75-A42E-4962-8760-4CBD9CF35D7A} 1: Action 20:48:27: FindRelatedProducts. Searching for related applications 1: Action...
VS2008安装KB948127失败
因为老是出现fatal error LNK1000: Internal error during IncrBuildImage,又不想改属性为不启用增量链接,所以想打补丁KB948127解决这个问题。rn补丁地址:http://code.msdn.microsoft.com/KB948127rnrn但是<em>安装</em>时出现了如下错误:rn此计算机上没有<em>安装</em>本软件更新支持的产品。单击“取消”退出<em>安装</em>程序。rn如图所示:rn[img=http://hi.csdn.net/attachment/201007/22/105857_1279778757ytC5.png][/img]rnrnrn环境:rnWin7 + VS2008rnrnVS的关于信息:rnMicrosoft Visual Studio 2008rn版本 9.0.21022.8 RTMrnMicrosoft .NET Frameworkrn版本 3.5 SP1rnrn已<em>安装</em>的版本: EnterprisernrnMicrosoft Visual Basic 2008 91994-270-7643564-60673rnMicrosoft Visual Basic 2008rnrnMicrosoft Visual C# 2008 91994-270-7643564-60673rnMicrosoft Visual C# 2008rnrnMicrosoft Visual C++ 2008 91994-270-7643564-60673rnMicrosoft Visual C++ 2008rnrnMicrosoft Visual Studio 2008 Tools for Office 91994-270-7643564-60673rnMicrosoft Visual Studio 2008 Tools for OfficernrnMicrosoft Visual Studio Team System 2008 Architecture Edition 91994-270-7643564-60673rnMicrosoft Visual Studio Team System 2008 Architecture EditionrnrnMicrosoft Visual Studio Team System 2008 Database Edition 91994-270-7643564-60673rnMicrosoft Visual Studio Team System 2008 Database EditionrnrnMicrosoft Visual Studio Team System 2008 Development Edition 91994-270-7643564-60673rnMicrosoft Visual Studio Team System 2008 Development EditionrnrnPortions of International CorrectSpell™ spelling correction system © 1993 by Lernout & Hauspie Speech Products N.V. All rights reserved.rnrnThe American Heritage® Dictionary of the English Language 第三版 版权所有 © 1992 Houghton Mifflin Company。获得 Lernout & Hauspie Speech Products N.V. 的电子版许可。保留所有权利。rnrnrnMicrosoft Visual Studio Team System 2008 Test Edition 91994-270-7643564-60673rnMicrosoft Visual Studio Team System 2008 Test EditionrnrnMicrosoft Visual Web Developer 2008 91994-270-7643564-60673rnMicrosoft Visual Web Developer 2008rnrnCrystal Reports AAJ6G-K0MSA4K-680002ZrnCrystal Reports Basic for Visual Studio 2008rnrnrnVisual Assist X rnFor more information about Visual Assist X, see the Whole Tomato Software website at http://www.WholeTomato.com. Copyright (c) 1997-2010 Whole Tomato Software, Inc.
CMD命令安装驱动失败
写了一个批处理文件:驱动<em>安装</em>.bat,内容是:rncopy ezusb.sys c:\windows\system32\drivers\rncopy ezmon.sys c:\windows\system32\drivers\rncopy ezusbw2k.inf c:\windows\inf\rn%SystemRoot%\System32\rundll32.exe syssetup,SetupInfObjectInstallAction DefaultInstall 132 ezusbw2k.infrnrnrn其中的三个文件ezusb.sys、ezmon.sys ezusbw2k.inf 与 驱动<em>安装</em>.bat 都在同一目录下。rnrn运行 驱动<em>安装</em>.bat 进行预<em>安装</em>(即硬件还没有连接到电脑),结果显示“<em>安装</em><em>失败</em>”。但是单独右键点击ezusbw2k.inf <em>安装</em>则无任何错误提示。rnrn请高手指点!
安装win2000 失败
我在机器上<em>安装</em>win2000 pro或server ,在复制完文件,重新启动后,检测完硬件的时候键盘的三个灯都亮了,马上又灭了,检测完毕后,让我选择 按 回车 继续<em>安装</em> 或 修复按r 键的时候,死机了,按键盘没有反应;请各位高手指点一二!
安装VC6失败
rnrn 以前我<em>安装</em>了一个VC6.O, 后来在使用的过程中老是出错,怀疑是<em>安装</em>没有<em>安装</em>全,就把它卸载了。最近我又来重装VC6.0,但是发现老装不上,在选择文件夹进行<em>安装</em>后,总是会弹出一个弹出框:rnrn H:\VC6CN\acmboot.exe 发送错误rnrn rn 请大侠指点指点rnrnrn
关于安装dotNetFx40_Full_x86_x64失败
新<em>安装</em>的WIN7 32位系统,GOSHT版的,<em>安装</em>dotNetFx40_Full_x86_x64时提示setup encountered an unexpected error in the package contents.The package will not be installed.Please contact your vendor for a new package
安装Oracle 10g失败
出错日志是:rn[color=#FF0000]严重: 启动 Database Control 时出错rn有关详细资料, 请参阅 E:\oracle\product\10.2.0\db_3\cfgtoollogs\dbca\orcl3\emConfig.log 中的日志文件。rn2010-12-27 15:09:00 oracle.sysman.emcp.EMConfig performrn配置: Stack Trace: rnoracle.sysman.emcp.exception.EMConfigException: 启动 Database Control 时出错rn at oracle.sysman.emcp.EMDBPostConfig.performConfiguration(EMDBPostConfig.java:569)rn at oracle.sysman.emcp.EMDBPostConfig.invoke(EMDBPostConfig.java:181)rn at oracle.sysman.emcp.EMDBPostConfig.invoke(EMDBPostConfig.java:150)rn at oracle.sysman.emcp.EMConfig.perform(EMConfig.java:155)rn at oracle.sysman.assistants.util.em.EMConfiguration.run(EMConfiguration.java:430)rn at java.lang.Thread.run(Thread.java:534)[/color]rnrn很郁闷,装了N多次都没有装上。
安装VC6英文版失败
[img=http://img541.ph.126.net/VMfccZzd3jHpYwbq_mYtZA==/2609273034108853351.jpg][/img]rn[img=http://img541.ph.126.net/c7CroXGybTKzwCI9zY0Ynw==/2609273034108853359.jpg][/img]rn好奇怪
安装MYSQL失败
为什么我<em>安装</em>MYSQL到最后一步最后会出现“Cannot creat Windows service for MYSQL.Error:0”,Start service <em>失败</em>!rn怎么解决这个问题,请各位高手指教下,我在线等候你的回复,谢谢!
安装sql2012 失败 ,请教
我的电脑是 win 7系统,双核 i3 的 , 今天<em>安装</em>上vs2012 成功了 ,怎么<em>安装</em>sql2012 <em>失败</em>了 ,说什么无法<em>安装</em>配置文件 ,谁知怎么<em>安装</em>啊。请教
安装msde时失败
<em>安装</em>msde,<em>安装</em>到一半时,自动退回<em>安装</em>。http://post.zhubajie.com/p/1288573204/9383978.jpg
安装VC++6.0失败什么原因
我在电驴下载的VC++中英文版的压缩文件,解压后<em>安装</em>成功,后来卸载了,第二次<em>安装</em>却没成功,最后一次出现的提示如下,请问是什么原因,谢谢了。rn Windows NT Debug Symbols rnSetup has installed an icon in the Microsoft visual c++6.0tools program group, that will allow you to install a subset of the windows NT system symbols (.DBG) file from you visual c++ CD-ROM. If the symbols are not installed, the visual c++debugger is not always able to determine the context of called function. For easier application debugging, it is strongly recommended that you install these files. See the visual c++ readme for more information. rn
emacs安装yasnippet失败
我把yasnippet-bundle.el放到~/.emacs.d/plugins然后添加了文件~/.emacsrnrn里面内容:rnrn(add-to-list 'load-pathrn "~/.emacs.d/plugins")rn(require 'yasnippet-bundle)rnrn然后重新启动emacs,可是窗口模式的emacs没有增加yasnippet菜单,命令行里面的有了,窗口模式的怎么才能出来菜单呢?
安装vs2010 失败!!!!!
我在<em>安装</em>vs2010 是提示错误rn"Visual Studio setup requires Windows Installer version 3.1 or higher.Please click the link above to download and install Windows Installer 4.5,then restart Visual Studio setup after you have rebooted the computer."rnrn我的电脑<em>安装</em>的是"Windows (R) Installer. V 4.5.6001.22159 "rnrn为什么它老是提示这个错误啦!rnrnrnrn我的系统是:Windows XP Professional 版2002 Service Pack 3rnrnrnrn请问该怎么处理???才能<em>安装</em>vs2010
Linux下安装libncurses5-dev失败
ubuntu13.10 下 <em>安装</em>rn $ sudo apt-get install libncurses5-devrnReading package lists... DonernBuilding dependency tree rnReading state information... DonernSome packages could not be installed. This may mean that you havernrequested an impossible situation or if you are using the unstablerndistribution that some required packages have not yet been createdrnor been moved out of Incoming.rnThe following information may help to resolve the situation:rnrnThe following packages have unmet dependencies:rn libncurses5-dev : Depends: libncurses5 (= 5.7+20090803-2ubuntu3) but 5.9+20130608-1ubuntu1 is to be installedrnE: Unable to correct problems, you have held broken packages.
安装.net framwork3.5失败
[img=https://img-bbs.csdn.net/upload/201804/10/1523363964_88296.jpg][/img]rnrn在线等。。。。。。。。。
安装sql server失败
23:23:40 <em>安装</em>程序配置服务器<em>失败</em>。参考服务器错误日志和 C:\WINDOWS\sqlstp.log 了解更多信息。rn23:23:40 Action CleanUpInstall:rn23:23:40 C:\DOCUME~1\ADMINI~1\LOCALS~1\Temp\SqlSetup\Bin\scm.exe -Silent 1 -Action 4 -Service SQLSERVERAGENTrn23:23:40 Process Exit Code: (1060) 指定的服务未<em>安装</em>。rnrn23:23:40 C:\DOCUME~1\ADMINI~1\LOCALS~1\Temp\SqlSetup\Bin\scm.exe -Silent 1 -Action 4 -Service MSSQLSERVERrn23:23:40 Process Exit Code: (0) rn23:23:40 StatsGenerate returned: 2rn23:23:40 StatsGenerate (0x0,0x1,0xf00000,0x100,2052,303,0x0,0x1,0,0,0rn23:23:40 StatsGenerate -1,Administrator)rn23:23:40 Installation Failed.rn这是为什么老是出这个错误,以前也出过,不过我设置一下C盘的权限就可以装上去,可是这次乍装也装不上了,还有一件事就是我的电脑不能运行QQ,一运行就说程序错误,是不是我的硬有问题而装的sql server呀rn我的硬不能用FDisk分区,如果要分区只能到一个多G的空多了找不到(我的硬盘是80G的)rn再就是用ghost备份系统时如果镜像文件放到ntfs分区下找不镜像文件,在ghost下也找不到,但是占用硬盘空间rn说这些主要是想请大家看看到底是乍回事装上sql server
安装MDAC2.7失败,咋办?
前几天<em>安装</em>了一个财务管理软件,似乎自动把oracle的一些东东装到了硬盘上,结果我的ADO就再也用不了了,重新<em>安装</em>MDAC也不行,把我郁闷的不行。请给为朋友帮帮忙,看看是啥原因,谢谢大家!
mac下安装compass失败
如题:rn系统版本:10.9.4rnruby版本:2.0.0rnsass已经<em>安装</em>,<em>安装</em>compass的时候报错,错误如下:rnERROR: Error installing compass:rnrn ERROR: Failed to build gem native extension.rnrn /System/Library/Frameworks/Ruby.framework/Versions/2.0/usr/bin/ruby extconf.rbrnrnmkmf.rb can't find header files for ruby at /System/Library/Frameworks/Ruby.framework/Versions/2.0/usr/lib/ruby/include/ruby.hrnrnGem files will remain installed in /Library/Ruby/Gems/2.0.0/gems/ffi-1.9.6 for inspection.rnrnResults logged to /Library/Ruby/Gems/2.0.0/gems/ffi-1.9.6/ext/ffi_c/gem_make.outrn哪位大神知道这是什么原因?rn先谢谢了!
安装node-sass失败,解决方法
<em>安装</em>node-sass<em>失败</em>,解决方法 以防忘记,记录一下 解决方法之一 npm set sass_binary_site=https://npm.taobao.org/mirrors/node-sass/
安装mysql失败解决办法
之前有<em>安装</em>过mysql,因为某种原因可能卸载不完整,导致再次<em>安装</em>mysql时<em>失败</em>解决办法: <em>安装</em>mysql服务<em>失败</em>: 首先卸载windows服务: 卸载MYSQL服务一般在cmd窗口下输入X:\mysql<em>安装</em>路径\bin\mysqld-nt --remove 之后卸载mysql。 重新启动。...
安装url-loader失败,解决方法
<em>安装</em>url-loader<em>失败</em> 报错信息 $ npm install url-loader --save-dev npm ERR! Windows_NT 10.0.16299 npm ERR! argv &quot;C:\\Program Files\\nodejs\\node.exe&quot; &quot;C:\\Program Files\\nodejs\\node_modules\\npm\\bin\\npm-c...
安装scrapy模块失败
<em>安装</em>scrapy<em>失败</em> 1.   下载twisted.whl模块到本地。下载地址:https://www.lfd.uci.edu/~gohlke/pythonlibs/(这里有各种python需要的模块)) 2.   选择对应的<em>安装</em>包。本人是python3.6版本,64位电脑,因此选择 3.   <em>安装</em>本地twisted文件到python。本人twisted所在本地地址为:E:\因此,在cmd命令栏中...
pip安装scrapy失败
因为迁移服务器,突然发现项目的爬虫是用的scrapy,但<em>安装</em>环境的时候发现总是<em>失败</em>。查阅了相关文档后发现是需要python3的版本才能<em>安装</em>。 下面这个问题主要是因为使用了python2的pip<em>安装</em>导致的<em>失败</em>。 Command &quot;python setup.py egg_info&quot; failed with error code 1 首先<em>安装</em>python3,博主的环境是centos7,所以使用的是yum...
文章热词 truffle安装 xgboost安装 web3.js安装 python xgboost安装 js ipfs安装
相关热词 android安装assets下的apk失败 c++二维数组传失败 c#重新生成失败 c# 连接蓝牙失败 python教程+chm python教程百家号
我们是很有底线的