QT在创建c++项目运行时出现:编译错误,求人帮忙看看 [问题点数:50分]

Bbs1
本版专家分:0
结帖率 94.74%
Bbs1
本版专家分:0
Bbs1
本版专家分:0
qt 纯c或c++ 项目或者在控制台调试时出现 中文乱码
有些人的强迫症比较严重,比如说写个纯C++<em>项目</em>在<em>qt</em>中,打印个东西,你给我搞乱码,比如cmd命令行和控制台。 如果其实日志信息可以自己封装一系列的库,在vs中,控制台也好输出窗口,还是文件都很方便,但<em>qt</em>你也要去封装一套自己的日志库来方便你打印信息哦。 相对来说,在纯c、c++<em>项目</em>中,咱们的输出信息会多很多,这种方法也很简单,在程序中,开始写上 system(&quot;chcp 65001&quot;...
Qt加入资源文件后出现编译错误
原因很简单。。。 资源文件的命名和路径问题,如资源文件中的图片命名中<em>出现</em>了“-” 只允许文件名中<em>出现</em>数字,字母,下划线 所以,在使用国外软件进行开发的时候务必使用全英的路径和文件命名!!!
Qt入门之基础篇 ( 二 ) :Qt项目建立、编译、运行和发布过程解析
转载请注明出处:CN_Simo。 题解:     本篇内容主讲Qt应用从<em>创建</em>到发布的整个过程,旨在帮助读者能够快速走进Qt的世界。   本来计划是讲解Qt源码静态编译,如此的话读者可能并不能清楚地知道为何要静态编译,所以借此篇内容说明一下原由并为之后文章的学习做准备。   即使本片内容只是在围绕一个小小的HelloWorld程序开展,但还是希望朋友们不要急于求成,“欲速则不达”。
JAVA的编译时错误和运行时错误
1. 要区分编译时错误和<em>运行时</em>错误,就应该先明白什么是编译?什么是运行? 首先,先看一下这张图: 编译期就是将我们写的java源代码交给编译器执行的过程,起翻译的作用,该过程主要对java源代码的语法进行检查,如果没有语法错误,就将源代码编译成字节码文件(即.class文件); 运行期则是将字节码文件(.class文件)加载到内存中交给java虚拟机执行,直到程序执行结束的过程,该过...
java新手,什么情况下发生编译错误,什么情况下发生运行错误!
比如说你把 for 写成了 fot 的话就会产生<em>编译错误</em>。<em>编译错误</em>一般是语法错误 而运行错误是指,在运行期间(此时已经没有<em>编译错误</em>了)产生的错误,比如说,计算 5 / 0 什么的。 <em>编译错误</em>一般是指语法错误,比如说没加分号,少写了括号,这都属于<em>编译错误</em>。 运行错误一般是程序通过编译没有发生错误,但是程序执行的时候遇到了某些阻碍,比如说你要读取一个文本,但是该文本不存在,这就属于运行错
C编译错误,运行错误以及常见问题。
  春招过程中发现的问题,和大家分享一下:(1) <em>编译错误</em>:就是编译器无法进行继续编译的错误,最基本的就是语法错误了,比如语句后面少了;或者 } 不匹配之类的,选择题一般是这样。<em>编译错误</em>可以由编译器检查出来。(2) <em>运行时</em>错误:分为两类:1. 由于考虑不周或者输入错误导致程序异常,比如数组越界访问,除数为0,堆栈溢出等。 2,由于程序设计思路的错误导致程序异常或难以得到预期结果。编译器对<em>运行时</em>错误...
创建 Maven 项目编译出错
Maven <em>项目</em>编译出错以及引入 Tomcat 插件运行出错 maven <em>项目</em>编译不过 引入 Tomcat 插件出错 环境 MyEclipse 8.6.1 Maven 3.3.9 Tomcat 6.0.45 jdk 1.7 错误问题 错误提示: -Dmaven.multiModuleProjectDirectory system property is ...
构建qt项目出现的qmake错误
今天在运行一个简单的Qt<em>项目</em>时,<em>出现</em>了一个
用VS2010建了一个默认的MFC应用程序,编译后出现如下错误。
用VS2010建了一个默认的MFC应用程序,编译后<em>出现</em>如下错误。 1>------ 已启动生成: <em>项目</em>: Test, 配置: Debug Win32 ------ 1> stdafx.cpp 1>c:/program files/microsoft sdks/windows/v7.0a/include/objidl.h(11280): error C2061: 语法错误: 标识符“__R
c语言编译、运行时出现错误
编译时: (1)error: array type has incomplete element type 报错一行的代码为 long long prim(int cost[][],int n,int u) 二维数组作为参数不能这样输入,应输入为 int cost[][max]; 或者 int(*)cost[]; 以下的输入同样不符合规定: int* cost[]; in
编译qt源代码报错原因以及解决方法
编译<em>qt</em>源代码报错原因: 1.源代码路径含有中文字体 2.编译时,源代码找不到路径(No such file or directory) 解决方法: 1.改为英文路径 2.编译源代码时,在<em>项目</em>文件.pro底部加上QT += widgets即可。 百度解答问题2: 在pro里 写 <em>qt</em>+=widgets 表示引入 QtWidget这个module,qmake会在帮你生成make
ccf2017-12-1最小差值 用的c 自己编译通过没问题 到网站上提交就显示编译出错 来看看那有问题[哭][哭]
#include&amp;lt;stdio.h&amp;gt;int main() { int n,a[1000]; int min = 10000; scanf(&quot;%d&quot;, &amp;amp;n); for (int i = 0; i &amp;lt; n; i++) { scanf(&quot;%d&quot;, &amp;amp;a[i]); } for (int i = 0; i &amp;lt; n-1; i++) { for (int j = i ...
JS:《Microsoft JScript 运行时错误: 缺少 '}'》解决方案
今天遇到这样一个问题,“Microsoft JScript <em>运行时</em>错误: 缺少 '}'”,在之前使用DataTable转换成Json数据,并解析Json数据过程中从未<em>出现</em>过此问题,经过测试发现从数据库查询出的数据格式的问题。        由DataTable转换成Json数据,它会将你的数据字段列自动帮你转换成《字段名:""》这样的格式,但是如果你传回的数据为双引号,在转换过程中就会出问题了,
VS2013+Qt项目移植编译出错
之前的一个<em>项目</em>在一台电脑上可以正常编译,但是把这个<em>项目</em>开到另外一个电脑上就不行了,编译不通过; 并且报cmd3错误。 而且包含的Qt的头文集下面都有波浪线,大家知道波浪线的意思就是找不到这个头文件。原来是QT的编译环境配置错了,也就是QTDIR这个宏的位置不对。 打开<em>项目</em>下面对应的这个user文件:QtGuiTest.vcxproj.user: &amp;lt;?xml version=&quot;1.0&quot;...
Android项目编译时出现的各种错误及解决办法
Android<em>项目</em>编译时<em>出现</em>的各种错误及解决办法错误一: Error:Execution failed for task ':app:processDebugManifest'.&amp;gt; Manifest merger failed with multiple errors, see logs   产生原因:   <em>项目</em>SDK(minSdkVersion -targetSdkVersion )与Ma...
C语言中的内存分配方式及常见错误
 C语言中的内存分配方式及常见错误   内存分配方式 首先看一下内存分配方式有哪些,一般来说有以下三种:  (1)从静态存储区域分配。内存在程序编译的时候就已经分配好,这块内存在程序的整个运行期间都存在。例如全局变量,static变量等等。  (2)在栈上<em>创建</em>。在执行函数时,函数内局部变量的存储单元都可以在栈上<em>创建</em>,函
navicat创建oracle触发器出现编译错误
用navicat premium工具连接oracle数据库,<em>出现</em>了一个奇怪的问题,  我<em>创建</em>触发器的语句如下: CREATE OR REPLACE TRIGGER TESTTRIGGER    AFTER INSERT OR DELETE OR UPDATE ON S_BORROW_MESSAGE    FOR EACH ROW    BEGIN    IF INSERTI
【Qt】Qt Creator的安装及创建C项目示例
开发需要,安装了Qt Creator。我电脑装的是Windows10和Ubuntu 16.04 LTS双系统,ARM开发板烧录Ubuntu 16.04系统。下面我将介绍Qt Creator分别在这Windows10和Ubuntu 16.04 LTS系统下的安装流程,及相关配置,并<em>创建</em>C<em>项目</em>示例。其它系统应该相同! 首先介绍在Ubuntu 16.04 LTS系统下安装Qt Creator的流程。 ...
C++编译错误运行时错误
这两天在准备实习,做笔试题时,有的选择题会让选择<em>编译错误</em>还是运行错误,这里把自己找的最简单的理解记一下。 (1) <em>编译错误</em>:就是编译器无法进行继续编译的错误,最基本的就是语法错误了,比如语句后面少了;或者 } 不匹配之类的,选择题一般是这样。<em>编译错误</em>可以由编译器检查出来。 (2) <em>运行时</em>错误:分为两类:1. 由于考虑不周或者输入错误导致程序异常,比如数组越界访问,除数为0,堆栈溢出等。 2,由
Qt Creator创建纯C、c++工程
1、下载新版本: 下载2.4版本的Qt Creator ,新建工程就已经可以<em>创建</em>。 2、新建工程: 对于老版本,linux系统更新开发工具比较麻烦,那么新建Qt空的工程:修改.pro工程文件,添加 :QT-=core gui,然后新建main.c文件及其他文件,添加到<em>qt</em>的工程里面就可以了。 3、好处: 好处是调试、编写,编译都很方便友好。不过对于内核的调试估计还得gdb。
Qt creator创建纯C/C++源代码
Qt creator<em>创建</em>纯C/C++源代码By Xchen 20160707这段时间在学习算法和数据结构方面的知识,所以就牵扯到使用一种IDE编辑代码,由于之前一直使用Qt creator进行GUI程序的编辑,也深深的喜欢上了这个IDE,也许是由于VS的庞大,亦或是因为无需花时间掌握更多的IDE,这就好比生活,爱上了就要专一下去,哈哈哈。下面介绍使用Qt creator进行纯C/C++代码的编写:1
QT编译出错解决方法
cannot find -lGL//Solved the problem by installing the “libglu1-mesa-dev” package. sudo apt-get install libglu1-mesa-dev -y
VS编译程序遇到gl.h很多出错
原因是没有加入windows.h
编译中出现段错误的解决方法
需要考虑一下因素: 1、<em>出现</em>段错误时,首先应该想到段错误的定义,从它出发考虑引发错误的原因。 2、在使用指针时,定义了指针后记得初始化指针,在使用的时候记得判断是否为NULL。 3、在使用数组时,注意数组是否被初始化,数组下标是否越界,数组元素是否存在等。 4、在访问变量时,注意变量所占地址空间是否已经被程序释放掉。 5、在处理变量时,注意变量的格式控制是否合理等。...
QT构建项目时显示qmake错误
  之前这个地方有中文路径,改了就好了,害的我把<em>qt</em>4.4.1卸载了怕冲突
Android studio之启动AVD模拟器异常
启动AVD模拟器异常:cannot launch avd in emulator 错误: Starting emulator for AVD 'new' emulator: ERROR: x86 emulation currently requires hardware acceleration! Please ensure Intel HAXM is properly insta
QT5编译openCV各种出错问题及处理方法
系统为win7(32位),安装QT5.9,新的openCV 3提供的安装程序,不支持VS2010(VC10),所以用QT来编译源码。编译过程中遇到许多问题,某些问题需要重新开始编译,参考了网上许多网友的经验,把整个步骤经过合并和优化,减少重新编译的次数,节省大家的时间。本文主要记录编译过程中,遇到的问题及采取的处理方法,可以为大家安装遇到问题时,提供参考。编译前准备工作:1、下载CMake2、下载...
VS编译错误与链接错误汇总
VS中常见的<em>编译错误</em>与链接错误在MSDN中都有总结地址为:https://msdn.microsoft.com/zh-cn/library/4x3c2e37.aspx
Qt 编译错误(用vs2015编译)
基本表现: 1>InitializeBuildStatus: 1>  正在对“release\filter_meshing.unsuccessfulbuild”执行 Touch 任务。 1>CustomBuild: 1>  MOC meshfilter.h 1>  系统找不到指定的路径。 1>C:\Program Files\MSBuild\Microsoft.Cpp\v4.0\Mic
Qt因代码存在中文导致编译错误的解决方法
  在文件开头加上这句  #pragma execution_character_set(&quot;utf-8&quot;)   然后将文件编码设置为utf-8格式,关掉Qt Createor再重新打开就好了。
qt程序运行,有时候出现内存错误
第一次提示:*** glibc detected *** ./Jammer: free(): invalid pointer: 0x00041340 ***         第二次提示:*** glibc detected *** ./Jammer: corrupted double-linked list: 0x00023860 *** 该提示说明有内存错误。 我本地运行50次,都
字符串统计个数和出现次数
/** * @param args */ public static void main(String[] args) { String str = &quot;sdgfsfsdfewrfdfwg&quot;; // 从键盘接受输入的数据 // 利用HashMap来保存某个字符<em>出现</em>的次数 Map map = new HashMap(); for (int i = 0; ...
总结Unity 初学者容易犯的编译与运行时错误
总结Unity 初学者容易犯的编译与<em>运行时</em>错误
vs2013+QT5.5.0的环境搭建过程和常见错误总结
所有Qt版本下载地址: http://download.<em>qt</em>.io/archive/<em>qt</em>/ 所有Qt Creator下载地址: http://download.<em>qt</em>.io/archive/<em>qt</em>creator/ 所有Qt VS开发插件下载地址: http://download.<em>qt</em>.io/archive/vsaddin/ Qt相关下载大全 http://download.<em>qt</em>.io/ 5
深信服:输入一个字符串,帮忙统计字符串里面的每个单词出现的次数,以及非法单词的次数。非法单词的定义为:包含数字(0-9)的单词
深信服2018秋招笔试题: 输入一个字符串,<em>帮忙</em>统计字符串里面的每个单词<em>出现</em>的次数,以及非法单词的次数。非法单词的定义为:包含数字(0-9)的单词 输入一个字符串,长度小于1000,输入的字符仅包含(0-9,a-z,A-Z, . , : ! )及空格。 输出按单词的字母进行排序,每行为 : 单词    单词<em>出现</em>次数 最后一行输出非法单词个数 实例1: 输入: wow! Is won...
Debug关于线程问题
请大家<em>帮忙</em>解决一下,是关于线程同步的问题,我想了很久,问题是<em>运行时</em><em>出现</em>白屏
运行QT工程时显示控制台
运行QT工程时显示控制台
总结Unity 初学者容易犯的编译与运行时错误(第二部分)
总结Unity 初学者容易犯的编译与<em>运行时</em>错误(第二部分) - 刘老师讲Unity - 51CTO技术博客 http://liuguozhu.blog.51cto.com/9142031/1691362/ 文章 原始出处 、作者信息和本声明。否则将追究法律责任。http://liuguozhu.blog.51cto.com/9142031/1691362     
Qt系列 :用MSVC2015编译常见编译错误及解决方案
首先声明本人使用的Qt版本是<em>qt</em>-msvc2015_64-5.6.1, Visual Studio版本是VS2015(其实感觉Qt版本对问题的影响不大。问题:本人最近在用Qt做一个<em>项目</em>的时候需要用到Matlab中的函数,于是想到了用Qt与Matlab的混合编程,即将Matlab的函数用VS2015的MSVC2015编译成动态链接库,然后再将其嵌入Qt程序中。具体流程可参照Qt5.9与Matlab2...
用VS2010编译C++项目出现这样的错误:
LNK1123: 转换到 COFF 期间失败: 文件无效或损坏  解决方法: 1、搜索C盘下的cvtres.exe,结果得到类似这样的列表: C:\Program Files\Microsoft Visual Studio 10.0\VC\bin C:\Windows\winsxs\x86_netfx-cvtres_for_vc_and_vb_b03f5f7f11d50a3a_
vs2010 下 当前项目调试编译失败时,设置不启动上一次成功的实例
vs2010 下 当前<em>项目</em>调试编译失败时,设置不启动上一次成功的实例
在windows下的qt5.7.1 的纯C或C++项目命令行中文乱码、无法编译等问题解决
在windows下的<em>qt</em>5.7.1 的纯C或C++<em>项目</em>命令行中文乱码问题,可能会<em>出现</em>编译各种繁体字或者杂乱的文字。这是由于没有设置好字体的缘故。        只需在菜单栏找到选项->文本编辑->文件编码将原来的格式改为DB2312或者UTF-8修改好后重启软件,多试几次没问题的!如下图所示:        在windows下的<em>qt</em>5.7.1 的纯C或C++<em>项目</em>无法编译问题的解答。问题
c语言常见编译错误
: error: field 'cdedv' has incomplete type 原因:有的结构体变量找不到定义,因为内核版本的差异有类找不到定义的,坑爹是struct class_device,我编译通不过.: struct my_dev {  char *name;  struct my_err_cdedv cdedv;   struct cdev cdev;  };
vs下qt混合编译错误:MOC问题
<em>编译错误</em>: 1&amp;gt;alpainteditem.obj : error LNK2001: 无法解析的外部符号 &quot;public: virtual struct QMetaObject const * __cdecl ALPaintedItem::metaObject(void)const &quot; (?metaObject@ALPaintedItem@@UEBAPEBUQMetaObject@@XZ)...
QT创建Android下的lib时出现编译错误
报下面的错,无法进行编译 Internal Error: Could not find .pro file. Error while building/deploying project untitled11 (kit: Android for armeabi (GCC 4.8, Qt 5.4.0)) When executing step “Build Android APK”解决办法:
使用PyCharm编译python常见错误
1】bs4.FeatureNotFound: Couldn’t find a tree builder with the features you requested: html_parser. Do you need to install a parser library?处理 1:修改bs4的版本 2:修改语法    html = BeautifulSoup(res, 'lxml') ...
CAD-vba开发中VBA“找不到工程或库”错误解决方法
CAD-vba开发中VBA“找不到工程或库”错误解决方法,解决vba开发中的难题
qt例子不能运行,qt编译错误,qmake不能呢运行;error while building deploying解决
<em>qt</em> creator报错error while building deploying project在进行<em>qt</em> creator编译<em>qt</em>工程时,报出错误:error while building deploying project。还可能<em>出现</em>不能运行qmake的储物提示这种情况<em>出现</em>在我打开过去的工程时,而新建的工程却没有<em>出现</em>这个错误。下面给出解决方案:1.在报错工程打开情况下,点击<em>qt</em> creator
make编译QT程序出现如下报错
/usr/local/qwt-6.1.0/lib/libqwt.so: undefined reference to `QSvgGenerator::~QSvgGenerator()'/usr/local/qwt-6.1.0/lib/libqwt.so: undefined reference to `QSvgGenerator::setTitle(QString const&amp;amp;)'/usr...
职场秘笈:求人办事厚黑学.txt
历史最傻<em>求人</em>法--千万别犯这个缺  大多数人骨子里少不了古道热心肠,朋友有难,必两肋插刀,或者人家实在求到自己头上,磨不开面子也就硬着头皮上了。只是有的人不知道缺根筋还是怎的,<em>求人</em>的法子总让人心里不爽,能帮的也懒得帮了。  给枣型选手  “忘了在什么场合认识的那家伙了,关系很一般。他倒是很有心‘经营友情’的样子,隔上两三个月就会打来个电话叙叙旧,或者约个时间吃顿饭什么的。慢慢地我摸出了一个规律,其
关于Qt创建项目后只有.pro文件问题的解决
前言:由于课设要求,要实现界面,不想用原来学的不太好的MFC,于是选择了自学Qt,关于Qt的下载网上都有教程,在此不多提了,在<em>创建</em>文件的过程中,遇到了一个众说纷纭的答案,就是<em>创建</em>完文件后<em>项目</em>下面只有一个.pro文件(但在<em>项目</em>文件家里面是有各种cpp文件的)。在此我找到了解决方案,为了方便理解,下面给出相关截图。1、<em>创建</em><em>项目</em>注意:下面这一步可以根据自己的需要选择相关的Kits,实在不知道怎么弄的可以...
eclipse建立c语言项目遇到的错误处理
这个错误说没有找到gcc,需要安装MinGW,实际上如果有其他交叉编译器应该也可以的,只要是有gcc,g++这2个可执行文件就行,要把路径设置正确,然后重新建立一个<em>项目</em>,原先不行的删除掉。 上面的图就是路径,可以看到MinGW的路径在C:\上面的图就是选择tool chain的界面建立的过程中又遇到symbol could not resolve 错误 这里的解决办法就是把symbol is
Hadoop几本相关经典学习书籍打包上传
Hadoop经典学习数据 打包上传,包括: concepts+techniques-中英文版 Hadoop MapReduce Cookbook Hadoop集群与安全 Hadoop技术内幕:深入解析MapReduce架构设计i与实现原理 Hadoop技术内幕:深入解析YARN架构设计与实现原理 PrinciplesofDataMining
黄聪:visual studio 2017编译运行出现脚本发生错误等问题如何解决?
升级VS2017后,编译运行程序会<em>出现</em> /Community/Common7/IDE/PrivateAssemblies/plugin.vs.js 错误 先说VS2017-15.6.1跟旧版本IE的兼容问题。 首先我的IE比较旧,是IE9.0.8112,这个主要是为了在开发时测试页面、JS脚本跟旧版本IE的兼容及显示问题的。但是IE跟JS之间一直是比较“暧昧”的,MS一遍在推广自己的JS架构,...
NYOJ-201-作业题
ACM模版描述小白同学这学期有一门课程叫做《数值计算方法》,这是一门有效使用数字计算机求数学问题近似解的方法与过程,以及由相关理论构成的学科……今天他们的Teacher S,给他们出了一道作业题。Teacher S给了他们很多的点,让他们利用拉格朗日插值公式,计算出某严格单调函数的曲线。现在小白抄下了这些点,但是问题<em>出现</em>了,由于我们的小白同学上课时走了一下神,他多抄下来很多点,也就是说这些点整体连线
Qt Creator创建C++源代码工程
Qt Creator <em>创建</em>阅读C++源代码工程
编译错误运行时错误的区别
<em>编译错误</em>跟<em>运行时</em>错误的区别: 编译不通是没法生成class可执行文件的。但是运行错误时已经通过编译,生成了class可执行文件,在执行后<em>出现</em>的问题。   <em>编译错误</em>是jdk自定义的语法检查,如果你的代码有语法错误的话,编译不是会通过的。例如:int a=&quot;a&quot;;它会<em>出现</em>红色提示,&quot;不能将字符类型赋值给int 类型&quot;; <em>运行时</em>错误是你的代码逻辑有问题,例如使用了空对象,强制类型转换啊。例如:L...
Oracle 警告: 创建的触发器带有编译错误 错误的赋值变量
 Oracle 警告: <em>创建</em>的触发器带有<em>编译错误</em> 错误的赋值变量这可真是很难解决啊 我查了很多资料都不能解决呢添加自增字段的功能,所以必须要在sql*plus下用sql语句<em>创建</em>,可通过序列+触发器间接实现:SQL> CREATE SEQUENCE FileID_sequence   2  INCREMENT BY 1  3  START WITH 1  4  NOM
问题项目完整版
请大家<em>帮忙</em><em>看看</em>这个问题<em>项目</em>,,找到解决的方法
常见的vc++编译错误 及解决方法
常见的vc++<em>编译错误</em>  (2011-05-26 11:11:54 ▼ 标签:  it   1、fatal error C1010: unexpected end of file while looking for precompiled header directive。 寻找预编译头文件路径时遇到了不该遇到的文件尾。
keil5 断言编译错误
.\Objects\JK_fight_control.axf: Error: L6218E: Undefined symbol assert_param问题:\ \ JK_fight_control对象。axf:错误:L6218E:未定义的符号断言param(从错误中引用)。解决办法:1.“MicroLib并不支援assert(),所以才会<em>出现</em>错误讯息”,原来原工程使用了微库,在target中钩掉...
出现一个不知道的编译错误 高手帮忙看看!
请问一下这个<em>编译错误</em>是什么意思?rnrnrnrn链表练习.cpprng:\my project\my c++\数据结构\链表练习\链表练习\链表练习.cpp(167) : warning C4700: 使用了未初始化的局部变量“A”rn正在链接...rn链表练习.obj : error LNK2019: 无法解析的外部符号 "public: __thiscall linklist::~linklist(void)" (??1linklist@@QAE@XZ),该符号在函数 "void __cdecl mycreat(class linklist)" (?mycreat@@YAXVlinklist@@@Z) 中被引用rn链表练习.obj : error LNK2019: 无法解析的外部符号 "public: bool __thiscall linklist::finditem(int)" (?finditem@linklist@@QAE_NH@Z),该符号在函数 "bool __cdecl myfind(class linklist)" (?myfind@@YA_NVlinklist@@@Z) 中被引用rnG:\my project\my c++\数据结构\链表练习\Debug\链表练习.exe : fatal error LNK1120: 2 个无法解析的外部命令
qt工程出现Makefile文件的内容有误
例如这种:解决办法:点击构建-&amp;gt;执行qmake,重新生成Makefile即可。
linux c/c++ 编译没错,运行出错
问题记录- 1.当glibc detected *** free(): invalid next size (normal)<em>出现</em> http://blog.csdn.net/mociml/article/details/6286311  2. 段错误:smallbin double linked list corrupted http://blog.csdn.net/shaochat/a
新建的vs项目,在debug调试时,断点不可用时的解决方案
(1)<em>项目</em>-〉属性-〉配置属性-〉C/C++-〉常规-〉调试信息格式,这里不能为“禁用”。 (2)<em>项目</em>-〉属性-〉配置属性-〉链接器-〉调试-〉生成调试信息,这里设为“优化以便于调试 (/DEBUG)”。
QT + vs 运行的项目出现控制台的解决办法
我们写dome或者做<em>项目</em>时,有时有UI界面时,就不想运行控制台, 这种最好的方式就是在开始建工程时,就不要选Console, 如果是选择了后面有什么处理方法呢?需要进行两步的处理。1.在需要启动的<em>项目</em>右键 -> 属性 -> 系统 -> 子系统 选择windows 这里原来应该默认的是console2.在需要启动的<em>项目</em>右键 -> 属性 -> 高级 -> 入口点 输入 mainCRTSta
求人办事送礼技巧
送礼既然是一门艺术,自有其约定俗成的规矩,送给谁、送什么、怎么送都很有奥妙,绝不能瞎送、胡送、滥送。根据古今中外一些成功的送礼经验和失败的教训,起码我们应该注意下述原则:   利礼相关,先礼后利,有礼才有利,懂得这点,<em>求人</em>公关易于反掌。   古人云:衣人之衣者,怀人之忧。意思是说,穿了别人的衣服,怀里就会装着别人的心事或隐忧。换句话说,收下了别人送来的礼物,就得为别人办事。所以,要想求...
关于编译报错 语法错误 : “L_TYPE_raw” 的一个原因
最近在将CSmtp类添加到个人工程中时,编译遇到了 语法错误 : “&amp;lt;L_TYPE_raw&amp;gt;” 报错。但是测试demo跑的好好的。 看报错定位是其自带的MD5类中的头文件的中的一行成员函数代码。猜测是因为函数名是单个字母造成的,F,G,H,I等函数,遂修改为Ffunc,Gfunc,Hfunc,Ifunc。 编译通过。...
qt创建C++工程
Qt <em>创建</em>C++工程
关于在OJ中常见的错误
(1)Wrong Answer 答案错误 一般是题意理解错误或是没有考略全面,导致有些情况答案错误。 (2)Compile Error <em>编译错误</em> 语法错误或语音类型跟头文件不符合,或某个类型名没有定义。 (3)Runtime Error <em>运行时</em>出错 实际情况中一般都是数组太小,再者就不清楚了。 (4)Output Limit Exceed 输出超限制 ...
QT编辑时不能包含中文路径
刚开始学习QT,一路狂点NEXT后,肯定要来一个HELLO压压惊。 桌面新建工程,点击编译,发现提示错误,百思不得其解,看了看警告,CAN NOT FIND FILE .......,然后是我的中文电脑用户名,久病成良医,将工程挪至纯英文路径下,编译OK,确定是中文路径的问题,问题解决。 分享第一步学习成果:
VS编译错误汇总(持续更新中。。。。。)
问题一:VS解决error C2664: “DWORD GetCurrentDirectoryW(DWORD,LPWSTR)”: 无法将参数 2 从“char [260]”转换为“LPWSTR” 解决办法:在<em>项目</em>-》属性-》配置属性-》常规-》字符集中,将当前<em>项目</em>的字符集选项改为使用多字节字符集。(一般VS默认的字符集为Unicode字符集) 参考网站:https://blog.csdn.ne...
项目"输出中文乱码的问题">Qt creator的"纯c/c++项目"输出中文乱码的问题
1.解决方法一: 编辑->选择编码->utf8改为GBK->按编码重新载入 此时你会发现原本的中文变成乱码了,将乱码去掉,写上新的中文,此时run一下就没有乱码了。 这个方法比较适合代码还没开始写或代码中的中文量不多的场合。 2.解决方法二: .pro文件中有一行: CONFIG -= <em>qt</em> 把它去掉,然后老老实实用qDebug()来输出吧! 如果原来用cout的可以直接查
C/C++ 常见编译错误及解决办法
1、outside of class is not definition You have semicolons (;) at the end of all your function definitions making the compiler think they're declarations. 在方法定义的后面都误添加上了";",导致编译器认为这仅仅是个声明。  2、w
qt从空项目构建helloworld应用的过程
1.打开软件后点击New Project 2.选择其他<em>项目</em>的<em>qt</em>空<em>项目</em> 3.确定<em>项目</em>名字和保存路径 然后一直按下一步就行。 然后就会<em>出现</em>一个空的QT<em>项目</em>,只有一个EmQT.pro,这是个工程文件表示这个<em>qt</em>工程 4.点击左上角的“文件”,来新建一个C++文件 确定好C++文件名后(如我输入的是main)按下一步,完
qt程序运行时的路径问题
程序<em>运行时</em>的路径是该程序在被调用时的目录假如系统刚启动时,是在/目录处,这时系统启动脚本/etc/rc.local调用/home/root/<em>qt</em>_broadcast_client/<em>qt</em>_broadcast_client程序则目录就是/目录,<em>qt</em>_broadcast_client在调用system(&quot;./run.sh&quot;)时,run.sh的预期目录是/home/root/<em>qt</em>_broadcast_cl...
Excel VBA 提示“找不到工程或库”错误的解决办法
前不久用Excel VBA给采购部做了个“供销存管理系统”,结果在采购部的电脑上运行<em>出现</em>“找不到工程或库”的错误,一般情况下,<em>出现</em>此错误是因为找不到引用工程,或找不到与工程语言对应的引用的对象库,还有就是安装Office精简版也会<em>出现</em>此类错误。   解决方法: 1、在VBE窗口中选择出错的 VBA 工程,快捷键:ALT+F11 2、在 VBA 的主菜单【工具】->【引用】打开引用对话框
编译错误,请帮忙看看
正在通过存储根 C:\Documents and Settings\Administrator\j2mewtk\2.5.2\appdb\temp.DefaultColorPhone24 来运行rnWaiting for KVM...rnRunning with locale: Chinese_People's Republic of China.936rnRunning in the identified_third_party security domainrnConnected to KVMrnConnection received.rnjava.lang.ClassNotFoundException: de/enough/polish/sample/email/EmailMidletrn at com.sun.midp.midlet.MIDletState.createMIDlet(+29)rn at com.sun.midp.midlet.Scheduler.schedule(+52)rn at com.sun.midp.main.Main.runLocalClass(+28)rn at com.sun.midp.main.Main.main(+80)rnExecution completed.rn3379890 bytecodes executedrn28 thread switchesrn1667 classes in the system (including system classes)rn25024 dynamic objects allocated (1202084 bytes)rn2 garbage collections (650056 bytes collected)
qt5运行示例出错
<em>qt</em>5运行示例时出错 昨天刚装上<em>qt</em>5,但今天运行星球示例时,<em>出现</em>以下错误 Project MESSAGE: Warning: unknown QT: qml Project MESSAGE: Warning: unknown QT: quick Project MESSAGE: Warning: unknown QT: positioning Project MESSAGE: Warning:...
VS下为Qt项目运行程序设置ICO图标
1.将.ico图片放入<em>项目</em>目录下:如FireVideo.ico 2.电脑桌面新建一个文本文件,命名为FireVideo.rc 3.打开FireVideo.rc,并写入语句IDI_ICON1           ICON   DISCARDABLE   &quot;FireVideo.ico&quot; 4.将桌面上的FireVideo.rc文件考到<em>项目</em>目录下。 5.打开<em>项目</em>,选中<em>项目</em>-右击-添加现有项,将Fi...
QT编译出错解决
可能出错1: libQtCore.so: undefined reference to `QInotifyFileSystemWatcherEngine::create()'解决办法:vi ./src/corelib/io/io.prifind linux-*:append your cross-toolchain's prefix after it举例:my toolchains's pr...
帮忙看看这个编译错误
Compiler Error C2724rn'identifier' : 'static' should not be used on member functions defined at file scopernrnA static member function was defined at file scope. Static member functions should be declared with external linkage.rnrnThis is a warning when Microsoft extensions are used (/Ze) and is an error when Microsoft extensions are disabled (/Za).rnrnThe following is an example of this error:rnrnclass C rnrn static void func(); rn;rnrnstatic void C::func(); // errorrn
程序编译错误帮忙看看
我弄个含点,直线,矩形,椭圆的程序,但<em>编译错误</em>,弄不来。rn高手救命rn// GraphicView.h : interface of the CGraphicView classrn//rn/////////////////////////////////////////////////////////////////////////////rnrn#if !defined(AFX_GRAPHICVIEW_H__E87962B2_2A30_49E7_B386_4AE78DA5FFC5__INCLUDED_)rn#define AFX_GRAPHICVIEW_H__E87962B2_2A30_49E7_B386_4AE78DA5FFC5__INCLUDED_rnrn#if _MSC_VER > 1000rn#pragma oncern#endif // _MSC_VER > 1000rnrnrnclass CGraphicView : public CViewrnrnprotected: // create from serialization onlyrn CGraphicView();rn DECLARE_DYNCREATE(CGraphicView)rnrn// Attributesrnpublic:rn CGraphicDoc* GetDocument();rnrn// Operationsrnpublic:rnrn// Overridesrn // ClassWizard generated virtual function overridesrn //AFX_VIRTUAL(CGraphicView)rn public:rn virtual void OnDraw(CDC* pDC); // overridden to draw this viewrn virtual BOOL PreCreateWindow(CREATESTRUCT& cs);rn protected:rn virtual BOOL OnPreparePrinting(CPrintInfo* pInfo);rn virtual void OnBeginPrinting(CDC* pDC, CPrintInfo* pInfo);rn virtual void OnEndPrinting(CDC* pDC, CPrintInfo* pInfo);rn //AFX_VIRTUALrnrn// Implementationrnpublic:rn virtual ~CGraphicView();rn#ifdef _DEBUGrn virtual void AssertValid() const;rn virtual void Dump(CDumpContext& dc) const;rn#endifrnrnprotected:rnrn// Generated message map functionsrnprotected:rn //AFX_MSG(CGraphicView)rn afx_msg void OnDot();rn afx_msg void OnLine();rn afx_msg void OnRectangle();rn afx_msg void OnEllipse();rn afx_msg void OnLButtonDown(UINT nFlags, CPoint point);rn afx_msg void OnLButtonUp(UINT nFlags, CPoint point);rn //AFX_MSGrn DECLARE_MESSAGE_MAP()rnprivate:rn CPoint m_ptOrigin;rn UINT m_nDrawType;rn;rnrn#ifndef _DEBUG // debug version in GraphicView.cpprninline CGraphicDoc* CGraphicView::GetDocument()rn return (CGraphicDoc*)m_pDocument; rn#endifrnrn/////////////////////////////////////////////////////////////////////////////rnrn//AFX_INSERT_LOCATIONrn// Microsoft Visual C++ will insert additional declarations immediately before the previous line.rnrn#endif // !defined(AFX_GRAPHICVIEW_H__E87962B2_2A30_49E7_B386_4AE78DA5FFC5__INCLUDED_)rnrnrnrn// GraphicView.cpp : implementation of the CGraphicView classrn//rnrnrnrn#include "stdafx.h"rn#include "Graphic.h"rnrn#include "GraphicDoc.h"rn#include "GraphicView.h"rnrn#ifdef _DEBUGrn#define new DEBUG_NEWrn#undef THIS_FILErnstatic char THIS_FILE[] = __FILE__;rn#endifrnrn/////////////////////////////////////////////////////////////////////////////rn// CGraphicViewrnrnIMPLEMENT_DYNCREATE(CGraphicView, CView)rnrnBEGIN_MESSAGE_MAP(CGraphicView, CView)rn //AFX_MSG_MAP(CGraphicView)rn ON_COMMAND(IDM_DOT, OnDot)rn ON_COMMAND(IDM_LINE, OnLine)rn ON_COMMAND(IDM_RECTANGLE, OnRectangle)rn ON_COMMAND(IDM_ELLIPSE, OnEllipse)rn ON_WM_LBUTTONDOWN()rn ON_WM_LBUTTONUP()rn //AFX_MSG_MAPrn // Standard printing commandsrn ON_COMMAND(ID_FILE_PRINT, CView::OnFilePrint)rn ON_COMMAND(ID_FILE_PRINT_DIRECT, CView::OnFilePrint)rn ON_COMMAND(ID_FILE_PRINT_PREVIEW, CView::OnFilePrintPreview)rnEND_MESSAGE_MAP()rnrn/////////////////////////////////////////////////////////////////////////////rn// CGraphicView construction/destructionrnrnCGraphicView::CGraphicView()rnrn // TODO: add construction code herern m_nDrawType=0;rn m_ptOrigin=0;rnrnrnCGraphicView::~CGraphicView()rnrnrnrnBOOL CGraphicView::PreCreateWindow(CREATESTRUCT& cs)rnrn // TODO: Modify the Window class or styles here by modifyingrn // the CREATESTRUCT csrnrn return CView::PreCreateWindow(cs);rnrnrn/////////////////////////////////////////////////////////////////////////////rn// CGraphicView drawingrnrnvoid CGraphicView::OnDraw(CDC* pDC)rnrn CGraphicDoc* pDoc = GetDocument();rn ASSERT_VALID(pDoc);rn // TODO: add draw code for native data herernrnrn/////////////////////////////////////////////////////////////////////////////rn// CGraphicView printingrnrnBOOL CGraphicView::OnPreparePrinting(CPrintInfo* pInfo)rnrn // default preparationrn return DoPreparePrinting(pInfo);rnrnrnvoid CGraphicView::OnBeginPrinting(CDC* /*pDC*/, CPrintInfo* /*pInfo*/)rnrn // TODO: add extra initialization before printingrnrnrnvoid CGraphicView::OnEndPrinting(CDC* /*pDC*/, CPrintInfo* /*pInfo*/)rnrn // TODO: add cleanup after printingrnrnrn/////////////////////////////////////////////////////////////////////////////rn// CGraphicView diagnosticsrnrn#ifdef _DEBUGrnvoid CGraphicView::AssertValid() constrnrn CView::AssertValid();rnrnrnvoid CGraphicView::Dump(CDumpContext& dc) constrnrn CView::Dump(dc);rnrnrnCGraphicDoc* CGraphicView::GetDocument() // non-debug version is inlinernrn ASSERT(m_pDocument->IsKindOf(RUNTIME_CLASS(CGraphicDoc)));rn return (CGraphicDoc*)m_pDocument;rnrn#endif //_DEBUGrnrn/////////////////////////////////////////////////////////////////////////////rn// CGraphicView message handlersrnrnvoid CGraphicView::OnDot() rnrn // TODO: Add your command handler code herern m_nDrawType=1;rnrnrnvoid CGraphicView::OnLine() rnrn // TODO: Add your command handler code herern m_nDrawType=2;rnrnrnvoid CGraphicView::OnRectangle() rnrn // TODO: Add your command handler code herern m_nDrawType=3;rnrnrnvoid CGraphicView::OnEllipse() rnrn // TODO: Add your command handler code herern m_nDrawType=4;rnrnrnvoid CGraphicView::OnLButtonDown(UINT nFlags, CPoint point) rnrn // TODO: Add your message handler code here and/or call defaultrn m_ptOrigin=point;rn CView::OnLButtonDown(nFlags, point);rnrnrnvoid CGraphicView::OnLButtonUp(UINT nFlags, CPoint point) rnrn // TODO: Add your message handler code here and/or call defaultrn CClientDC dc(this);rn CBrush *pBrush=CBrush::FromHandle((HBRUSH)GetStockObject(NULL_BRUSH));rn dc.SelectObject(pBrush);rnrn switch(m_nDrawType)rn rn case 1:rn dc.SetPixel(point,RGB(0,0,0));rn break;rn case 2:rn dc.MoveTo(m_ptOrigin);rn dc.LineTo(point);rn break;rn case 3:rn dc.Rectangle(CRect(m_ptOrigin,point));rn break;rn case 4:rn dc.Ellipse(CRect(m_ptOrigin,point));rn break;rn CView::OnLButtonUp(nFlags, point);rnrn--------------------Configuration: Graphic - Win32 Debug--------------------rnCompiling...rnGraphic.cpprnD:\SY\新建文件夹\Graphic\Graphic.cpp(16) : error C2143: syntax error : missing ';' before 'private'rnGraphicView.cpprnD:\SY\新建文件夹\Graphic\GraphicView.cpp(168) : fatal error C1004: unexpected end of file foundrnGenerating Code...rn执行 cl.exe 时出错.rnrnGraphic.exe - 1 error(s), 0 warning(s)rnrn
帮忙看看编译错误
无法直接启动带有"类库输出类型"的<em>项目</em>。rnrn若要调试此<em>项目</em>,请转到"<em>项目</em>属性"中"配置设置"下的"调试"选项卡,将"启动操作"设置为"启动外部程序"或"启动URL"。另一种方法是,可以将一个使用此<em>项目</em>引用的非库<em>项目</em>添加到该解决方案中,并将它设置为启动<em>项目</em>。rnrn不知如何解决????rnrn
一个编译错误帮忙看看
print.crn[code=C/C++]rn#include rn#include "print.h"rn rnint printjob()rnrn cups_dest_t *dest;rn int num_options;rn cups_option_t *options;rn int job_id;rn rn job_id = cupsPrintFile(dest->name, "/mnt/test.ps", "test print", num_options, options);rn rn return 0;rnrn[/code]rnrnprint.hrn[code=C/C++] rn #ifndef PRINT_Hrn #define PRINT_Hrn rn int printjob();rn rn #endifrn[/code]rnrndo.crn[code=C/C++]rn#include "print.c"rnrnint main()rnrn return printjob();rnrnrn[/code]rnrn<em>编译错误</em>如下:rngcc -o test do.o print.o `cups-config --cflags --libs`rnprint.o: In function `printjob':rnprint.c:(.text+0x0): multiple definition of `printjob'rndo.o:do.c:(.text+0x0): first defined hererncollect2: ld returned 1 exit statusrnmake: *** [all] Error 1
ATL编译错误帮忙看看!!!!
class _declspec(uuid("AF7D4A4A-E74A-4308-B547-0C84455552F2")) Beeperrn : public CComObjectRootExrn , public CComCoClassrn , public CComObjectrn , public IBeeperrnrnpublic:rn HRESULT _stdcall Beep();rnpublic:rn rnprotected:rn BEGIN_COM_MAP(Beeper)rn COM_INTERFACE_ENTRY(IBeeper)rn END_COM_MAP()rnrn DECLARE_CLASSFACTORY()rn DECLARE_NOT_AGGREGATABLE(Beeper)rn DECLARE_REGISTRY_RESOURCEID(IDR_REG_BEEPER)rn;rnrnOBJECT_ENTRY_AUTO(CLSID_Beeper,Beeper)rnrn代码如上,编译时错误如下rn正在编译...rnbeeper.cpprne:\Program Files\Microsoft Visual Studio 8\VC\atlmfc\include\atlcom.h(2555) : error C2504: “Beeper”: 未定义基类rn f:\zhcen\beeper\beeper\beeper.h(16): 参见对正在编译的类 模板 实例化“ATL::CComObject”的引用rn withrn [rn Base=Beeperrn ]rn生成日志保存在“file://f:\ZHCEN\Beeper\Beeper\Debug\BuildLog.htm”rnBeeper - 1 个错误,0 个警告rn========== 生成: 0 已成功, 1 已失败, 0 最新, 0 已跳过 ==========rnrn????????
DIB.CPP的编译错误帮忙看看
DIB.CPPrnD:\贴图\EffectShow\DIB.CPP(2125) : error C2065: 'CropDIB' : undeclared identifierrnD:\贴图\EffectShow\DIB.CPP(2125) : error C2440: 'initializing' : cannot convert from 'int' to 'void *'rn Conversion from integral type to pointer type requires reinterpret_cast, C-style cast or function-style castrnD:\贴图\EffectShow\DIB.CPP(2139) : error C2065: 'RotateDIB' : undeclared identifierrnD:\贴图\EffectShow\DIB.CPP(2139) : error C2440: 'initializing' : cannot convert from 'int' to 'void *'rn Conversion from integral type to pointer type requires reinterpret_cast, C-style cast or function-style castrnD:\贴图\EffectShow\DIB.CPP(2153) : error C2440: 'initializing' : cannot convert from 'int' to 'void *'rn Conversion from integral type to pointer type requires reinterpret_cast, C-style cast or function-style castrnD:\贴图\EffectShow\DIB.CPP(2167) : error C2440: 'initializing' : cannot convert from 'int' to 'void *'rn Conversion from integral type to pointer type requires reinterpret_cast, C-style cast or function-style castrnD:\贴图\EffectShow\DIB.CPP(2170) : error C2440: 'initializing' : cannot convert from 'int' to 'void *'rn Conversion from integral type to pointer type requires reinterpret_cast, C-style cast or function-style castrnD:\贴图\EffectShow\DIB.CPP(2185) : error C2065: 'FlipHorzDIB' : undeclared identifierrnD:\贴图\EffectShow\DIB.CPP(2185) : error C2440: 'initializing' : cannot convert from 'int' to 'void *'rn Conversion from integral type to pointer type requires reinterpret_cast, C-style cast or function-style castrnD:\贴图\EffectShow\DIB.CPP(2199) : error C2065: 'FlipVertDIB' : undeclared identifierrnD:\贴图\EffectShow\DIB.CPP(2199) : error C2440: 'initializing' : cannot convert from 'int' to 'void *'rn Conversion from integral type to pointer type requires reinterpret_cast, C-style cast or function-style castrnD:\贴图\EffectShow\DIB.CPP(2213) : error C2065: 'ChangeDIBSize' : undeclared identifierrnD:\贴图\EffectShow\DIB.CPP(2213) : error C2440: 'initializing' : cannot convert from 'int' to 'void *'rn Conversion from integral type to pointer type requires reinterpret_cast, C-style cast or function-style castrnD:\贴图\EffectShow\DIB.CPP(2230) : error C2440: 'initializing' : cannot convert from 'int' to 'void *'rn Conversion from integral type to pointer type requires reinterpret_cast, C-style cast or function-style castrnD:\贴图\EffectShow\DIB.CPP(2244) : error C2065: 'ChangeDIBCanvasSize' : undeclared identifierrnD:\贴图\EffectShow\DIB.CPP(2244) : error C2440: 'initializing' : cannot convert from 'int' to 'void *'rn Conversion from integral type to pointer type requires reinterpret_cast, C-style cast or function-style castrnGenerating Code...rnError executing cl.exe.
帮忙看看这个编译错误
error C2859: d:\my proj\vc\ledshow\debug\vc60.pdb is not the pdb file that was used when this precompiled header was created, recreate the precompiled header.rn是什么错误??
QtCreater中使用opencv3.1.0创建项目
由于opencv3.1.0版本较之以前发生了挺大变化,在网上又很少有与QTCreater相关的博文(查询过程真的很痛苦),看似简单的问题自己确在这上面浪费了很多时间。因此记录下来,方便大家(如果按照以下步骤还提示错误的话,可以加我微博,私聊) 给大家推荐一个非常非常棒的网址:http://pan.baidu.com/s/1nuyQHzb(里面有相关QT安装以及vs2015配置等相关内容超级棒)
QT程序编译无错误,运行时出现访问地址冲突
基本上是由于没有在实现文件中定义UI文件的对象,就直接使用ui.setupUi(this);
QT学习笔记1——在vs2017里如何创建QT工程
最近要开始写一个就C++的中国象棋软件,再加上棋子识别,所以需要用到<em>qt</em>,我用的是VS2017+QT5.9+OPENCV3.3.0。 1.安装教程 http://blog.csdn.net/qq_33154343/article/details/78587699 2.在vs2017里如何<em>创建</em>QT工程 https://jingyan.baidu.com/article/20b68a889ca...
Eclipse 导入已有工程出现一堆编译错误
用Eclipse导入现有Adnroid工程,编译后<em>出现</em>很多错误,原来的字符串变成了乱码,字符串左边是一个双引号,右边则没有对应双引号而是一个乱码,因此编译不通过。 由于错误太多,手动修改不太现实。   解决方法: 点击工程右键 -> 属性(properties) -> 资源(resource) -> Text file encoding ,选择Other -> UTF-8 ,再次编译即可。
vue项目运行时报错整理1
vue-cli刚搭建好<em>项目</em>,<em>运行时</em>报错 <em>项目</em>下面报错 error in ./src/components/Hello.vue Syntax Error: Unexpected token { @ ./~/vue-style-loader!./~/css-loader?{"minimize":false,"sourceMap":false}!./~/vue-loader/lib/style-
Vue-cli初始化项目时候出现一些错误笔记
安装:npm install --global vue-cli C:\Users\Administrator&amp;gt;npm install --global vue-cli npm WARN deprecated coffee-script@1.12.7: CoffeeScript on NPM has moved to &quot;co eescript&quot; (n...
VS2015 创建Qt项目
1:<em>创建</em>目录结构 2:新建一个Qt <em>项目</em>,注意以下几个地方 3:默认继续往下选,直到如下图界面 4:点击finish完成<em>项目</em><em>创建</em> 5:配置属性表 完成...
QuaZip的源码编译和生成DLL后的使用总结
因为需要使用到QT进行文件夹的压缩,百度后查到可以使用QuaZip,但是查到的内容没有一篇是详细介绍如何使用源码进行编译的,经过多篇博文的参考实践记录下自己所走过的弯路,让其他后来的读者少走坑路 QuaZIP官网   我下载的是0.7.2的版本 下面开始介绍编译的流程和注意事项: 1.需要依赖的环境QT,QT4或者QT5都可以,我都测试过可以正常编译使用,我查到的好多博文说依赖的zlib库都
创建触发器出现编译错误
大家好,我<em>创建</em>触发器时<em>出现</em><em>编译错误</em>,但又找不到是哪里的问题,想实现的功能就是当对worker表增、删、改时,将用户、时间和操作类型保存到tr_log表中,代码如下:rnSQL> create or replace trigger tr_1rn 2 after insert or delete or update on workerrn 3 beginrn 4 if inserting thenrn 5 insert into tr_log values(user,sysdate,'I');rn 6 elsif deleteing thenrn 7 insert into tr_log values(user,sysdate,'D');rn 8 elsern 9 insert into tr_log values(user,sysdate,'U');rn 10 end if;rn 11 end;rn 12 /rnrnWarning: Trigger created with compilation errorsrnrnSQL> show error;rnErrors for TRIGGER ZHENJIANG.TR_1:rnrnLINE/COL ERRORrn-------- -------------------------------------rn4/7 PLS-00201: 必须声明标识符 'DELETEING'rn2/1 PL/SQL: Statement ignoredrnrnSQL>
C语言的编译过程常见的错误和警告
C语言的编译过程: 一、 C语言编译过程 C语言的编译过程可分为四个阶段: 1、预处理(Preprocessing) 对源程序中的伪指令(即以#开头的指令)和特殊符号进行处理的过程。 伪指令包括:1)宏定义指令;       2)条件编译指令;       3)头文件包含指令; 2、编译(Compilation) 编译就是将源程序转换为计算
数据结构与C语言程序设计2007下载
数据结构与C语言程序设计2007 数据结构与C语言程序设计2007 数据结构与C语言程序设计2007数据结构与C语言程序设计2007 相关下载链接:[url=//download.csdn.net/download/zhouhonggnay/2118526?utm_source=bbsseo]//download.csdn.net/download/zhouhonggnay/2118526?utm_source=bbsseo[/url]
sun--云计算资料入门下载
很不错的云计算入门资料 sun公司云计算的介绍 相关下载链接:[url=//download.csdn.net/download/skyboy_man/2169953?utm_source=bbsseo]//download.csdn.net/download/skyboy_man/2169953?utm_source=bbsseo[/url]
货币兑换小程序  vb.net下载
对货币转换的小程序 用vb.net 编写 相关下载链接:[url=//download.csdn.net/download/gsxhqgf/2187496?utm_source=bbsseo]//download.csdn.net/download/gsxhqgf/2187496?utm_source=bbsseo[/url]
文章热词 设计制作学习 机器学习教程 Objective-C培训 交互设计视频教程 颜色模型
相关热词 mysql关联查询两次本表 native底部 react extjs glyph 图标 qt教程python qt手游开发教程
我们是很有底线的