导入tornado.ioloop 报错AttributeError: module 'curses' has no attribute 'wrapper' [问题点数:20分]

Bbs1
本版专家分:0
结帖率 0%
【Python】Windows系统安装uWSGI报错AttributeError: module 'os' has no attribute 'uname'解决办法
使用pip安装 pip install uwsgi <em>报错</em>:AttributeError: <em>module</em> 'os' <em>has</em> no <em>attribute</em> 'uname' <em>报错</em>说明: 是因为uwsgiconfig.py文件中,os.uname()是不支持windows系统的,platform模块是支持任何系统。 下载uwsgi离线安装 https://pypi.python.org/pypi/u...
Centos安装GateOne问题AttributeError: 'module' object has no attribute 'enable_pretty_logging'解决方案
原因是 tornado版本不对 要求是2.4左右的才能运行GateOne的server 运行如下命令检查tornado 版本 python -c &quot;import tornado; print(tornado.version)&quot; 重新安装tornado 2.4 pip uninstall tornado wget https://pypi.python.org/packages/2d/9a/38...
AttributeError: 'module' object has no attribute 'Process'(关键词:Python/bug/debug/模块/模组)
multiprocessing_simple.py: import multiprocessing def work(): print 'Worker' return if __name__ == '__main__': jobs = [] for i in range(5): p = multip...
Python AttributeError: module 'string' has no attribute 'atoi'
python2 中可以用string.atoi 在python3中会<em>报错</em> 替换的方案是 string.atoi(your_str) 替换为 int(your_str) 这个代码python2和python3都可以运行.
【Python 脚本报错】AttributeError:'module' has no attribute 'xxx'的解决方法
最近在编写Python脚本过程中遇到一个问题比较奇怪:Python脚本正常的,但执行<em>报错</em>”AttributeError: ‘<em>module</em>’ object <em>has</em> no <em>attribute</em> ‘xxx’”,其实是.pyc文件存在问题。 问题定位:查看import库的源文件,发现源文件存在且没有错误,同时存在源文件的.pyc文件。 问题解决方法:删除该库的.pyc文件,重新运行代码;或者找一个可以运...
Windows平台使用pycharm用matplotlib绘图时报错
在Windows平台使用pycharm,在用matplotlib绘图时,<em>报错</em>: AttributeError: <em>module</em> ‘matplotlib’ <em>has</em> no <em>attribute</em> ‘verbose’ 解决办法: 前提: 1.<em>导入</em>正确版本的matplotlib库 2.代码最后调用matplotlibku中pyplot.show()方法 3,无其他低级错误 解决步骤: 1...
Keras深度学习框架学习笔记(3) - AttributeError:’module’ object has no attribute ‘ifelse’错误信息的解决方法
在运行训练卷积神经网络CNN模型进行分类的Python代码过程中,出现如下错误信息: AttributeError:’<em>module</em>’object <em>has</em> no <em>attribute</em> ‘ifelse’ 问题分析:     根据错误信息提示,错误是在theano_backend.py这个文件中发生,可见应该是keras的backend(后端) theano出现了问题,进一步查找发现是k
机器学习实战(python)——kNN问题解析
问:    1、import  kNN找不到路径? 答:    把kNN.py放置python交互式开发环境内    方法:import os               os.getcwd()               如:'F:\\py3.6\\B\\Lib\\idlelib' 问:      2、AttributeError: <em>module</em> 'kNN' <em>has</em> no att
关于pip报错的问题
在python的虚拟环境virtualenv下,安装pip后,执行pip命令总是<em>报错</em>,出现错误如下: AttributeError: <em>module</em> 'lib' <em>has</em> no <em>attribute</em> 'Cryptography_HAS_SSL_ST' 或者如下: ImportError: No <em>module</em> named pip._internal 参照网上经验,pip和pip3不能同时安装,只能...
Tensorflow-报错解决方案
大部分是Api版本问题: AttributeError: '<em>module</em>' object <em>has</em> no <em>attribute</em> 'SummaryWriter' tf.train.SummaryWriter改为:tf.summary.FileWriter AttributeError: '<em>module</em>' object <em>has</em> no <em>attribute</em> 'summ
AttributeError: 'module' object has no attribute 'to_rgba'
-
AttributeError: type object 'IOLoop' has no attribute 'initialized'
安装Anaconda后,在使用jupyter notebook的时候,可能会出现以下<em>报错</em>:AttributeError: type object 'IOLoop' <em>has</em> no <em>attribute</em> 'initialized'原因:tornado版本过高,不支持jupyter notebook.解决方法:conda install tornado=4.5...
AttributeError: 'module' object has no attribute 'main'
首选说一下我的环境吧, ubuntu16.04,anaconda3,里面有两个虚拟环境一个是python3.5(名字叫tensorflow),一个是python2.7,出现了pip可以在python3.5这个环境中可以安装,然而在python2.7这个环境中就不可以安装,出现标题的错误。 首先 可以看一下两个环境下pip version 使用的命令是 pip -V python3.5...
module 'pandas' has no attribute 'rolling_std'
&amp;gt;&amp;gt;&amp;gt; s = pd.Series([5, 5, 6, 7, 5, 5, 5]) &amp;gt;&amp;gt;&amp;gt; s.rolling(3).std() 2 <em>module</em> 'pandas' <em>has</em> no <em>attribute</em> 'ewma' 使用series.ewm(span) 3 <em>module</em> 'pandas' <em>has</em> no <em>attribute</em> 'rolling_mean' ...
ImportError: No module named tornado.ioloop 记录过程
ImportError: No <em>module</em> named <em>tornado.ioloop</em> 记录过程 安装 pycurl    pip install pycurl <em>报错</em> 'curl-config' not found ,需编译 curl  https://gist.github.com/fideloper/f72997d2e2c9fbe66459 sudo apt-get buil
windows下使用Django创建一个基本项目及应用,文末:出现AttributeError:module 'html.parser' has no attribute,django1.11下载地址
Django安装成功后,我们就可以使用django-admin系列命令完成项目及应用的创建。可以通过如下命令创建你的第一个项目。 用cd命令切换到目的文件夹下使用 django-admin startproject project(project为项目名字,可随意更改) 命令创建一个项目,没有<em>报错</em>则创建成功。 可使用dir查看当前目录下的文件,查看是否已经创建完成。同样的目录下创建应用dja...
Tensorflow由于版本问题出现的几种错误及解决办法
1、AttributeError: '<em>module</em>' object <em>has</em> no <em>attribute</em> 'rnn_cell' S:将tf.nn.rnn_cell替换为tf.contrib.rnn 2、TypeError: Expected int32, got list containing Tensors of type '_Message' instead. S:由于tf.conc
TENSORFLOW1.0运行之前版本代码报错解决
1<em>报错</em>位置:.tf.scalar_summary('batch_loss', loss)AttributeError: '<em>module</em>' object <em>has</em> no <em>attribute</em> 'scalar_summary'修改为:tf.summary.scalar('batch_loss', loss)原因:新版本做了调整 2.AttributeError: '<em>module</em>' object <em>has</em>
xadmin遇到的错误
1.'WSGIRequest' object <em>has</em> no <em>attribute</em> 'user' 解决方法: 这是Django版本的问题,1.9之前,中间件的key为MIDDLEWARE_CLASSES, 1.9之后,为MIDDLEWARE。所以在开发环境和其他环境的版本不一致时,要特别小心,会有坑。 需要在settings里面把MIDDLEWARE改为MIDDLEWARE_CLAS
使用pygal绘制世界地图时的两个报错
在使用pygal调用国别码、绘制世界地图的时候,遇到了两个问题,问题一: 使用下方语句调用国别码的时候from pygal.i18n import COUNTRIES程序<em>报错</em>ModuleNotFoundError: No <em>module</em> named 'pygal.i18n'解决: pygal.i18n 已经不存在了,现在已经更改成了 pygal_maps_world, 使用下列代码安装p
python中使用tornado 中post get 请求报错500
-
Tersorflow深度学习入门—— CIFAR-10 训练示例报错及解决方案
Tersorflow深度学习入门—— CIFAR-10 训练示例<em>报错</em>及解决方案, CNN图像分类与识别
TensorFlow不同版本引起的错误
这几天分别基于tensorflow0.11和1.0版本测试,记录下两个版本不同的API, 参考:http://blog.csdn.NET/edwards_june/article/details/65652385 1. AttributeError: '<em>module</em>' object <em>has</em> no <em>attribute</em> 'merge_all_summaries' >>
自然语言处理:词干、词形与MaxMatch算法
自然语言处理中一个很重要的操作就是所谓的 stemming 和 lemmatization,二者非常类似。  它们是词形规范化的两类重要方式,都能够达到有效归并词形的目的,二者既有联系也有区别。    1、词干提取(stemming)  定义:Stemming is the process for reducing inflected (or sometimes derived) words to...
《机器学习实战》实现时遇到的问题
《机器学习实战》第二章k-近邻算法,自己实现时遇到的问题,以及解决方法。做个记录。 1.写一个kNN.py保存了之后,需要重新<em>导入</em>这个kNN模块。<em>报错</em>:no <em>module</em> named kNN. 解决方法:1.将.py文件放到 site_packages 目录下             2.在调用文件中添加sys.path.append("模块文件目录"); import s
使用tensorboard时遇到的问题
使用tensorboard时遇到的问题在《面向机器智能的tensorflow实践》一书中 调用tensorboard的代码为writer=tf.train.SummaryWriter('./my_graph',sess.graph)实际上这个方法已经被停用了,取而代之使用这个方法writer=tf.summary.FileWriter('./my_graph',sess.graph)然后在命令行输
GNU Radio自定义模块在添加到流图后运行报‘module’ object has no attribute错误的解决方法
Richard Bell在 Gnuradio论坛中的回答:One simple thing that can cause this is forgetting to do "sudo ldconfig" after you do your first "sudo make install",Various things can cause this, it's a cryptic error
TensorFlow 1.0后与以前代码不兼容解决-CIFAR-10报错解决
以下<em>报错</em>主要是由于TensorFlow升级1.0后与以前代码不兼容所致。主要转载自CIFAR-10训练例子<em>报错</em>解决,并添加了一些<em>报错</em>解决方法。 AttributeError: ‘<em>module</em>’ object <em>has</em> no<em>attribute</em> ‘random_crop’ 解决方案: 将distorted_image= tf.image.random_crop(reshaped_image, [
uwsgi os没有uname()方法的解决办法
在windows下,安装uwsgi。 从网上下载好uwsgi后,cmd到该解压后的目录中,python setup.py install的时候,<em>报错</em>,说是os没有uname()这个方法。 定位到uwsgiconfig.py文件中,首先import platform后,将os.unam()都改为platform.uname()即可。 os.uname()是不支持windows系统的。platf
TensorFlow学习笔记(九):CIFAR-10训练例子报错解决
以下<em>报错</em>主要是由于TensorFlow升级1.0后与以前代码不兼容所致。 1.AttributeError: '<em>module</em>' object <em>has</em> no<em>attribute</em> 'random_crop' 解决方案: 将distorted_image= tf.image.random_crop(reshaped_image, [height, width])改为: di
Python os-操作系统接口
内容源自:https://docs.python.org/2/library/os.html读写文件参考open() 操作路径参考os.path模块 多文件读入参考fileinput模块 建立临时文件或目录参考tempfile模块 高级别文件目录操作参考shutil模块 os.name操作系统名字,已经注册的有“posix”,“nt”,“os2”,“ce”,“java”,”riscos”|Proce
机器学习实战 笔记 debug(一) kNN
代码 from numpy import * import operator def createDataSet(): group = array([[1.0,1.1],[1.0,1.0],[0,0],[0,0.1]]) labels = ['A','A','B','B'] return group, labels def classify0(inX, dataSet
windows下安装Python库的一系列错误
1. error: Microsoft Visual C++ 14.0 is required. Get it with &quot;Microsoft Visual C++ Build Tools&quot;: http://landinghub.visualstudio.com/visual-cpp-build-tools这个的解决办法是手动下载需要安装的那个包,比如我需要安装的是imread,在https://...
用python做自动化测试--web 自动化测试(1)-Selenium 3.x使用系列问题集
运行 driver=webdriver.Firefox() 运行<em>报错</em>: Exception AttributeError: "'Service' object <em>has</em> no <em>attribute</em> 'process'" in d method Service.__del__ of t 0x028940B0>> ignored selenium.common.excepti
itchat 运行记录
对python不熟悉,跑项目时遇到的一些问题,做个记录。 可以通过本命令安装itchat:pip install itchat 然后运行python文件, <em>报错</em>:AttributeError: ‘<em>module</em>’ object <em>has</em> no <em>attribute</em>’xxx 原来是因为命名py脚本时,不要与python预留字,模块名等相同(所以名字不能叫itchat会有冲突),还要删除已经生成的pyc
针对pycharm导入redis提示No module named redis的解决办法
废话少说,直接上步骤 1.在pycharm主页面点击File,选择Settings,进入设置项 2.在设置页输入Project,查找Project Interpreter(项目解释器) 3.找到redis,双击 4.点击安装包,安装成功后,返回首页,这时不会再提示错误
无法导入 configparser模块,import configparser报错解决办法
在Python2下,需要大写:import  ConfigParser 在PYthon3下,需要小写:import   configparser 如果不是以上原因,其他解决办法: 1、添加环境变量     把python相关文件夹,python文件夹,scripts文件夹加入环境变量中。 2、在lib中找到configparse加入到script中,这样就恢复正常
Python无法连接mongodb数据库,Connection方法不存在
在这周学习python tornado的过程中,接触了新的数据库mongo. 在刚开始连接的过程中,就出现了如下的问题,特此记录一下。 AttributeError: '<em>module</em>' object <em>has</em> no <em>attribute</em> 'Connection'   python版本2.7.11 pymongo版本3.3.0 根据网上的教程,首先<em>导入</em>pymongo,连接第一步的步骤大都
安装python模块psutil
安装psutil模块,可以通过python获取系统的cpu,磁盘,内存,进程,网络等相关信息 下载地址https://pypi.python.org/pypi/psutil/ tar -zxvf psutil-2.1.3.tar.gz cd psutil-2.1.3  python setup.py install 安装是出现<em>报错</em> error: command 'gcc' failed
记录一下平时遇到的乱七八糟的问题---需要不断更新
总说 主要记录一下乱七八糟的东西,以防以后满Internet找,麻烦。 1. 一句话安装tensorflow 2. 安装opencv(python的) 3. AttributeError: <em>module</em> ‘pandas’ <em>has</em> no <em>attribute</em> ‘computation’ 一句话安装各种版本的tensorflow 虽然官网有4种安装方式,并且推荐用ana...
如何解决不能绘制网络模型,报错protobuf
绘制网络模型,总显示这样的错误: AttributeError: 'google.protobuf.pyext._message.RepeatedScalarConta' object <em>has</em> no <em>attribute</em> '_values' 具体内容见下: caffe:>> ./python/draw_net.py ./examples/cifar10/cifar10_quick_train_
Python多进程编程
Python在2.6版本新引进了多进程机制 一、 简介 多进程在Python中是一个包,它支持使用和线程模块类似的API来创建进程。  多进程包支持本地和远程并发,并有高效的GIL锁机制。 因为这些原因,多进程模块允许程序员在指定机器上实现完整的多进程开发,无论是Unix还是Windows. Warning: 这个包的某些功能要求在运行的OS上能实现共享信号量机制, 如果没有这个
使用PyInstaller把PyQt5生产exe时文件报错总结
PyInstaller使PyQt5生成exe执行文件 本文主要总结了PyInstaller使用过程中遇到的问题及解决办法 PyInstaller简介 PyInstaller 是一个用来将 Python 程序打包成一个独立可执行软件包,支持 Windows、Linux 和 Mac OS X。。 —— [ PyInstaller官网 ] PyInstaller打包PyQt的...
TensorFlow升级到1.2.0后带来的问题
1. AttributeError: <em>module</em> 'tensorflow' <em>has</em> no <em>attribute</em> 'batch_matmul' 解决办法:batch_matmul>>>matmul 举例: #out = tf.batch_matmul(outputs, W_repeated) + b out = tf.matmul(outputs, W_repeated) + b
【常见错误】--Nltk使用错误
一、错误类型 AttributeError: <em>module</em> 'nltk' <em>has</em> no <em>attribute</em> 'word_tokenize' 二、情形及解决办法 安装了nltk后,无法使用,<em>报错</em>如上,错误原因是在命名时使用和包一样的名字,导致无法<em>导入</em>。截图如下。 因此,只需修改文件名即可。   ...
tensorflow基本使用中出现的问题及解决方案
tensorflow基本使用中出现的问题及解决方案
pyinstaller打包程序时遇到的一系列问题:AttributeError、No module named和PyQt5
  一、背景介绍     公司使用的python环境是Anconda+Python3.6,64位系统。     有一个py程序主要是图像批量处理相关的,涉及到文件遍历、字符串拼接,于是“自然而然地”在用pyinstaller打包的时候遇到了这个经典<em>报错</em>信息: AttributeError: 'str' object <em>has</em> no <em>attribute</em> 'items' 二、攻克    ...
Python笔记——tensorflow错误笔记:PyCharm下各种模块导入问题和AttributeError:
之前在windows下装了TensorFlow和Anaconda,运行环境是Pycharm. (开始直接在cmd下试的没问题,运行命令:pytho fileneme.py,感觉用着不方便,还是学着用PyCharm吧。不过二者遇到的问题都是一致的,可用同样方法解决) 错误1:模块<em>导入</em>问题 正常情况下,<em>导入</em>各种模块、包时,在 File->Settiings->Project:proj
关于Python爬虫程序scrapy的安装问题
Linux下关于Python爬虫程序scrapy的安装问题 我的安装过程: sudo pip install scrapy 够简单吧。  但是在运行第一个爬虫例子时 scrapy crawl dmoz 出现下面错误: AttributeError: '<em>module</em>' object <em>has</em> no <em>attribute</em> 'Spider' 解决方案如下:  htt
Python之signal模块详解
先简单说一下Signal是啥.(如果想直接使用可以不看)Signal翻译过来中文就是信号- -当然, 本身他就是Linux系统编程中非常重要的概念, 信号机制是进程之间传递消息的一种机制,其全称为软中断信号作用是通知进程发生了异步事件。进程之间可以调用系统来传递信号, 本身内核也可以发送信号给进程, 告诉该进程发生了某个事件.注意,信号只是用来通知某进程发生了什么事件,并不给该进程传递任何数据。接...
多进程---错误解决Attribute Error
多进程---错误解决Attribute Error: Can't get <em>attribute</em> 'long_time_task' on &amp;lt;<em>module</em> '__main__' (built-in)&amp;gt; StackOverflow解决办法 这个问题似乎是多处理器的一个设计特征。请参阅https://bugs.python.org/issue25053。由于某些原因Pool不能始终使用...
Django应用mysql数据库
应用MySQL数据库,用pymysql的设置方法 修改 settings.py中数据库的设置: DATABASES = {   'default': {       'ENGINE': 'django.db.backends.mysql', #数据库引擎 必填       'NAME': ' ',                      #数据库名 必填       'USER':
父与子的编程之旅--EasyGui安装问题解决
在第六章 GUI–图形用户界面中在按照书中方法(把easygui.py放到Python能找到的地方,我放在了Python27下)安装EassyGui后,msgbox不能成功运行。>>>import easygui >>>easygui.msgbox("Hello There!") Traceback (most recent call last): File "", line 1,
使用nmap或者python-nmap时出现错误
在Linux上面使用nmap和python-nmap时均出现以下错误,在网上找解决方案没找到,花了很多时间才解决这个问题。 错误信息如下: shell模式下:Failed to find device eth0 which was referenced in /proc/net/route python中:抛出PortScannerError 解决方案:将nmap更新至最新版本
py-faster-rcnn 训练常见错误
py-faster-rcnn 训练常见错误在训练 py-faster-rcnn 时,常会出现以下错误: TypeError: ‘numpy.float64’ object cannot be interpreted as an index Check failed: error == cudaSuccess (4 vs. 0) unspecified launch failure Attribut
tensorflow的基本用法(一)
一.sessoion session会话: 指定到某个神经网络#encoding:utf-8 import tensorflow as tf import numpy as np ##定义一个向量## ##运算两个矩阵## martrix1=tf.constant([[3,3]]) martrix2=tf.constant([[2],[2]]) product=tf.matmul(matrix1
python 处理csv数据
python中有专门的模块csv来处理: 例如: csv文件的格式 263@ Invalid creation@WISSAM A. ELRIACHY@2010/03/27 02:58:45@2010/04/22 22:41:40@ 例如读取csv的数据打印出来: i
TensorFlow升级到1.0版本的问题
BUG 1. AttributeError: ‘<em>module</em>’ object <em>has</em> no <em>attribute</em> ‘mul’ 解决方案:用tf.multiply替代tf.mulBUG 2. AttributeError: ‘<em>module</em>’ object <em>has</em> no <em>attribute</em> ‘sub’ 解决方案:用tf.subtract替代tf.subBUG 3. AttributeError: ‘m
tensorflow因为版本,需要修改一些方法问题
参考博文: http://blog.csdn.net/lijjianqing/article/details/70155905 http://blog.csdn.net/caimouse/article/details/61208940 http://blog.csdn.net/edwards_june/article/details/65652385 1、AttributeErr
《机器学习实战》——k-近邻算法Python实现问题记录
《机器学习实战》第二章k-近邻算法,自己实现时遇到的问题,以及解决方法。做个记录。 1.写一个kNN.py保存了之后,需要重新<em>导入</em>这个kNN模块。<em>报错</em>:no <em>module</em> named kNN. 解决方法:1.将.py文件放到 site_packages 目录下             2.在调用文件中添加sys.path.append("模块文件目录"); import sys 
小白tensorflow学习中遇到的问题
1.野生图片输入网络 im = matplotlib.image.imread(path) #im=rgb2gray(im) im=np.reshape(im,(1,28,28,3)) im=tf.image.convert_image_dtype(im,tf.float32) #print(im) regularizer=tf.contrib.layers.l2_regularizer(0
networkx使用笔记(三)之好汉篇numpy(2)
python和networkx的三个给力科学计算的基友:numpy、scipy和matplotlib。      numpy擅长数组处理,多维数组的产生与访问,还有庞大的函数库,包括:求和、平均值、方差、最值、排序、矩阵、矩阵类和线性代数模块等。其安装,在第一篇中有说。      matplotlib擅长画图,点和线多形态展示、坐标轴变换等。其安装在第一篇有说。      scipy很强大,
CV2无法找到属性CV_CAP_PROP_FPS
刚刚学习OpenCV的时候,发现获得video的FPS总是不成功,提示无法找到属性CV_CAP_PROP_FPS.最终,在stackoverflow网站上找到了答案。看来,在做opencv的时候,一定要找到相对应的opencv的帮助文档。比如3.2版本的,要参考下面的链接,https://docs.opencv.org/3.2.0/d4/d15/group__videoio__flags__bas...
解决导入matplotlib.pyplot as plt时关于backend、qt的报错
重新安装qt无果之后,用以下办法解决: 一、如果是anaconda虚拟环境,直接用conda更新matplotlib即可: conda install -n tf(虚拟环境名字) matplotlib 二、也可以用pip安装更新: pip install -U matplotlib 参考文献:matplotlib的backend浅析 ...
看 flask 教程中遇到的问题(二)
所有代码都复制完后执行,<em>报错</em> AttributeError: '_AppCtxGlobals' object <em>has</em> no <em>attribute</em> 'db' 原因,全局变量g.db没有定义,在系统启动前增加全局变量即可 @app.before_request def before_request(): g.db = connect_db()
配置 Caffe 可能出现的问题
配置Caffe 可能出现的问题 1.      如果出现如下问题: from caffe.proto importcaffe_pb2 ImportError: No <em>module</em> namedcaffe.proto   则通常说明要配置PYTHONPATH环境变量: Export PYTHONPATH=/usr/lib/python2.7/dist-packages:/home/xx
关于Python验证码识别安装PIL、tesseract-ocr与pytesseract模块的错误解决
0x00:用Python进行验证码识别 安装了 1、PIL 2、tesseract-ocr 3、pytesseract模块 <em>报错</em> File "D:\P\Python\lib\subprocess.py", line 958, in _execute_child startupinfo) WindowsError: [Error 2]
递归神经网络报错has no attribute 'core_rnn_cell'解决方案
调试递归神经网络(RNN)的时候出现如下错误: AttributeError: <em>module</em> 'tensorflow.contrib.rnn' <em>has</em> no <em>attribute</em> 'core_rnn_cell' 顺便问一句,资源分怎么设置免费啊
tensorflow中API版本容错
大部分是Api版本问题: error1、SummaryWriter AttributeError: '<em>module</em>' object <em>has</em> no <em>attribute</em> 'SummaryWriter' tf.train.SummaryWriter改为:tf.summary.FileWriter error2、summeries AttributeError: 'modul
关于某个PyQt5系列教程“'QMainWindow' object has no attribute”的错误修正
原文地址:http://www.cnblogs.com/tkinter/p/5632245.html 一直到运行main程序之前之前都没有什么错误; 但是运行后出错: python IDLE<em>报错</em>: self.pushButton.clicked.connect(MainWindow.firstPyQt5_button_click) AttributeError: 'QMainWindow
tensorboard问题汇总
1、运行时提示:typeError:GetNext() takes 1 positional argument but 2 were given。 是因为tensorflow是1.7或者1.9ban版本,tensorboard是不同版本。 pip install tb-nightly,不能解决问题,安装的是tensorboard 0.4的老版本。 pip install upgrade te...
python 第五(6)章编程练习
Python 2.7.12 (v2.7.12:d33e0cf91556, Jun 27 2016, 15:19:22) [MSC v.1500 32 bit (Intel)] on win32 Type "copyright", "credits" or "license()" for more information. >>> 4.5 and 4.6 4.6 >>> 3.2 and -4.5 -
python 学习笔记 10 -- 正则表达式
本文主要介绍Python中正则表达式的使用,对正则表达式的方法一一举例说明。Hope you would like it !! :)
ubuntu linux 安装 scrapy 及遇到的问题
1. scrapy英文文档网址如下 http://doc.scrapy.org/en/latest/intro/install.html2. 安装流程 pip 安装pythonsudo apt-get install python-pippip install Scrapy 官方安装包安装scrapysudo apt-key adv --keyserver hkp://keyserver.ubunt
关于cv2.cv.Boxpoint()函数出错解决方法
今天使用opencv运行一个脚本,但是出现cv2.cv.BoxPoints()函数有错,提示’<em>module</em>’ object <em>has</em> no <em>attribute</em> ‘cv’ 的错误,找了一些帖,发现最多的解决方法就是说“这是因为opencv3已经没有了cv,只能重新下载opencv2 ; ”,我就纳闷了,有新的版本不用,为什么还要下载旧的版本。有的更是建议“from cv2 import cv as c...
tensorflow 各种报错总结
1. 'list' object <em>has</em> no <em>attribute</em> 'lower' <em>报错</em>如下Traceback (most recent call last): File &quot;H:/FasionAI/MyNet/train.py&quot;, line 27, in &amp;lt;<em>module</em>&amp;gt; train_logits = model.inference(train_batch, BATCH_S...
flask+celery常见问题及解决方法
1、 [root@ansible flask_celery]# celery -A app worker --loglevel=info Traceback (most recent call last):   File "/usr/bin/celery", line 11, in     sys.exit(main())   File "/usr/lib/python2.7/site
Python 报错集锦
1.Python3 <em>报错</em>AttributeError: <em>module</em> 'enum' <em>has</em> no <em>attribute</em> 'IntFlag' Fatal Python error: initsite: Failed to import the site <em>module</em> Traceback (most recent call last): Fil...
Bug处理之执行自己编写代码中出现的AttributeError: ‘XXX’ object has no attribute’xxx’
操作系统Windows10.0; PythonIDE:Pycharm2018.02 Python版本:python3.6(anaconda平台) 自己编写脚本搭建股票数据库 问题描述:自己编写python脚本解决一些数据库搭建过程中的繁琐过程,方便以后重复调用; 编写的类在<em>导入</em>应用时<em>报错</em>AttributeError: ‘XXX’ object <em>has</em> no <em>attribute</em>’xxx’,...
【视觉】关于leaky_relu找不到的问题
error:<em>module</em> 'tensorflow.python.ops.nn' <em>has</em> no <em>attribute</em> 'leaky_relu' 事件:最近在跟着老师学习视觉方面的东西,自己琢磨着行人检测,在搜索资料的时候无意之中看到了yolo,瞬间觉得怎么可以这么牛*,关于yolo的种子已经埋下... 在运行yolo-tensorflow时,遇到了‘leaky_relu’找不到的问题,看了网上的解...
解决allure源码报错
一、背景 python自动化用nose框架中allure生成报告,但是case中有异常抛出会<em>报错</em>(错误信息稍后给出), python 3.5版本 nose配置文件: with-allure=1 logdir=results 二、执行的错误信息: 三、如何修改: 找到源码位置: 修改_parse_tb方法:注释的原来的,下面是修改后的:
使用opencv_python进行视频分析遇到的bgsegm问题
近期在使用opencv_python分析视频过程中总是遇到各种问题,如cv2.cv2的问题、还有使用opencv_python操作视频处理类的需求时总是遇到<em>has</em> no <em>attribute</em> 'bgsegm'等问题。从网上找了但缺少完整的说明,故特地说明下。 遇到<em>has</em> no <em>attribute</em> 'bgsegm'等问题,说明安装的opencv_python版本需要更新了,或者没有安装c
Django2.1.2创建工程后进入admin站点管理的时候报了:WSGIRequest' object has no attribute 'user 的错误
查stackoverflow和CSDN,这是由于Django版本的问题,在1.10之前,中间件的key为MIDDLEWARE_CLASSES;在1.10之后,中间件的key为MIDDLEWARE。 项目的初始配置: MIDDLEWARE_CLASSES = ( 'django.contrib.sessions.middleware.SessionMiddleware', 'dj...
Tensorflow1.0版本与以前函数不同之处
大部分是Api版本问题: AttributeError: '<em>module</em>' object <em>has</em> no <em>attribute</em> 'SummaryWriter' tf.train.SummaryWriter改为:tf.summary.FileWriter AttributeError: '<em>module</em>' object <em>has</em> no <em>attribute</em> 'summaries'
【Tensorflow_DL_Note17】CIFAR10代码使用过程中出现的错误及其解决办法
1.AttributeError: '<em>module</em>' object <em>has</em> no<em>attribute</em> 'random_crop' 解决方案: 将distorted_image= tf.image.random_crop(reshaped_image, [height, width])改为: distorted_image = tf.random_crop(reshaped_image,[heigh...
【Python】收集python2代码转python3遇到的问题
需要把一段py2的代码转为py3,执行后,遇到一个错误就解决一个错误,一般都会有替换方案。 楼主遇到的如下: 1.SyntaxError: Missing parentheses in call to 'print' 所有“print X” 更改为“print(X)” 2. <em>报错</em>:TypeError: 'dict_keys' object is not subscriptable 解决...
wxPython和pyOpenGL在用PyInstaller打包时遇到的若干问题及解决办法
尝试用PyInstaller打包Python代码(使用了wxPython和pyOpenGL)的时候,遇到一系列的问题,汇总一下: 环境: Win7 64-bit, PyInstaller 2.0, Python 2.7.5, wxPython 2.8.12.1, pyOpenGL 3.0.2 问题1:       PyInstaller打包成功,运行dist里生成的ex
vim 自动补全插件YCM 安装 配置
vim 自动补全插件YCM 安装 配置 <em>报错</em> NoExtraConfDetected: No .ycm_extra_conf.py file detected, so no compile flags are available. Thus no semantic support for C/C++/ObjC... 说是找不到 .ycm_extra_conf.py, 所以不支持 c...
python 错误枚举
Python所有的错误都是从BaseException类派生的,常见的错误类型和继承关系看这里 BaseException +-- SystemExit +-- KeyboardInterrupt +-- GeneratorExit +-- Exception +-- StopIteration +-- StopAsyncIteration +--
PaddlePaddle出现module对象没有model属性解决方法
关键字:<em>module</em> model属性 问题描述:利用波士顿房价数据集进行模型的训练和预测时,使用了uci_housing.model(),uci_housing模块封装了该数据集的相关操作,但却报出'<em>module</em>' object <em>has</em> no <em>attribute</em> 'model'错误,<em>module</em>对象没有model属性。 <em>报错</em>代码段: paddle.infer( output...
Django 学习 - 报错/坑爹版本系列
引言 1、目前最佳环境 2、<em>报错</em> - cannot import name RadioFieldRenderer 3、<em>报错</em> - No <em>module</em> named validators 4、<em>报错</em> - The INSTALLED_APPS setting must be a list or a tuple 5、<em>报错</em> - 'WSGIRequest' object <em>has</em> no <em>attribute</em> 'u...
python+TensorFlow常见错误汇总,持续更新中......
==================================== <em>module</em> 'tensorflow' <em>has</em> no <em>attribute</em> 'layers' 解决方法:这时已经安装的tensorflow是0.x的版本,需要重新安装tensorflow 1.0以上的版本(利用.whl安装) ====================================
centos7安装jumpserver遇到的坑
参考安装网址:http://docs.jumpserver.org/zh/docs/step_by_step.html 1、数据库jumpserver授权时:grant all on jumpserver.* to ‘jumpserver’@’%’ identified by “123456”; 2、初始安装jumpserver,生成数据库表结构和初始化数据(./make_migrations...
第三方库(wordcloud为例)调用出现种种问题
刚刚学习了python,想做点小东西练练手,python有很多好玩的东西,turtle库,wordcloud等等一系列我觉得都可以用来练练手并且真的是挺好玩。本来寻思也就十多行代码,肯定一会就能调试完,没想到,真的是我太天真,本来就不怎么会环境,就一通乱搞,最后还得重装,不过可以分享一下,避免大家入坑。 电脑本身有anaconda软件,自带3.6版本的python,前两天刚学习python,我就...
Python3.6.0+opencv3.3.0人脸检测(示例)
网上有很多关于Python+opencv人脸检测的例子,并大都附有源程序。但是在实际使用时依然会遇到这样或者那样的问题,在这里给出常见的两种问题及其解决方法。先给出源代码:(如下)import cv2 import numpy as npcv2.namedWindow("test") cap=cv2.VideoCapture(0) success,frame=cap.read()classifier
tensorboard可视化高级使用
1、Scalar运行程序时,出错,AttributeError: 'SummaryMetadata' object <em>has</em> no <em>attribute</em> 'display_name' 只有graph图像。 后来,发现这是TensorFlow版本问题。由于,之前装的GPU版本是tensorflow (1.3.0rc0),但是运行tensorboard的时候,没有出现scalar,然后试了升级Tens
新版的packaging_tool.py
详情参考 https://mp.csdn.net/postedit packaging_tool.py文件修复pycharm 安装第三方库<em>报错</em>:AttributeError: '<em>module</em>' object <em>has</em> no <em>attribute</em> 'main'
has no attribute ‘translate’的解决方法">关于Python中使用pymysql驱动连接数据库时报"XXX" object has no attribute ‘translate’的解决方法
    最近在使用flask开发时,用了pymysql驱动来连接数据库,但是在使用枚举类型作为数据库条件来对数据库进行查找数据时(如下图):        报出了以下错误:    原因:     数据库中使用的pending的类型为int型,而图中的PendingStatus.Success为枚举型, 与mysql中不一致,导致数据无法写入mysql 解决方法:     修改数据类型, 这里我只在...
Tensorflow使用过程中的问题
Tensorflow使用过程中的问题 版本:1.0.0,for gpu 操作系统:Windows 7 cuda:8.0 cudnn:5.1 Python:3.5 gpu:GeForce GT 720 1. cuda安装后找不到deviceQuery.exe 按照nvdia的官方教程(http://docs.nvidia.com/cuda/cuda-installation-guid...
No Module pymysql,启动容器报错提示缺少pymysql模块
docker容器启动<em>报错</em>,提示缺少pymysql模块,使用docker    run  容器   sh进入容器内安装以下组件后重新安装pymysql, apk add --no-cache gcc g++  python-dev  mysql-dev linux-headers libffi-dev openssl-dev 提示缺少模块首先要在Dockerfile中安装(pip  instal...
Java网络爬虫程序(源程序和数据库文件)下载
能爬取指定网页,并提取网页的Title标签,存入SQL数据库中 相关下载链接:[url=//download.csdn.net/download/eddy521/1499458?utm_source=bbsseo]//download.csdn.net/download/eddy521/1499458?utm_source=bbsseo[/url]
IKAnalyzer中文分词包下载
我在博客中使用的中文分词包,大家也可以去官网上取下 相关下载链接:[url=//download.csdn.net/download/u010370871/5719541?utm_source=bbsseo]//download.csdn.net/download/u010370871/5719541?utm_source=bbsseo[/url]
Dubbox框架搭建的Demo下载
Dubbox框架搭建的Demo,本资源为Maven构建项目,本地测试通过。 相关下载链接:[url=//download.csdn.net/download/yedaoling/8445349?utm_source=bbsseo]//download.csdn.net/download/yedaoling/8445349?utm_source=bbsseo[/url]
文章热词 设计制作学习 机器学习教程 Objective-C培训 交互设计视频教程 颜色模型
相关热词 mysql关联查询两次本表 native底部 react extjs glyph 图标 数据库如何导入课程 超级课程表ios导入
我们是很有底线的