导入tornado.ioloop 报错AttributeError: module 'curses' has no attribute 'wrapper' [问题点数:20分]

Bbs1
本版专家分:0
结帖率 0%
【Python】Windows系统安装uWSGI报错AttributeError: module 'os' has no attribute 'uname'解决办法
使用pip安装 pip install uwsgi <em>报错</em>:AttributeError: <em>module</em> 'os' <em>has</em> no <em>attribute</em> 'uname' <em>报错</em>说明: 是因为uwsgiconfig.py文件中,os.uname()是不支持windows系统的,platform模块是支持任何系统。 下载uwsgi离线安装 https://pypi.python.org/pypi/u...
Centos安装GateOne问题AttributeError: 'module' object has no attribute 'enable_pretty_logging'解决方案
原因是 tornado版本不对 要求是2.4左右的才能运行GateOne的server 运行如下命令检查tornado 版本 python -c &quot;import tornado; print(tornado.version)&quot; 重新安装tornado 2.4 pip uninstall tornado wget https://pypi.python.org/packages/2d/9a/38...
AttributeError: 'module' object has no attribute 'Process'(关键词:Python/bug/debug/模块/模组)
multiprocessing_simple.py: import multiprocessing def work(): print 'Worker' return if __name__ == '__main__': jobs = [] for i in range(5): p = multip...
Python AttributeError: module 'string' has no attribute 'atoi'
python2 中可以用string.atoi 在python3中会<em>报错</em> 替换的方案是 string.atoi(your_str) 替换为 int(your_str) 这个代码python2和python3都可以运行.
【Python 脚本报错】AttributeError:'module' has no attribute 'xxx'的解决方法
最近在编写Python脚本过程中遇到一个问题比较奇怪:Python脚本正常的,但执行<em>报错</em>”AttributeError: ‘<em>module</em>’ object <em>has</em> no <em>attribute</em> ‘xxx’”,其实是.pyc文件存在问题。 问题定位:查看import库的源文件,发现源文件存在且没有错误,同时存在源文件的.pyc文件。 问题解决方法:删除该库的.pyc文件,重新运行代码;或者找一个可以运...
Windows平台使用pycharm用matplotlib绘图时报错
在Windows平台使用pycharm,在用matplotlib绘图时,<em>报错</em>: AttributeError: <em>module</em> ‘matplotlib’ <em>has</em> no <em>attribute</em> ‘verbose’ 解决办法: 前提: 1.<em>导入</em>正确版本的matplotlib库 2.代码最后调用matplotlibku中pyplot.show()方法 3,无其他低级错误 解决步骤: 1...
Keras深度学习框架学习笔记(3) - AttributeError:’module’ object has no attribute ‘ifelse’错误信息的解决方法
在运行训练卷积神经网络CNN模型进行分类的Python代码过程中,出现如下错误信息: AttributeError:’<em>module</em>’object <em>has</em> no <em>attribute</em> ‘ifelse’ 问题分析:     根据错误信息提示,错误是在theano_backend.py这个文件中发生,可见应该是keras的backend(后端) theano出现了问题,进一步查找发现是k
关于pip报错的问题
在python的虚拟环境virtualenv下,安装pip后,执行pip命令总是<em>报错</em>,出现错误如下: AttributeError: <em>module</em> 'lib' <em>has</em> no <em>attribute</em> 'Cryptography_HAS_SSL_ST' 或者如下: ImportError: No <em>module</em> named pip._internal 参照网上经验,pip和pip3不能同时安装,只能...
Tensorflow-报错解决方案
大部分是Api版本问题: AttributeError: '<em>module</em>' object <em>has</em> no <em>attribute</em> 'SummaryWriter' tf.train.SummaryWriter改为:tf.summary.FileWriter AttributeError: '<em>module</em>' object <em>has</em> no <em>attribute</em> 'summ
Tersorflow深度学习入门—— CIFAR-10 训练示例报错及解决方案
Tersorflow深度学习入门—— CIFAR-10 训练示例<em>报错</em>及解决方案, CNN图像分类与识别
AttributeError: 'module' object has no attribute 'to_rgba'
-
AttributeError: type object 'IOLoop' has no attribute 'initialized'
安装Anaconda后,在使用jupyter notebook的时候,可能会出现以下<em>报错</em>:AttributeError: type object 'IOLoop' <em>has</em> no <em>attribute</em> 'initialized'原因:tornado版本过高,不支持jupyter notebook.解决方法:conda install tornado=4.5...
AttributeError: 'module' object has no attribute 'main'
首选说一下我的环境吧, ubuntu16.04,anaconda3,里面有两个虚拟环境一个是python3.5(名字叫tensorflow),一个是python2.7,出现了pip可以在python3.5这个环境中可以安装,然而在python2.7这个环境中就不可以安装,出现标题的错误。 首先 可以看一下两个环境下pip version 使用的命令是 pip -V python3.5...
module 'pandas' has no attribute 'rolling_std'
&amp;gt;&amp;gt;&amp;gt; s = pd.Series([5, 5, 6, 7, 5, 5, 5]) &amp;gt;&amp;gt;&amp;gt; s.rolling(3).std() 2 <em>module</em> 'pandas' <em>has</em> no <em>attribute</em> 'ewma' 使用series.ewm(span) 3 <em>module</em> 'pandas' <em>has</em> no <em>attribute</em> 'rolling_mean' ...
ImportError: No module named tornado.ioloop 记录过程
ImportError: No <em>module</em> named <em>tornado.ioloop</em> 记录过程 安装 pycurl    pip install pycurl <em>报错</em> 'curl-config' not found ,需编译 curl  https://gist.github.com/fideloper/f72997d2e2c9fbe66459 sudo apt-get buil
《机器学习实战》实现时遇到的问题
《机器学习实战》第二章k-近邻算法,自己实现时遇到的问题,以及解决方法。做个记录。 1.写一个kNN.py保存了之后,需要重新<em>导入</em>这个kNN模块。<em>报错</em>:no <em>module</em> named kNN. 解决方法:1.将.py文件放到 site_packages 目录下             2.在调用文件中添加sys.path.append("模块文件目录"); import s
windows下使用Django创建一个基本项目及应用,文末:出现AttributeError:module 'html.parser' has no attribute,django1.11下载地址
Django安装成功后,我们就可以使用django-admin系列命令完成项目及应用的创建。可以通过如下命令创建你的第一个项目。 用cd命令切换到目的文件夹下使用 django-admin startproject project(project为项目名字,可随意更改) 命令创建一个项目,没有<em>报错</em>则创建成功。 可使用dir查看当前目录下的文件,查看是否已经创建完成。同样的目录下创建应用dja...
TENSORFLOW1.0运行之前版本代码报错解决
1<em>报错</em>位置:.tf.scalar_summary('batch_loss', loss)AttributeError: '<em>module</em>' object <em>has</em> no <em>attribute</em> 'scalar_summary'修改为:tf.summary.scalar('batch_loss', loss)原因:新版本做了调整 2.AttributeError: '<em>module</em>' object <em>has</em>
Tensorflow由于版本问题出现的几种错误及解决办法
1、AttributeError: '<em>module</em>' object <em>has</em> no <em>attribute</em> 'rnn_cell' S:将tf.nn.rnn_cell替换为tf.contrib.rnn 2、TypeError: Expected int32, got list containing Tensors of type '_Message' instead. S:由于tf.conca...
xadmin遇到的错误
1.'WSGIRequest' object <em>has</em> no <em>attribute</em> 'user' 解决方法: 这是Django版本的问题,1.9之前,中间件的key为MIDDLEWARE_CLASSES, 1.9之后,为MIDDLEWARE。所以在开发环境和其他环境的版本不一致时,要特别小心,会有坑。 需要在settings里面把MIDDLEWARE改为MIDDLEWARE_CLAS
python中使用tornado 中post get 请求报错500
-
使用pygal绘制世界地图时的两个报错
在使用pygal调用国别码、绘制世界地图的时候,遇到了两个问题,问题一: 使用下方语句调用国别码的时候from pygal.i18n import COUNTRIES程序<em>报错</em>ModuleNotFoundError: No <em>module</em> named 'pygal.i18n'解决: pygal.i18n 已经不存在了,现在已经更改成了 pygal_maps_world, 使用下列代码安装p
针对pycharm导入redis提示No module named redis的解决办法
废话少说,直接上步骤 1.在pycharm主页面点击File,选择Settings,进入设置项 2.在设置页输入Project,查找Project Interpreter(项目解释器) 3.找到redis,双击 4.点击安装包,安装成功后,返回首页,这时不会再提示错误
机器学习实战(python)——kNN问题解析
问:    1、import  kNN找不到路径? 答:    把kNN.py放置python交互式开发环境内    方法:import os               os.getcwd()               如:'F:\\py3.6\\B\\Lib\\idlelib' 问:      2、AttributeError: <em>module</em> 'kNN' <em>has</em> no att
CV2无法找到属性CV_CAP_PROP_FPS
刚刚学习OpenCV的时候,发现获得video的FPS总是不成功,提示无法找到属性CV_CAP_PROP_FPS.最终,在stackoverflow网站上找到了答案。看来,在做opencv的时候,一定要找到相对应的opencv的帮助文档。比如3.2版本的,要参考下面的链接,https://docs.opencv.org/3.2.0/d4/d15/group__videoio__flags__bas...
TensorFlow不同版本引起的错误
这几天分别基于tensorflow0.11和1.0版本测试,记录下两个版本不同的API, 参考:http://blog.csdn.NET/edwards_june/article/details/65652385 1. AttributeError: '<em>module</em>' object <em>has</em> no <em>attribute</em> 'merge_all_summaries' >>
【机器学习】Boost算法(GDBT,AdaBoost,XGBoost)整理
Bagging的原理是从现有数据中有放回抽取若干个样本构建分类器,重复若干次建立若干个分类器进行投票。它的典型应用,就是随机森林。 现在讨论另一种算法:提升(Boost)。 简单地来说,提升就是指每一步我都产生一个弱预测模型,然后加权累加到总模型中,然后每一步弱预测模型生成的的依据都是损失函数的负梯度方向,这样若干步以后就可以达到逼近损失函数局部最小值的目标。 下面开始要不说人话了,我们来详...
Python无法连接mongodb数据库,Connection方法不存在
在这周学习python tornado的过程中,接触了新的数据库mongo. 在刚开始连接的过程中,就出现了如下的问题,特此记录一下。 AttributeError: '<em>module</em>' object <em>has</em> no <em>attribute</em> 'Connection'   python版本2.7.11 pymongo版本3.3.0 根据网上的教程,首先<em>导入</em>pymongo,连接第一步的步骤大都
TensorFlow 1.0后与以前代码不兼容解决-CIFAR-10报错解决
以下<em>报错</em>主要是由于TensorFlow升级1.0后与以前代码不兼容所致。主要转载自CIFAR-10训练例子<em>报错</em>解决,并添加了一些<em>报错</em>解决方法。 AttributeError: ‘<em>module</em>’ object <em>has</em> no<em>attribute</em> ‘random_crop’ 解决方案: 将distorted_image= tf.image.random_crop(reshaped_image, [
使用tensorboard时遇到的问题
使用tensorboard时遇到的问题在《面向机器智能的tensorflow实践》一书中 调用tensorboard的代码为writer=tf.train.SummaryWriter('./my_graph',sess.graph)实际上这个方法已经被停用了,取而代之使用这个方法writer=tf.summary.FileWriter('./my_graph',sess.graph)然后在命令行输
用python做自动化测试--web 自动化测试(1)-Selenium 3.x使用系列问题集
运行 driver=webdriver.Firefox() 运行<em>报错</em>: Exception AttributeError: "'Service' object <em>has</em> no <em>attribute</em> 'process'" in d method Service.__del__ of t 0x028940B0>> ignored selenium.common.excepti
pytorch低版本加载高版本pytorch训练得到的模型,出现‘module’ object has no attribute ‘_rebuild_tensor_v2’错误
情景 使用pytorch0.3来加载Mobilenetv1的模型(用更高版本的pytorch训练得到的),出现“AttributeError: ‘<em>module</em>’ object <em>has</em> no <em>attribute</em> ‘_rebuild_tensor_v2’”错误。 分析 追根溯源,查看pytorch的源码,torch下__init__.py定义了__all__ = [**, ‘load’, **],然后...
机器学习实战 笔记 debug(一) kNN
代码 from numpy import * import operator def createDataSet(): group = array([[1.0,1.1],[1.0,1.0],[0,0],[0,0.1]]) labels = ['A','A','B','B'] return group, labels def classify0(inX, dataSet
windows下安装Python库的一系列错误
1. error: Microsoft Visual C++ 14.0 is required. Get it with &quot;Microsoft Visual C++ Build Tools&quot;: http://landinghub.visualstudio.com/visual-cpp-build-tools这个的解决办法是手动下载需要安装的那个包,比如我需要安装的是imread,在https://...
安装python模块psutil
安装psutil模块,可以通过python获取系统的cpu,磁盘,内存,进程,网络等相关信息 下载地址https://pypi.python.org/pypi/psutil/ tar -zxvf psutil-2.1.3.tar.gz cd psutil-2.1.3  python setup.py install 安装是出现<em>报错</em> error: command 'gcc' failed
itchat 运行记录
对python不熟悉,跑项目时遇到的一些问题,做个记录。 可以通过本命令安装itchat:pip install itchat 然后运行python文件, <em>报错</em>:AttributeError: ‘<em>module</em>’ object <em>has</em> no <em>attribute</em>’xxx 原来是因为命名py脚本时,不要与python预留字,模块名等相同(所以名字不能叫itchat会有冲突),还要删除已经生成的pyc
python里面调用pywt时遇到module ‘pywt’ has no attribute ‘wavedec’之类的错误
当遇到类似<em>module</em> ‘pywt’ <em>has</em> no <em>attribute</em> ‘wavedec’之类的错误的时候,如果你是用的pycharm,那么按住Ctrl+鼠标左键点击pywt,会跳转到一个叫__init__.py的文件内,如果里面是空的,那么,就不需要再在网上找什么解决办法了,按下面的步骤走一遍就行了。 步骤:1、打开cmd终端。 2、输入 pip uninstall p...
记录一下平时遇到的乱七八糟的问题---需要不断更新
总说 主要记录一下乱七八糟的东西,以防以后满Internet找,麻烦。 1. 一句话安装tensorflow 2. 安装opencv(python的) 3. AttributeError: <em>module</em> ‘pandas’ <em>has</em> no <em>attribute</em> ‘computation’ 一句话安装各种版本的tensorflow 虽然官网有4种安装方式,并且推荐用ana...
Python os-操作系统接口
内容源自:https://docs.python.org/2/library/os.html读写文件参考open() 操作路径参考os.path模块 多文件读入参考fileinput模块 建立临时文件或目录参考tempfile模块 高级别文件目录操作参考shutil模块 os.name操作系统名字,已经注册的有“posix”,“nt”,“os2”,“ce”,“java”,”riscos”|Proce
pyinstaller打包程序时遇到的一系列问题:AttributeError、No module named和PyQt5
  一、背景介绍     公司使用的python环境是Anconda+Python3.6,64位系统。     有一个py程序主要是图像批量处理相关的,涉及到文件遍历、字符串拼接,于是“自然而然地”在用pyinstaller打包的时候遇到了这个经典<em>报错</em>信息: AttributeError: 'str' object <em>has</em> no <em>attribute</em> 'items' 二、攻克    ...
Python多进程编程
Python在2.6版本新引进了多进程机制 一、 简介 多进程在Python中是一个包,它支持使用和线程模块类似的API来创建进程。  多进程包支持本地和远程并发,并有高效的GIL锁机制。 因为这些原因,多进程模块允许程序员在指定机器上实现完整的多进程开发,无论是Unix还是Windows. Warning: 这个包的某些功能要求在运行的OS上能实现共享信号量机制, 如果没有这个
Python笔记——tensorflow错误笔记:PyCharm下各种模块导入问题和AttributeError:
之前在windows下装了TensorFlow和Anaconda,运行环境是Pycharm. (开始直接在cmd下试的没问题,运行命令:pytho fileneme.py,感觉用着不方便,还是学着用PyCharm吧。不过二者遇到的问题都是一致的,可用同样方法解决) 错误1:模块<em>导入</em>问题 正常情况下,<em>导入</em>各种模块、包时,在 File->Settiings->Project:proj
如何解决不能绘制网络模型,报错protobuf
绘制网络模型,总显示这样的错误: AttributeError: 'google.protobuf.pyext._message.RepeatedScalarConta' object <em>has</em> no <em>attribute</em> '_values' 具体内容见下: caffe:>> ./python/draw_net.py ./examples/cifar10/cifar10_quick_train_
TensorFlow升级到1.2.0后带来的问题
1. AttributeError: <em>module</em> 'tensorflow' <em>has</em> no <em>attribute</em> 'batch_matmul' 解决办法:batch_matmul>>>matmul 举例: #out = tf.batch_matmul(outputs, W_repeated) + b out = tf.matmul(outputs, W_repeated) + b
【常见错误】--Nltk使用错误
一、错误类型 AttributeError: <em>module</em> 'nltk' <em>has</em> no <em>attribute</em> 'word_tokenize' 二、情形及解决办法 安装了nltk后,无法使用,<em>报错</em>如上,错误原因是在命名时使用和包一样的名字,导致无法<em>导入</em>。截图如下。 因此,只需修改文件名即可。   ...
解决导入matplotlib.pyplot as plt时关于backend、qt的报错
重新安装qt无果之后,用以下办法解决: 一、如果是anaconda虚拟环境,直接用conda更新matplotlib即可: conda install -n tf(虚拟环境名字) matplotlib 二、也可以用pip安装更新: pip install -U matplotlib 参考文献:matplotlib的backend浅析 ...
tensorflow基本使用中出现的问题及解决方案
tensorflow基本使用中出现的问题及解决方案
关于某个PyQt5系列教程“'QMainWindow' object has no attribute”的错误修正
原文地址:http://www.cnblogs.com/tkinter/p/5632245.html 一直到运行main程序之前之前都没有什么错误; 但是运行后出错: python IDLE<em>报错</em>: self.pushButton.clicked.connect(MainWindow.firstPyQt5_button_click) AttributeError: 'QMainWindow
关于Python爬虫程序scrapy的安装问题
Linux下关于Python爬虫程序scrapy的安装问题 我的安装过程: sudo pip install scrapy 够简单吧。  但是在运行第一个爬虫例子时 scrapy crawl dmoz 出现下面错误: AttributeError: '<em>module</em>' object <em>has</em> no <em>attribute</em> 'Spider' 解决方案如下:  htt
多进程---错误解决Attribute Error
多进程---错误解决Attribute Error: Can't get <em>attribute</em> 'long_time_task' on &amp;lt;<em>module</em> '__main__' (built-in)&amp;gt; StackOverflow解决办法 这个问题似乎是多处理器的一个设计特征。请参阅https://bugs.python.org/issue25053。由于某些原因Pool不能始终使用...
Django2.1.2创建工程后进入admin站点管理的时候报了:WSGIRequest' object has no attribute 'user 的错误
查stackoverflow和CSDN,这是由于Django版本的问题,在1.10之前,中间件的key为MIDDLEWARE_CLASSES;在1.10之后,中间件的key为MIDDLEWARE。 项目的初始配置: MIDDLEWARE_CLASSES = ( 'django.contrib.sessions.middleware.SessionMiddleware', 'dj...
Python之signal模块详解
先简单说一下Signal是啥.(如果想直接使用可以不看)Signal翻译过来中文就是信号- -当然, 本身他就是Linux系统编程中非常重要的概念, 信号机制是进程之间传递消息的一种机制,其全称为软中断信号作用是通知进程发生了异步事件。进程之间可以调用系统来传递信号, 本身内核也可以发送信号给进程, 告诉该进程发生了某个事件.注意,信号只是用来通知某进程发生了什么事件,并不给该进程传递任何数据。接...
父与子的编程之旅--EasyGui安装问题解决
在第六章 GUI–图形用户界面中在按照书中方法(把easygui.py放到Python能找到的地方,我放在了Python27下)安装EassyGui后,msgbox不能成功运行。>>>import easygui >>>easygui.msgbox("Hello There!") Traceback (most recent call last): File "", line 1,
Django应用mysql数据库
应用MySQL数据库,用pymysql的设置方法 修改 settings.py中数据库的设置: DATABASES = {   'default': {       'ENGINE': 'django.db.backends.mysql', #数据库引擎 必填       'NAME': ' ',                      #数据库名 必填       'USER':
无法导入 configparser模块,import configparser报错解决办法
在Python2下,需要大写:import  ConfigParser 在PYthon3下,需要小写:import   configparser 如果不是以上原因,其他解决办法: 1、添加环境变量     把python相关文件夹,python文件夹,scripts文件夹加入环境变量中。 2、在lib中找到configparse加入到script中,这样就恢复正常
python 处理csv数据
python中有专门的模块csv来处理: 例如: csv文件的格式 263@ Invalid creation@WISSAM A. ELRIACHY@2010/03/27 02:58:45@2010/04/22 22:41:40@ 例如读取csv的数据打印出来: i
递归神经网络报错has no attribute 'core_rnn_cell'解决方案
调试递归神经网络(RNN)的时候出现如下错误: AttributeError: <em>module</em> 'tensorflow.contrib.rnn' <em>has</em> no <em>attribute</em> 'core_rnn_cell' 顺便问一句,资源分怎么设置免费啊
tensorflow中API版本容错
大部分是Api版本问题: error1、SummaryWriter AttributeError: '<em>module</em>' object <em>has</em> no <em>attribute</em> 'SummaryWriter' tf.train.SummaryWriter改为:tf.summary.FileWriter error2、summeries AttributeError: 'modul
tensorflow的基本用法(一)
一.sessoion session会话: 指定到某个神经网络#encoding:utf-8 import tensorflow as tf import numpy as np ##定义一个向量## ##运算两个矩阵## martrix1=tf.constant([[3,3]]) martrix2=tf.constant([[2],[2]]) product=tf.matmul(matrix1
《机器学习实战》——k-近邻算法Python实现问题记录
《机器学习实战》第二章k-近邻算法,自己实现时遇到的问题,以及解决方法。做个记录。 1.写一个kNN.py保存了之后,需要重新<em>导入</em>这个kNN模块。<em>报错</em>:no <em>module</em> named kNN. 解决方法:1.将.py文件放到 site_packages 目录下             2.在调用文件中添加sys.path.append("模块文件目录"); import sys 
看 flask 教程中遇到的问题(二)
所有代码都复制完后执行,<em>报错</em> AttributeError: '_AppCtxGlobals' object <em>has</em> no <em>attribute</em> 'db' 原因,全局变量g.db没有定义,在系统启动前增加全局变量即可 @app.before_request def before_request(): g.db = connect_db()
配置 Caffe 可能出现的问题
配置Caffe 可能出现的问题 1.      如果出现如下问题: from caffe.proto importcaffe_pb2 ImportError: No <em>module</em> namedcaffe.proto   则通常说明要配置PYTHONPATH环境变量: Export PYTHONPATH=/usr/lib/python2.7/dist-packages:/home/xx
TensorFlow升级到1.0版本的问题
BUG 1. AttributeError: ‘<em>module</em>’ object <em>has</em> no <em>attribute</em> ‘mul’ 解决方案:用tf.multiply替代tf.mulBUG 2. AttributeError: ‘<em>module</em>’ object <em>has</em> no <em>attribute</em> ‘sub’ 解决方案:用tf.subtract替代tf.subBUG 3. AttributeError: ‘m
【Python】收集python2代码转python3遇到的问题
需要把一段py2的代码转为py3,执行后,遇到一个错误就解决一个错误,一般都会有替换方案。 楼主遇到的如下: “print X” 更改为“print(X)” 否则<em>报错</em>:SyntaxError: Missing parentheses in call to 'print'。 xrange改为range python3 中取消了 range 函数,而把 xrange 函数重命名为 range,所...
使用nmap或者python-nmap时出现错误
在Linux上面使用nmap和python-nmap时均出现以下错误,在网上找解决方案没找到,花了很多时间才解决这个问题。 错误信息如下: shell模式下:Failed to find device eth0 which was referenced in /proc/net/route python中:抛出PortScannerError 解决方案:将nmap更新至最新版本
tensorflow因为版本,需要修改一些方法问题
参考博文: http://blog.csdn.net/lijjianqing/article/details/70155905 http://blog.csdn.net/caimouse/article/details/61208940 http://blog.csdn.net/edwards_june/article/details/65652385 1、AttributeErr
networkx使用笔记(三)之好汉篇numpy(2)
python和networkx的三个给力科学计算的基友:numpy、scipy和matplotlib。      numpy擅长数组处理,多维数组的产生与访问,还有庞大的函数库,包括:求和、平均值、方差、最值、排序、矩阵、矩阵类和线性代数模块等。其安装,在第一篇中有说。      matplotlib擅长画图,点和线多形态展示、坐标轴变换等。其安装在第一篇有说。      scipy很强大,
【Tensorflow_DL_Note17】CIFAR10代码使用过程中出现的错误及其解决办法
1.AttributeError: '<em>module</em>' object <em>has</em> no<em>attribute</em> 'random_crop' 解决方案: 将distorted_image= tf.image.random_crop(reshaped_image, [height, width])改为: distorted_image = tf.random_crop(reshaped_image,[heigh...
使用PyInstaller把PyQt5生产exe时文件报错总结
PyInstaller使PyQt5生成exe执行文件 本文主要总结了PyInstaller使用过程中遇到的问题及解决办法 PyInstaller简介 PyInstaller 是一个用来将 Python 程序打包成一个独立可执行软件包,支持 Windows、Linux 和 Mac OS X。。 —— [ PyInstaller官网 ] PyInstaller打包PyQt的...
tensorboard问题汇总
1、运行时提示:typeError:GetNext() takes 1 positional argument but 2 were given。 是因为tensorflow是1.7或者1.9ban版本,tensorboard是不同版本。 pip install tb-nightly,不能解决问题,安装的是tensorboard 0.4的老版本。 pip install upgrade te...
使用opencv_python进行视频分析遇到的bgsegm问题
近期在使用opencv_python分析视频过程中总是遇到各种问题,如cv2.cv2的问题、还有使用opencv_python操作视频处理类的需求时总是遇到<em>has</em> no <em>attribute</em> 'bgsegm'等问题。从网上找了但缺少完整的说明,故特地说明下。 遇到<em>has</em> no <em>attribute</em> 'bgsegm'等问题,说明安装的opencv_python版本需要更新了,或者没有安装c
TensorFlow学习笔记(九):CIFAR-10训练例子报错解决
以下<em>报错</em>主要是由于TensorFlow升级1.0后与以前代码不兼容所致。 1.AttributeError: '<em>module</em>' object <em>has</em> no<em>attribute</em> 'random_crop' 解决方案: 将distorted_image= tf.image.random_crop(reshaped_image, [height, width])改为: di
python 第五(6)章编程练习
Python 2.7.12 (v2.7.12:d33e0cf91556, Jun 27 2016, 15:19:22) [MSC v.1500 32 bit (Intel)] on win32 Type "copyright", "credits" or "license()" for more information. >>> 4.5 and 4.6 4.6 >>> 3.2 and -4.5 -
关于Python验证码识别安装PIL、tesseract-ocr与pytesseract模块的错误解决
0x00:用Python进行验证码识别 安装了 1、PIL 2、tesseract-ocr 3、pytesseract模块 <em>报错</em> File "D:\P\Python\lib\subprocess.py", line 958, in _execute_child startupinfo) WindowsError: [Error 2]
关于cv2.cv.Boxpoint()函数出错解决方法
今天使用opencv运行一个脚本,但是出现cv2.cv.BoxPoints()函数有错,提示’<em>module</em>’ object <em>has</em> no <em>attribute</em> ‘cv’ 的错误,找了一些帖,发现最多的解决方法就是说“这是因为opencv3已经没有了cv,只能重新下载opencv2 ; ”,我就纳闷了,有新的版本不用,为什么还要下载旧的版本。有的更是建议“from cv2 import cv as c...
vim 自动补全插件YCM 安装 配置
vim 自动补全插件YCM 安装 配置 <em>报错</em> NoExtraConfDetected: No .ycm_extra_conf.py file detected, so no compile flags are available. Thus no semantic support for C/C++/ObjC... 说是找不到 .ycm_extra_conf.py, 所以不支持 c...
ubuntu linux 安装 scrapy 及遇到的问题
1. scrapy英文文档网址如下 http://doc.scrapy.org/en/latest/intro/install.html2. 安装流程 pip 安装pythonsudo apt-get install python-pippip install Scrapy 官方安装包安装scrapysudo apt-key adv --keyserver hkp://keyserver.ubunt
python+TensorFlow常见错误汇总,持续更新中......
==================================== <em>module</em> 'tensorflow' <em>has</em> no <em>attribute</em> 'layers' 解决方法:这时已经安装的tensorflow是0.x的版本,需要重新安装tensorflow 1.0以上的版本(利用.whl安装) ====================================
wxPython和pyOpenGL在用PyInstaller打包时遇到的若干问题及解决办法
尝试用PyInstaller打包Python代码(使用了wxPython和pyOpenGL)的时候,遇到一系列的问题,汇总一下: 环境: Win7 64-bit, PyInstaller 2.0, Python 2.7.5, wxPython 2.8.12.1, pyOpenGL 3.0.2 问题1:       PyInstaller打包成功,运行dist里生成的ex
解决allure源码报错
一、背景 python自动化用nose框架中allure生成报告,但是case中有异常抛出会<em>报错</em>(错误信息稍后给出), python 3.5版本 nose配置文件: with-allure=1 logdir=results 二、执行的错误信息: 三、如何修改: 找到源码位置: 修改_parse_tb方法:注释的原来的,下面是修改后的:
PaddlePaddle出现module对象没有model属性解决方法
关键字:<em>module</em> model属性 问题描述:利用波士顿房价数据集进行模型的训练和预测时,使用了uci_housing.model(),uci_housing模块封装了该数据集的相关操作,但却报出'<em>module</em>' object <em>has</em> no <em>attribute</em> 'model'错误,<em>module</em>对象没有model属性。 <em>报错</em>代码段: paddle.infer( output...
tensorflow 各种报错总结
1. 'list' object <em>has</em> no <em>attribute</em> 'lower' <em>报错</em>如下Traceback (most recent call last): File &quot;H:/FasionAI/MyNet/train.py&quot;, line 27, in &amp;lt;<em>module</em>&amp;gt; train_logits = model.inference(train_batch, BATCH_S...
小白tensorflow学习中遇到的问题
1.野生图片输入网络 im = matplotlib.image.imread(path) #im=rgb2gray(im) im=np.reshape(im,(1,28,28,3)) im=tf.image.convert_image_dtype(im,tf.float32) #print(im) regularizer=tf.contrib.layers.l2_regularizer(0
python 学习笔记 10 -- 正则表达式
本文主要介绍Python中正则表达式的使用,对正则表达式的方法一一举例说明。Hope you would like it !! :)
Tensorflow1.0版本与以前函数不同之处
大部分是Api版本问题: AttributeError: '<em>module</em>' object <em>has</em> no <em>attribute</em> 'SummaryWriter' tf.train.SummaryWriter改为:tf.summary.FileWriter AttributeError: '<em>module</em>' object <em>has</em> no <em>attribute</em> 'summaries'
Django 学习 - 报错/坑爹版本系列
引言 1、目前最佳环境 2、<em>报错</em> - cannot import name RadioFieldRenderer 3、<em>报错</em> - No <em>module</em> named validators 4、<em>报错</em> - The INSTALLED_APPS setting must be a list or a tuple 5、<em>报错</em> - 'WSGIRequest' object <em>has</em> no <em>attribute</em> 'u...
新版的packaging_tool.py
详情参考 https://mp.csdn.net/postedit packaging_tool.py文件修复pycharm 安装第三方库<em>报错</em>:AttributeError: '<em>module</em>' object <em>has</em> no <em>attribute</em> 'main'
《深入浅出强化学习》学习笔记02-书本2.3例程-20180213
按照书本教程,遇到问题,暂时还没解决&amp;gt;&amp;gt;&amp;gt; env=gym.make('GridWorld-v0') WARN: Environment '&amp;lt;class 'gym.envs.classic_control.grid_mdp.GridEnv'&amp;gt;' <em>has</em> deprecated methods. Compatibility code invoked. Traceback ...
tensorboard可视化高级使用
1、Scalar运行程序时,出错,AttributeError: 'SummaryMetadata' object <em>has</em> no <em>attribute</em> 'display_name' 只有graph图像。 后来,发现这是TensorFlow版本问题。由于,之前装的GPU版本是tensorflow (1.3.0rc0),但是运行tensorboard的时候,没有出现scalar,然后试了升级Tens
Python3.6.0+opencv3.3.0人脸检测(示例)
网上有很多关于Python+opencv人脸检测的例子,并大都附有源程序。但是在实际使用时依然会遇到这样或者那样的问题,在这里给出常见的两种问题及其解决方法。先给出源代码:(如下)import cv2 import numpy as npcv2.namedWindow("test") cap=cv2.VideoCapture(0) success,frame=cap.read()classifier
flask+celery常见问题及解决方法
1、 [root@ansible flask_celery]# celery -A app worker --loglevel=info Traceback (most recent call last):   File "/usr/bin/celery", line 11, in     sys.exit(main())   File "/usr/lib/python2.7/site
python:在windows上使用命令行配置mysql-python
系统环境 python版本3.5.2 64Bit windows 10 教育版 1.使用Pycharm 自动安装,失败 当没有安装mysql-python模块,在Pycharm中使用 import MySQLdb; 时,IDE会提示安装,当点击之后,提示pip版本为8,需要升级到10.0.1,才能安装模块 于是理所当然的升级到最新版本, pip升级完成后,继续使用Pycha...
记录 python 编程中遇到的错误
  1. 记录一个粗心大意导致的错误:'DataFrame' object <em>has</em> no <em>attribute</em> 'piovt' 原因是拼写错误,正确的应该是 pivot df.pivot('A','B','C') 要注意细节   2.index=pd.date_range('11/13/2018',period=1000) 出错: TypeError: __new__() got an...
python中使用smtplib模块出现找不到SMTP函数的问题
先把问题的callback贴一下,linux环境下提示AttributeError: <em>module</em> 'smtplib' <em>has</em> no <em>attribute</em> 'SMTP' Traceback (most recent call last): File &quot;/home/roy/python/email.py&quot;, line 1, in &amp;lt;<em>module</em>&amp;gt; import smtpli...
Tensorflow使用过程中的问题
Tensorflow使用过程中的问题 版本:1.0.0,for gpu 操作系统:Windows 7 cuda:8.0 cudnn:5.1 Python:3.5 gpu:GeForce GT 720 1. cuda安装后找不到deviceQuery.exe 按照nvdia的官方教程(http://docs.nvidia.com/cuda/cuda-installation-guid...
CountVectorizer.transform出现的一个错误的解决
问题该错误的出现还是跟我上一个博客中讲述的问题有关,因为我将CountVectorizer的参数input设置为file,所以在本博客出现问题的代码中,因为给它的是一个字符串列表,所以就会出现错误。先看出现问题的代码:new_post = ['imaging databases'] new_post_vec = vectorizer.transform(new_post) print(new_pos
TensorFlow使用中的错误
找不到模型文件 / 用于初始化的预训练文件 perhaps your file is in a different file format and you need to use a different restore operator? 解决方法类似这里, 即设置的目录不是checkpoint文件所在目录, 还需要把Checkpoint的前缀(prefix)作为目录名的一部分.例如名为myMo
python2和python3的区别、转换及共存
http://blog.csdn.net/pipisorry/article/details/42167987 应该学习哪个版本的Python? 对于这个问题,“先选择一个最适合你的Python教程,教程中使用哪个版本的Python,你就用那个版本。等学得差不多了,再来研究不同版本之间的差别". 但如果想要用Python开发一个新项目,那么该如何选择Python版本呢?大部分Pyth
【机器学习实战笔记】第2章 k-近邻算法【02】
第2章 k-近邻算法【02】 实战2:在约会网站上使用k-近邻算法 一、涉及的Python函数功能介绍: 1、append() 函数的作用 在列表末尾添加新的对象 http://www.runoob.com/python/att-list-append.html 2、split()函数作用 切分数据 http://www.runoob.com/python/att-
Python库selenium的安装与使用
下载:https://pypi.python.org/pypi/selenium#downloads 浏览器驱动:https://sites.google.com/a/chromium.org/chromedriver/downloads http://chromedriver.storage.googleapis.com/index.html?path=2.21/
中文版Photoshop CS6完全自学教程.part2下载
一共两卷(http://download.csdn.net/user/nylbeijing),全部下载完后,才能解压。中文版Photoshop CS6完全自学教程 中文版Photoshop CS6完全自学教程 中文版Photoshop CS6完全自学教程 《Photoshop CS6完全自学教程》是为想要全面学习Photoshop CS6图像处理功能的读者量身打造的实例操作型技法书。作者结合多年平面设计实战经验,从初学者角度出发,以基础知识点结合实战操作的学习形式进行编写,能帮助Photoshop CS6用户全面认识并灵活使用软件的各个功能,完全自学成才,快速成为图像处理高手。 全书共分为 相关下载链接:[url=//download.csdn.net/download/nylbeijing/7131889?utm_source=bbsseo]//download.csdn.net/download/nylbeijing/7131889?utm_source=bbsseo[/url]
FSK原理解析(初等)下载
基础的FSK信号原理解析,对FSK一无所知的同学可以下来看看,就基本对键控频移有了了解了。 文章包括对FSK信号生成,调制,解调的说明。需要一定通信原理的知识。 相关下载链接:[url=//download.csdn.net/download/guiyu_1985/1965247?utm_source=bbsseo]//download.csdn.net/download/guiyu_1985/1965247?utm_source=bbsseo[/url]
Quidway+Eudemon+100E&200&200S+防火墙+特性描述(V200R001C03&V200R007C03_05).zip下载
Eudemon100E&200S-V200R007C03SPC001 9.3MB E100E&E200S-V200R007C03B020 8.98MB E200-V200R001C03SPC001 9.44MB 文档下载 Quidway Eudemon 200 防火墙 安装指南(V200R001_03)1.35 MB Quidway Eudemon 100E&200S 防火墙 硬件描述(V200R007_03)479.53 KB Quidway Eudemon 100E&200S 防火墙 安装指南(V200R007_04)785.77 KB Quidway Eudemon 1 相关下载链接:[url=//download.csdn.net/download/zyxwy119/2168547?utm_source=bbsseo]//download.csdn.net/download/zyxwy119/2168547?utm_source=bbsseo[/url]
文章热词 设计制作学习 机器学习教程 Objective-C培训 交互设计视频教程 颜色模型
相关热词 mysql关联查询两次本表 native底部 react extjs glyph 图标 数据库如何导入课程 超级课程表ios导入
我们是很有底线的