IDEA的gradle项目编译错误
Repository https://repo1.maven.org/maven2/</span> replaced by <span class=
FAILURE: Build failed with an exception.
* Where:
Initialization script 'C:\Users\lenovo\.gradle\init.gradle' line: 9
* What went wrong:
A problem occurred evaluating root project 'Server'.
> Could not get unknown property 'variable' for object of type org.gradle.api.internal.artifacts.repositories.DefaultMavenArtifactRepository.
* Try:
Run with --stacktrace option to get the stack trace. Run with --info or --debug option to get more log output.
BUILD FAILED
FAILURE: Build failed with an exception.
* Where:
Initialization script 'C:\Users\lenovo\.gradle\init.gradle' line: 9
* What went wrong:
A problem occurred evaluating root project 'Server'.
> Could not get unknown property 'variable' for object of type org.gradle.api.internal.artifacts.repositories.DefaultMavenArtifactRepository.
* Try:
Run with --stacktrace option to get the stack trace. Run with --info or --debug option to get more log output.
BUILD FAILED
...全文
相关推荐
IntelliJ IDEA导入Gradle项目,并启动项目.docx
。
IntelliJ IDEA导入Gradle项目,并启动项目.pdf
。
IDEA安装lombok插件设置Enable Annotation Processing后编译依然报错解决方法
主要介绍了IDEA安装lombok插件设置Enable Annotation Processing后编译依然报错解决方法,文中通过示例代码介绍的非常详细,对大家的学习或者工作具有一定的参考学习价值,需要的朋友们下面随着小编来一起学习学习吧
IntelliJ IDEA编译项目报错 "xxx包不存在" 或 "找不到符号"
主要介绍了IntelliJ IDEA编译项目报错 "xxx包不存在" 或 "找不到符号" ,文中通过图文介绍的非常详细,对大家的学习或者工作具有一定的参考学习价值,需要的朋友们下面随着小编来一起学习学习吧
IDEA导入外部项目报Error:java: 无效的目标发行版: 11的解决方法
主要介绍了IDEA导入外部项目报Error:java: 无效的目标发行版: 11,本文给大家介绍的非常详细,对大家的学习或工作具有一定的参考借鉴价值,需要的朋友可以参考下


