studio升级3.4之后运行一直卡在compiledebugjavawithjavac [问题点数:50分]

Bbs1
本版专家分:0
Blank
签到新秀 累计签到获取,不积跬步,无以至千里,继续坚持!
Blank
GitHub 绑定GitHub第三方账户获取
结帖率 0%
Bbs1
本版专家分:67
Bbs1
本版专家分:0
Blank
签到新秀 累计签到获取,不积跬步,无以至千里,继续坚持!
Blank
GitHub 绑定GitHub第三方账户获取
Bbs1
本版专家分:67
Bbs1
本版专家分:60
Android Error:Execution failed for task ':app:compileDebugJavaWithJavac' 解决方案

最近Android项目开发中碰到一个异常 Google、百度搜索前两页内容浏览了一遍,总结了几种方案:   1、<em>升级</em>更新buildToolsVersion 到最新版本 2、<em>升级</em>Android Studio 2.2.2版本,JDK 1.8版本 android { compileSdkVersion 25 buildToolsVersion "25.

Android运行时异常:API 'variant.getJavaCompiler()' is obsolete and has been replaced with 'variant........

报错详细信息如下 WARNING: API 'variant.getJavaCompiler()' is obsolete and has been replaced with 'variant.getJavaCompileProvider()'. It will be removed at the end of 2019. For more information, see https://d....

INFO: API 'variant.getJavaCompile()' is obsolete and has been replaced with 'variant.getJavaCompileP

INFO: API 'variant.getJavaCompile()' is obsolete and has been replaced with 'variant.getJavaCompileProvider()'. in terminal. Go to view -&gt; tool windows -&gt; Terminal in Android Studio. gradlew ...

【常见问题】API 'variant.getJavaCompile()' is obsolete and has been replaced with 'variant.getJavaCompi

思路来源: https://github.com/TakWolf/Android-Bintray-Publish-Demo/commit/220ff923856afcb0f30638a3cb23b19b6e5cdd00

WARNING: API 'variant.getJavaCompiler()' is obsolete and has been replaced with 'variant.getJavaComp

WARNING: API ‘variant.getJavaCompiler()’ is obsolete and has been replaced with ‘variant.getJavaCompileProvider()’. 1.问题 WARNING: API ‘variant.getJavaCompiler()’ is obsolete and has been replaced with...

Error:Execution failed for task ':app:compileDebugJavaWithJavac'.

以前没用过Android <em>studio</em>,这是以前的同事做的程序,让我维护,可是<em>运行</em>的时候出现这个错误。实在不知道怎么错的,求大神帮忙看看 错误提示:Error:Execution failed for

debugCompile(debugImplementation)和 releaseCompile(releaseImplementation)的使用-leakcanary release中不起作用

debugCompile(debugImplementation)和releaseCompile(releaseImplementation) debugCompile(debugImplementation) debugCompile 只在 debug 模式的编译和最终的 debug apk 打包时有效 releaseCompile(releaseImplementation) Release ...

新手求救~~ app:compileDebugJavaWithJavac 上手一个报错,百度一天搞不定啊。。。

自己的一个老工程,加入了别人的代码,编译可以,<em>运行</em>就出问题了,先上报错截图 截图1: 截图2: 截图3: 最后在Terminal 敲入命令 gradlew compileDebugJavaWithJa

Error:Could not determine the dependencies of task ':app:compileDebugJavaWithJavac'

AS 3.6安装完成后新建项目<em>运行</em>之,出现报错如下: Error:Could not determine the dependencies of task ':app:compileDebugJavaWithJavac'. Could not create service of type AnnotationProcessorDetector using JavaGradleScopeSe...

解决AndroidStudio中依赖的module debugCompile 配置不生效问题

在主module中 releaseCompile project(path:':tools', configuration:'release') debugCompile project(path:':tools', configuration:'debug')   在依赖的module中 android { publishNonDefault true }  ...

Could not determine the dependencies of task ':app:flutterBuildDebug'.

在学习Flutter过程中,将项目打包在另一台电脑<em>运行</em>时出现Could not determine the dependencies of task ':app:flutterBuildDebug'.错误。 解决办法:在Terminal中输入 flutter clean,<em>运行</em>结束后,重新编译项目即可。 ...

:app:compileDebugJavaWithJavac 问题解决

今天在做新项目Demo的时候,需要从老项目拷贝部分文件过来,然后发现编译报错很多 第一个就是 :app:compileDebugJavaWithJavac  网上查了各种问题都有,也有各种解决的方法,试了试都没有效果,结果在一个博客里面找到了解决方法 就是在Android Studio 的Terminal 中查看build 的info   gradle compileDebugSourc...

reactnative启动报错 app:compileDebugJavaWithJavac

scanning folders for symlinks in E:\SimpleApp\SimpleApp\node_modules (30ms) Starting JS server... Building and installing the app on the device (cd android && gradlew.bat installDebug)... Starting a new Gradle Daemon for this build (subsequent builds will be faster). Incremental java compilation is an incubating feature. :app:preBuild UP-TO-DATE :app:preDebugBuild UP-TO-DATE :app:checkDebugManifest :app:preReleaseBuild UP-TO-DATE :app:prepareComAndroidSupportAppcompatV72301Library UP-TO-DATE :app:prepareComAndroidSupportSupportV42301Library UP-TO-DATE :app:prepareComFacebookFbuiTextlayoutbuilderTextlayoutbuilder100Library UP-TO-DATE :app:prepareComFacebookFrescoDrawee130Library UP-TO-DATE :app:prepareComFacebookFrescoFbcore130Library UP-TO-DATE :app:prepareComFacebookFrescoFresco130Library UP-TO-DATE :app:prepareComFacebookFrescoImagepipeline130Library UP-TO-DATE :app:prepareComFacebookFrescoImagepipelineBase130Library UP-TO-DATE :app:prepareComFacebookFrescoImagepipelineOkhttp3130Library UP-TO-DATE :app:prepareComFacebookReactReactNative0493Library UP-TO-DATE :app:prepareComFacebookSoloaderSoloader010Library UP-TO-DATE :app:prepareOrgWebkitAndroidJscR174650Library UP-TO-DATE :app:prepareDebugDependencies :app:compileDebugAidl UP-TO-DATE :app:compileDebugRenderscript UP-TO-DATE :app:generateDebugBuildConfig UP-TO-DATE :app:mergeDebugShaders UP-TO-DATE :app:compileDebugShaders UP-TO-DATE :app:generateDebugAssets UP-TO-DATE :app:mergeDebugAssets UP-TO-DATE :app:generateDebugResValues UP-TO-DATE :app:generateDebugResources UP-TO-DATE :app:mergeDebugResources UP-TO-DATE :app:bundleDebugJsAndAssets SKIPPED :app:processDebugManifest UP-TO-DATE :app:processDebugResources UP-TO-DATE :app:generateDebugSources UP-TO-DATE :app:incrementalDebugJavaCompilationSafeguard UP-TO-DATE :app:compileDebugJavaWithJavac :app:compileDebugJavaWithJavac - is not incremental (e.g. outputs have changed, no previous execution, etc.). :app:compileDebugJavaWithJavac FAILED FAILURE: Build failed with an exception. * What went wrong: Execution failed for task ':app:compileDebugJavaWithJavac'. > Unexpected lock protocol found in lock file. Expected 3, found 0.

我的安卓studio 为啥进不去,一直在Gradle:Resolve dependencies':app:_debugCompile' 进去之后也这样

我的安卓<em>studio</em> 为啥进不去,<em>一直</em>在Gradle:Resolve dependencies':app:_debugCompile' 进去<em>之后</em>也这样

快速处理编译运行compileDebugJavaWithJavac问题

快速处理编译<em>运行</em>AS compileDebugJavaWithJavac问题 compileDebugJavaWithJavac是什么,从字面上看就是在debug调试的执行javac命令,编译器遇到不能解析的内容而抛出的异常。 上面一大片报红,很难定位错误的原因在哪里,在Terminal执行gradlew compileDebugJavaWithJavac命令能快速找到原因: 下面是命令执行结...

Error:Could not determine the dependencies of task ':app:extractIncludeDebugProto'.

【Android】 android <em>studio</em> 3.0 Error:Could not determine the dependencies of task ‘:app:extractIncludeDebugProto’. Resolving configuration ‘debugCompile’ directly is not allowed 在Android<em>studio</em>3.0 ...

Error:Could not determine the dependencies of task ':app:preDebugBuild'

RN 集成二维码扫描时 添加react-native-camera库后报Error:Could not determine the dependencies of task ':app:preDebugBuild' 原因为:没有添加' missingDimensionStrategy 'react-native-camera', 'mlkit' ' ...

解决Gradle运行命令时报Could not determine the dependencies of task ':compileReleaseJava'.

Could not determine the dependencies of task ':compileReleaseJava'. > failed to find target android-19 这个问题需要的在工程的根目录添加两个文件local.properties和settings.gradle这 两个文件 local.properties的内容是:你的SD

Android开发之compileDebugJavaWithJavac问题

compileDebugJavaWithJavac是什么,从字面上看就是在debug调试的执行javac命令,编译器遇到不能解析的内容而抛出的异常。 报错举例: 编译报错没有给出明确的代码错误位置 Execution failed for task ':app:compileDebugJavaWithJavac' 解决办法: 在AS的Terminal内输入命令:输出具体代码错误位置,逐...

Error:Could not determine the dependencies of task ':app:transformClassesWithInstantRunForDebug'.

在Android Studio使用中,我们可能会遇到这种问题:Error:Could not determine the dependencies of task ':app:transformClassesWithInstantRunForDebug'. > In order to use Instant Run with this device running API 18, you

gradlew 常用命令行

常用命令如下:(linux下是./gradlew,该脚本在项目下,windows直接gradlew即可) ./gradlew -v 版本号,首次<em>运行</em>,没有gradle的要下载的哦。 gradlev ./gradlew clean 删除HelloWord/app目录下的build文件夹 ./gradlew build 检查依赖并编译打包 这里注意的是 ./gradlew build 命令...

哪位仁兄帮解决下,两天了,没解决app:compileReleaseJavaWithJavac

org.gradle.api.internal.tasks.TaskDependencyResolveException: Could not determine the dependencies o

Android - API 'variant.getJavaCompiler()' is obsolete and has been replaced with 'variant.getJavaCom

转载请声明,原文地址: 问题: API 'variant.getJavaCompiler()' is obsolete and has been replaced with 'variant.getJavaCompileProvider()'. 下面是详细的 Configure project :app WARNING: API ‘variant.getJavaCompiler()’ is...

ARouter的compileDevDebugJavaWithJavac填坑记录日志

好好的项目突然<em>运行</em>起来报错: build Output是: 完全看不出所以然, 看到下面这句: 在as控制台查看<em>之后</em>提示说子模块value文件,没在setting.gradle文件中配置,神特么无语。value文件和setting文件有几毛钱关系呢。 看看这优秀的提示: 经过网络各种搜索无果,最终决定用最简单的排除法。 在一步步排除改动的代码后,终于发现,ARouter中,参数传递的成员变量,不能是private的 上面这样就是错误的,改成Public即可。 as提..

compileDebugJavaWithJavac

android<em>studio</em>项目里面报错compileDebugJavaWithJavac折磨我好久了,每次都是一点点排查代码,因为as不会给出具体出错的位置,今天修改的代码太多了,用排查的方式 太费事了,从网上找了好久,终于找到能帮助自己的信息了,记录一下,希望可以帮助更多向我一样的小伙伴....在Terminal里面输入命令gradlew compileDebugSources --stackt...

'debugCompile' is obsolete

Configuration 'debugCompile' is obsolete and has been replaced with 'debugImplementation' and 'debugApi'. It will be removed at the end of 2018. For more information see: http://d.android.com/r/tools/...

处理Android Studio 编译报错:compileDebugJavaWithJavac问题

处理compileDebugJavaWithJavac编译问题 使用Android Studio 编译代码总是报错:Execution failed for task ‘:app:compileDebugJavaWithJavac’. 却又没有显示错误原因,找不到报错原因无从下手。 可以在Terminal窗口输入命令 gradlew compileDebugJavaWithJavac 进行编...

databing 踩的又一个坑

Error:Execution failed for task ':app:compileDebugJavaWithJavac'. > java.lang.RuntimeException: failure, see logs for details. Exception while handling step android.databinding.annotationprocessor.P

WARNING: Module 'common' has variant 'release' selected, but the module ''app'' depends on variant '

记一次as警告 WARNING: Module 'common' has variant 'release' selected, but the module ''app'' depends on variant 'debug' 发生原因: 由于修改了主工程的productFlavors,sync后as报错。 分析 看报错信息,表示由于common模块选择了release变体,但是主工程...

android studio升级到3.4,gradle更新到5.1.1出现Could not get unknown property 'bootClasspath'....

把<em>studio</em><em>升级</em>到3.4 gradle更新到5.1.1。在编译时出现: Could not get unknown property 'bootClasspath' for object of type org.gradle.api.tasks.compile.CompileOptions 的提示,从没遇到这样的问题,网上也很少有解决的方法,没有有大神知道该怎么处理?

【Android】【Gradle】解决Manifest merger failed问题

当我们自己添加的资源或设置,和androidSDK或第三方库重复时,就会产生manifest merge fail的问题 可以通过以下方法解决: 在manifest节点添加代码 xmlns:tools="http://schemas.android.com/tools" 在application节点添加代码,具体替换哪些类别的资源,要根据实际情况来决定 tools:replace="label,...

[Android Studio]关于定位compileDebugJavaWithJavac具体问题的方法

在Windows中,在系统cmd调出的控制台,进入项目的根目录,输入以下命令: gradlew compileDebugJavaWithJavac --stacktrace 如果是在Linux/Mac下,这样输入: ./gradlew compileDebugJavaWithJavac --stacktrace 然后等待以下,会看到详细错误信息 ...

WARNING: API 'variant.getJavaCompile()' is obsolete and has been replaced with 'variant.getJavaCompi

问题:WARNING: API 'variant.getJavaCompile()' is obsolete and has been replaced with 'variant.getJavaCompileProvider()'. It will be removed at the end of 2019. For more information, see https://d.androi...

android studio编译耗时很久,特别是在compileDebugJavaWithJavac这个步骤耗时近半分钟

![图片说明](https://img-ask.csdn.net/upload/201903/20/1553066940_269555.png)

Execution failed for task ':app:javaPreCompileDebug'

集成第三方代码出现此错误Execution failed for task ':app:javaPreCompileDebug' 解决方式如下: 在app的build.gradle中,添加如下代码: javaCompileOptions { annotationProcessorOptions { includeCom...

Android Studio3.0 Error:Execution failed for task ':app:javaPreCompileDebug' 错误

rror:Execution failed for task ‘:app:javaPreCompileDebug’. Annotation processors must be explicitly declared now. The following dependencies on the compile classpath are found to contain annotation p...

Spring Boot在使用Gradle build命令住不动了

Spring Boot执行gradle build的时候<em>卡</em>在tests completed这里没有动了。 XXX-api&amp;amp;gt;gradle build &amp;amp;lt;===========--&amp;amp;gt; 85% EXECUTING [23s] &amp;amp;gt; :XXX-api:test &amp;amp;gt; 0 tests completed &amp;amp;gt; :XXX-api:test &amp;amp;gt; Executing tes

Gradle编译问题整理(持续更新)

1、Could not find lint-gradle-api.jar (com.android.tools.lint:lint-gradle-api:26.1.2). maven {url 'https://maven.aliyun.com/reposity/google' } maven {url 'https://maven.aliyun.com/reposity/jcenter' } ...

Android studio 描述简单bug解决之compileDebugJavaWithJavac

今天想写博客这天周五,在公司,SVN上合并了代码<em>之后</em>,以为今天的工作可以告一段落了,结果还没歇会儿看点其他啥的,测试人员过来说有bug,需要看下,结果跑过去一看是老版本的问题,没事,马上编出测试版给你再看。于是,再次打开AS开始编译apk了,出bug了!还是如此简单的描述:Execution failed for task ':app:compileDebugJavaWithJavac'看到这里,...

app:compileDebugJavaWithJavac 解决方案

Android Studio配置androidannotations 出现 Error:Execution failed for task ':app:compileDebugJavaWithJavac'。      在github翻看androidannotations,终于找到了问题所在。      1.androidannotations配置环境,要求在最新的的SDKtools, Bui

Android Studio 你需要掌握的Debug技巧(上)

Android Studio 你需要掌握的Debug技巧(上)对所有程序猿来说,写代码最让人头疼的不是某个难以实现的功能,而是辛辛苦苦码完代码却发现自己的程序里面存在着这样或那样的Bug。尤其是碰到那种让你绞尽脑汁,修改了无数次都解决不了的Bug。我相信,很多朋友都会有这样的经历。对于开发者来说,几个小的Bug也许看上去问题不大,可如果不及时解决,一旦积累起来,轻则会影响用户体验,重则可能会使整个系

:app:compileDebugJavaWithJavac 问题分析

报这个错误根本就不知道什么问题,报这个错误的原因很多,没有一个统一的,所以百度了一下,也有很多的解决方法: Android <em>studio</em> 描述简单bug解决之compileDebugJavaWithJavac 异常:Error:Execution failed for task ':app:compileDebugJavaWithJavac'. &gt; Compilation failed;...

运行flutter app报错WARNING: API 'variant.getJavaCompile()' is obsolete and has been replaced with 'varia

<em>运行</em>flutter app报错WARNING: API 'variant.getJavaCompile()' is obsolete and has been replaced with 'variant.getJavaCompileProvider()'. 新建第一个flutter项目<em>运行</em>时报错提示getJavaCompile方法过期,提示如下: WARNING: API 'variant...

app:javaPreCompileDebug和transformDexArchiveWithExternalLibsDexMergerForDebug

出现这个错误<em>之后</em>在App的build.gradle(Module:app) Error:Execution failed for task ':app:javaPreCompileDebug'. > Annotation processors must be explicitly declared now.  The following dependencies on the compile

API 'variant.getJavaCompiler()' is obsolete and has been replaced with 'variant.getJavaCompileProvid...

WARNING: API 'variant.getJavaCompiler()' is obsolete and has been replaced with 'variant.getJavaCompileProvider()'.It will be removed at the end of 2019.For more information, see https://d.android.com...

难,搞了1星期了,关于gradle的task无法执行的问题

task compilesingle(type: JavaCompile) { println("compilesingle"); source = './src/main/java' include

gradle 与 gradlew不是内部或外部命令,也不是可运行的程序或批处理文件的问题。

在编辑项目时遇到报错: org.gradle.api.tasks.TaskExecutionException: Execution failed for task ':app:processDebugResources'. ...... 根据经验应该是项目里的资源文件问题,要想获取更详细的信息一般在命令行里执行: gradlew compileDebugSource --stacktra...

gradlew的用法

Android Studio太笨重太<em>卡</em>顿!对项目进行简单调整,杀鸡焉用牛刀?在项目根目录下执行gradlew assembleDebug命令,还可以携带--stacktrace参数输出可能发生的异常信息。生成.apk文件可放到nginx服务器的html目录中,供与电脑处于同一无线局域网的手机下载。 Android Studio太笨重太<em>卡</em>顿!对项目进行简单调整,杀鸡焉用牛刀?在项目根目录下

kotlin module WARNING: API 'variant.getPackageLibrary()' is obsolete and has been replaced with

WARNING: API 'variant.getPackageLibrary()' is obsolete and has been replaced with 'variant.getPackageLibraryProvider()' module的build.gradle里面内容 apply plugin: 'com.android.library' apply plugin: 'ko...

【Android开发】&variant.getJavaCompiler()' is obsolete and has been replaced 'variant.getJavaCompile

更新Android Studio后,再配置gradle出现如题的错误。最后找到了原因。原来是gradle3.4.1对api做了相应的调整。 现在只要调整一下gradle为3.2.1即可。

Android Build Gradle 升级常见问题

问题1: WARNING: API 'variant.getAssemble()' is obsolete and has been replaced with 'variant.getAssembleProvider()'. It will be removed at the end of 2019. For more information, see https://d.android.co...

gradlew compileDebugSources

遇到错误,在terminal中输入gradlew compileDebugSources

API 'variantOutput.getPackageApplication()' is obsolete and has been replaced 解决方案

原代码: applicationVariants.all { //判断是release还是debug版本 def buildType = it.buildType.name def fileName //下面的channel是获取渠道号,每个人定义的渠道号可能不一样。具体可以用println it...

androidstudio编译失败时查错方法

例如我遇到的错误为Execution failed for task ‘:app:processDebugResources’ 但没有显示到底是哪里错了。 你可以尝试执行如下命令: ./gradlew assembleDebug --stacktrace 有三个参数可选: 1. –stacktrace 获取堆的跟踪信息 2. –debug 获取更多的log信息 3. –scan...

AndroidStudio报compileMiguDebugJavaWithJavac异常的定位

在Android开发过程中,因为各种不同的原因,Android<em>studio</em>总是会报出:Execution failed for task ':main:compileMiguDebugJavaWithJavac’这样的错误,莫名其妙的。 What went wrong: Execution failed for task ':main:compileMiguDebugJavaWithJavac'....

ant build在compile javac住不动

build.xml部分: encod

WARNING: API 'variantOutput.getProcessResources()' is obsolete and has been replaced with 'variantOu

在Android Studio3.3.2版本中使用ButterKnife8.8.1,出现这样一个警告,可以删去模块中的应用 apply plugin: 'com.jakewharton.butterknife' 在实际开发过程中还能使用ButterKnife进行绑定,暂时还没有发现有什么影响。 ...

还在用android.support?该考虑迁移AndroidX了!

AndroidX是Google 2018 IO 大会推出的新扩展库,主要是对Android 支持库做了重大改进。与支持库一样,AndroidX 与 Android 操作系统分开提供,并与各个 Android 版本向后兼容,可以说AndroidX就是为了替换Android支持库而设计的。 AndroidX是什么? AndroidX 是 Android 团队用于在 Jetpack 中开发、测试、打...

Android studio 升级失败后打不开

Internal Error. Please report to https://code.google.com/p/android/issues java.lang.RuntimeException

更新至gradle3.3.0后,variant.getJavaCompile()和variantOutput.getPackageApplication()警告的原因

WARNING: API 'variant.getJavaCompile()' is obsolete and has been replaced with 'variant.getJavaCompileProvider()'. It will be removed at the end of 2019. WARNING: API 'variantOutput.getPackageApplication()' is obsolete and has been replaced with 'variant.

Configuration 'compile' is obsolete and has been replaced with 'implementation'. It will be removed

AndroidStudio<em>升级</em>过程中,真的是一脚一个坑啊,好不容易解决完前面的问题,新问题又来了。 Configuration 'compile' is obsolete and has been replaced with 'implementation'. It will be removed at the end of 2018 大概意思是在2018年底,compile配置项将被‘im...

Android Bug variant is not signed

currently selected variant is not signed. Please specify a signing configuration for this variant 1.签名配置 android{ signingConfigs { release { keyAlias 'key0' keyPasswo...

关于更新Android Studio后报错,求大神解答。

<em>运行</em>新的APP是顺便更新了下Android Studio,完事了再<em>运行</em>其他项目都是<em>一直</em>报这个错误,在站里搜帖子说是apk保存地址中的output.json文件的问题,删除掉就好了,我照做还是报一样的错

Android Studio导入项目遇到的一些问题

    初学Android,现在用的是Android Studio 3.1,gradle版本是4.4。在导入看的书配套的源代码的时候,因为书上用的ide版本是2.3,gradle版本也不对,build时报了这样的警告:    Configuration 'compile' is obsolete and has been replaced with 'implementation'.It will...

Android Studio编译出错

Error:java.io.FileNotFoundException: D:\android\asworkspace\OkHttpDemo\app\build\intermediates\res\merged\debug\drawable-xxxhdpi-v4\abc_btn_check_to_on_mtrl_000.png (请求的操作无法在使用用户映射区域打开的文件上执行。) ![图片说明](https://img-ask.csdn.net/upload/201611/21/1479711922_440344.png)

gradlew检查命令

gradlew compileDebug --stacktrace -info 在命令行中进入项目的根目录,或者可以在Android <em>studio</em>的Terminal中直接操作也可以,然后敲入一个命令: gradlew compileDebug --stacktrace -info 或者: gradlew compileDebug --stacktrace -debug 我直接用了这个命令,这个显示...

异常:Error:Execution failed for task ':app:compileDebugJavaWithJavac'. > Compilation failed; see the c...

碰到这个异常我也是挺无语的,因为Android Studio根本不会提示你详细的错误信息。 我们来看看这个博主:http://blog.csdn.net/runner__1/article/details/53482565 我就是借鉴他找错的经历找到错误的 在命令行中进入项目的根目录,或者可以在Android <em>studio</em>的Terminal中直接操作也可以,然后敲入一个命令: g...

Compilation failed; see the compiler error output for details:

Compilation failed; see the compiler error output for details. 编译失败了;有关详细信息,请参见编译器错误输出。 关于这个问题 我真的无力吐槽 这个问题导致我<em>卡</em>了几个小时不停的更改配置 不停的跑app 重新<em>运行</em> 下载补丁 插件 !! 在这里记录一下 这个错误的解决方法 : 一来 加深自己的印象 不要下次遇到再懵逼 白白浪费几个...

Android Studio的坑爹问题,没有提示哪一行错误,只有报了个空指针和我没有见过的东西

11-07 20:46:31.639 972-972/com.example.xjsoft.myapplication E/AndroidRuntime: FATAL EXCEPTION: main

看到大量的Android代码使用e.printStackTrace来输出错误信息,从哪里看?

这东西从哪里看?

Android studio报错:app:mergeDebugResources FAILED(记一次痛苦不堪的debug)

1、问题背景 最近接手了一个Android开发项目,由于之前的开发人员是用Android <em>studio</em>开发的,并且用的Android6.0的API,因此我之前用的eclipse就不能支持了,于是正式安装了Android <em>studio</em>,来体验一下google官方推荐的开发工具感觉如何。我的版本是2.2.2 2、问题描述 昨天上午,我在app中添加了一个activity并为之配了相应的布局文件,

android studio 开启gradlew 调试

首先用到android <em>studio</em> 的remoteDebug功能,创建一个remote 其次,开启gradle的debug模式,-Xdebug -Xrunjdwp:transport=dt_socket,server=y,suspend=y,address=5005 网上查到的都是在terminal中执行 export GRADLE_OPTS=&amp;amp;quot;-Xdebug -Xrunjdwp:transpo...

关于Exception.StackTrace详细错误信息的问题

Exception.StackTrace在本地可以捕捉到文件名、方法、行号等详细错误信息,上传到服务器后,就只能显示出错的方法名称了,不知道大虾们有没有碰到过这个问题,这个和服务器设置有哪些关系?

gradlew常用命令

gradlew常用命令 gradlew -v 版本号 gradlew clean 清除工程目录下的build文件夹 gradlew build 检查依赖并编译打包 这里注意的是 gradlew build 命令把debug、release环境的包都打出来,如果正式发布只需要打Release的包,该怎么办呢,下面介绍一个很有用的命令 assemble, 如 gradlew assembleDebug

AndroidStudio Gradle:Resolvedependencies':app:_debugCompile' 问题解决纪录

AndroidStudio Gradle:Resolvedependencies':app:_debugCompile' 问题解决纪录

Android Studio中的六种依赖

在Android Studio中有六种依赖 Compile,Provided,APK,Test compile,Debug compile,Release compile Compile compile是对所有的build type以及favlors都会参与编译并且打包到最终的apk文件中。 Provided Provided是对所有的build type以及favlors...

【Gradle】管理库工程release及debug

背景:目前工程中是通过手动在代码中修改debug及release变量,这十分低效并且极易遗忘而造成低级错误。需求是什么?1.genkins上打aar包时候,直接根据genkins参数设置来决定打debug还是release包 2.本地工程依赖,需要能区分依赖debug还是release版本库工程打包所遇到问题: Library projects only publish their relea

解决Android Studio在Gradle:Resolve dependecies 'app:_debugCompile'问题

关键代码 maven { url 'http://maven.oschina.net/content/groups/public/' } 完整代码 build.gradle(Project: AHelloworld) // Top-level build file where you can add configuration options common to all sub-proje

android 添加依赖出现Failed to resolve:"你添加的依赖名" 或者出现 debug@Compileclasspath问题

首先出现的问题是debug@Compileclasspath的问题,经过一波百度<em>之后</em>都说是AS build.gradle版本3.0以上的问题,但是经过一波修改<em>之后</em>并没有什么卵用,并没有解决这个问题,并且出现了新的问题,就是Failed to resolve:.......这个问题了,这面贴下终极解决方案,希望可以帮到你。 问题截图: 解决方案:在整个工程的build.gradle中添加以...

Android 在Gradle:Resolve dependencies':app:_debugCompile'

Android <em>卡</em>在Gradle:Resolve dependencies’:app:_debugCompile’ 的原因为Gradle默认每次编译都会resolve dependencies,每次都会去进行网络请求。 所以在保证所有的库已经正确下载完整的情况下,可以更改为offline模式。另外命令执行gradle task的时候,也会出现该情况,所以这个时候,执行命令的时候后面加入–offl

AndroidStudio Gradle:Resolvedependencies':app:_debugCompile' 问题

问题描述: 第一次使用AndroidStudio打开已经存在的AndroidStudio项目,<em>卡</em>在Gradle:Resolvedependencies':app_debugCompile'步骤,即使进入了AndroidStudio界面也无法正常下载Gradle依赖,无法编译<em>运行</em>。 记住主要的无法正常下载Gradle导致的!!! 解决办法: 1、联网下载 2、自己下载,ID

安卓错误Could not resolve all files for configuration ':app:debugCompileClasspath'.等

 What went wrong: Could not resolve all files for configuration ':app:debugCompileClasspath'. &amp;gt; Could not find any version that matches com.android.support:support-annotations:27.+.   Versions that...

Resolving configuration 'debugCompile' directly is not allowed

持续更新使用AndroidStudio使用当中遇到的问题,最近挣到新公司,阅读项目代码时发报了一个错误FAILURE: Build failed with an exception.* What went wrong: Could not determine the dependencies of task ':app:extractIncludeDebugProto'. > Resolving c

AS导入项目出现 Gradle:Resolvedependencies':app:_debugCompile'

导入的android项目,Gradle版本一致,编译工具一致,但是就是<em>一直</em><em>卡</em>在这里啊!!

Android 新建工程 在Gradle:Resolve dependencies':app:_debugCompile'

今天更新androidSDK 到5.0,发现新建工程时<em>卡</em>在Gradle:Resolvedependencies':app:_debugCompile' 首先,googledevelop是访问不了的,如果可以就没这事了。(折翼的天使) 其次,我早以在android-<em>studio</em>/bin/idea.properties末尾添加了disable.android.first.run=true

WARNING: API 'variantOutput.getPackageApplication()' is obsolete and has been replaced with

时隔这么久,又想写点东西了,正好今天<em>升级</em>旧项目的时候发现一个小问题,就记录一下。 首先,在修改gradle的时候,发现了这个问题,大意就是getPackageApplication已经被getPackageApplicationProvider替换了。 WARNING: API 'variantOutput.getPackageApplication()' is obsolete and h...

databinding新手 Execution failed for task ':app:compileDebugJavaWithJavac'

话说头一回使用databinding,删删改改不知道最后哪里写错了,编译可以通过,就是不能<em>运行</em>,而且报错不能定位信息。表示很尴尬,弄了一上午,终于找到了一个前辈的文章,发现和他的错一样,我就按照他的方法进行排查,首先我报的错误如下org.gradle.api.tasks.TaskExecutionException: Execution failed for task ':app:compileD...

Execution failed for task ':app:compileDebugJavaWithJavac'

错误日志:Error:Execution failed for task ‘:app:compileDebugJavaWithJavac’. Failed to create MD5 hash for file ‘D:\android <em>studio</em> work space\work06\WrAndroid\app\libs\yunba-sdk-release1.8.0.jar’. 解决方法: 在

Execution failed for task ':app:compileDebugJavaWithJavac'错误解决

错误提示:org.gradle.api.tasks.TaskExecutionException: Execution failed for task ':app:compileDebugJavaWithJavac'. at org.gradle.api.internal.tasks.execution.ExecuteActionsTaskExecuter.executeActions(Execu...

compileDebugJavaWithJavac 错误解决

错误: compileDebugJavaWithJavac 解决方法: 报这个错的原因贼多了。 想要知道具体的错误是什么。 就去File》Setting》Compile的Command-line Options里面输入–debug并确认 再<em>运行</em>一次就可以看到更详细的错误是什么了。

大学四年自学走来,这些私藏的实用工具/学习网站我贡献出来了

大学四年,看课本是不可能<em>一直</em>看课本的了,对于学习,特别是自学,善于搜索网上的一些资源来辅助,还是非常有必要的,下面我就把这几年私藏的各种资源,网站贡献出来给你们。主要有:电子书搜索、实用工具、在线视频学习网站、非视频学习网站、软件下载、面试/求职必备网站。 注意:文中提到的所有资源,文末我都给你整理好了,你们只管拿去,如果觉得不错,转发、分享就是最大的支持了。 一、电子书搜索 对于大部分程序员...

Linux 下C语言编程下载

Linux操作系统下C语言编程入门(普通下载)Linux操作系统下C语言编程入门(普通下载) 相关下载链接:[url=//download.csdn.net/download/baiyangzdc/2022801?utm_source=bbsseo]//download.csdn.net/download/baiyangzdc/2022801?utm_source=bbsseo[/url]

FLASH素材大海4下载

美丽大海,静与动结合,给人振奋,给人动力,FLASH素材更是好的体现了大的动态美与静态美的结合。 相关下载链接:[url=//download.csdn.net/download/ygh00200/2636505?utm_source=bbsseo]//download.csdn.net/download/ygh00200/2636505?utm_source=bbsseo[/url]

51单片机串行通信下载

51单片机串行通信,使用串口USART/UART进行双机通信,收发数据,包括发送端程序和接收端程序 相关下载链接:[url=//download.csdn.net/download/rootcode/10560948?utm_source=bbsseo]//download.csdn.net/download/rootcode/10560948?utm_source=bbsseo[/url]

我们是很有底线的