编译库libtomcrypt时,报了一大堆错误,帮忙看看,谢谢! [问题点数:50分]

Bbs1
本版专家分:19
结帖率 83.33%
Bbs7
本版专家分:29437
版主
Blank
优秀版主 2014年11月论坛优秀版主
Blank
黄花 2013年12月 VC/MFC大版内专家分月排行榜第二
Blank
蓝花 2014年2月 VC/MFC大版内专家分月排行榜第三
2013年11月 VC/MFC大版内专家分月排行榜第三
Bbs1
本版专家分:19
Bbs10
本版专家分:134285
Blank
进士 2018年总版新获得的技术专家分排名前十
Blank
银牌 2019年5月 总版技术专家分月排行榜第二
Blank
铜牌 2019年4月 总版技术专家分月排行榜第三
2019年3月 总版技术专家分月排行榜第三
Blank
红花 2019年5月 VC/MFC大版内专家分月排行榜第一
2019年4月 VC/MFC大版内专家分月排行榜第一
2019年3月 VC/MFC大版内专家分月排行榜第一
2019年1月 VC/MFC大版内专家分月排行榜第一
2018年12月 VC/MFC大版内专家分月排行榜第一
2018年11月 VC/MFC大版内专家分月排行榜第一
2018年10月 VC/MFC大版内专家分月排行榜第一
2018年9月 VC/MFC大版内专家分月排行榜第一
2018年8月 VC/MFC大版内专家分月排行榜第一
2018年5月 VC/MFC大版内专家分月排行榜第一
2018年4月 VC/MFC大版内专家分月排行榜第一
2018年3月 VC/MFC大版内专家分月排行榜第一
2018年2月 VC/MFC大版内专家分月排行榜第一
2018年1月 VC/MFC大版内专家分月排行榜第一
2017年12月 VC/MFC大版内专家分月排行榜第一
2017年11月 VC/MFC大版内专家分月排行榜第一
2017年7月 VC/MFC大版内专家分月排行榜第一
2012年7月 VC/MFC大版内专家分月排行榜第一
控制器创建时的相关报错
<em>错误</em>信息 -[UIViewController _loadViewFromNibNamed:bundle:] loaded the &quot;MyPictureView&quot; nib but the view outlet was not set. 通过xib加载控制器view时,没有设置控制器的view属性 -[UITableViewController load...
LibTomCrypt在cb中编译的注意事项
1、把LibTomCrypt添加到项目中,按照算法包里的VC项目,添加相关宏定义:LTM_DESC;WIN32;_LIB;LTC_SOURCE;USE_LTM 使用LTM_DESC和USE_LTM,会需要LibTomMath数学包支持,下载Math包,使用Make -f makefile.bcc<em>编译</em>。 使用LTC_EASY<em>编译</em>,不需Math库支持。 2、<em>编译</em>成功后,使用该包测试时,链接会出现
libtom简介
 基于Bit位运算的C语言库分析及其应用     1 LibTom工程的简要介绍   LibTom 项目包括开放来源公共领域软件由汤姆St. 丹尼斯用标准C语言写成,他的主页地址是:http://<em>libtomcrypt</em>.org/。   LibTom类库包主要有四个组成部分:LibTomMath、 LibTomCrypt、 LibTomNet, 和 LibTomPoly。
eclipse导入web项目之后会报一大堆错误
解决方法:右击web工程->属性或Build Path->Java Build Path->Libraries-> Add Libray...->Server Runtime ->Tomcat Server 切换到Java Build Path界面中的Orader and Export,选择Tomcat。 按以上方法操作时,若打开Server Runtime后一片空白,需要设置Apac
使用Libtomcrypt RSA/ECC等加密算法到项目中
LibTomCrypt是一个非常不错的加解密开源库,支持C/C++<em>编译</em>,可以支持跨平台.更详细的信息请参考其官网:http://www.libtom.net/  一、材料准备 1、<em>libtomcrypt</em> 2、libtommath 二、将项目增加到自己的项目工程中 以IAR为例子,直接上图片. 另外include路径按照自己项目存放的文件夹路径进行放置,以下是我自己的目录引用
大家帮忙投一票,谢谢
前不久参加了一个电子电脑大赛  用C#写的一个邮件客户端软件支持下吧!!!投票地址:http://www.jxecstac.com/workShow.asp?Id=2181    选D哈,非常感谢 作品截图:   
密码库LibTomCrypt学习记录——(0)LibTomCrypt简介
LibTom系列是加拿大的汤姆St. 丹尼斯用标准C语言写成,该系列库包四个组成部分:LibTomMath、 LibTomCrypt、 LibTomNet,和 LibTomPoly。LibTomMath和LibTomCrypt是最成熟的组成部分。LibTom系列地址是:http://www.libtom.org/ LibTomCrypt是一个简单易用的加密工具,它提供给开发者相当多的大家熟悉的分...
libTomCrypt学习笔记
ibtomcrypt库使用的一点笔记。该文档使用的不是官方的库源代码,而是网上提供的一个我认为是简化的版本,它提供了测试程序样例和borland c++ builder可用的makefile文件。文档中有说明和下载地址。本文的主要内容:1、vc6版本的makefile;2、linux(fedora14)版本的makefile
snmp++库文件编译
现在agent++ 网站上的SNMP版本是3.3.4,但是根据网上所有的教程来操作,包括为数不多的一本书:《visual c++开发基于SNMP的网络管理软件》,也不能实现<em>编译</em>成静态链接库文件,经过一天的摸索(包内文档的readme很重要),终于完成了<em>编译</em>,我觉得最主要的问题还是要了解VS的<em>编译</em>环境,缺什么就加什么。 篇幅较长,觉得啰嗦照图操作 首先下载三个文件解压完成并复制到同一文件夹SNM...
密码库LibTomCrypt学习记录——(1.3)分组密码算法——AES算法的函数和使用流程介绍
LibTomCtypt中AES的描述子有两个,rijndael_desc和aes_desc,这二者除了name有区别外别的都一样,因此aes和rijndael是等效的。 注意:VC<em>编译</em>AES的时候记得将aes_table.c设置为“exclude file from build”,别的带_table的c文件类似。“exclude file from build”的设置方式为:右键点击aes_ta...
c语言链表的程序 ,建立,删除,插入
这个程序我编了好久请大家<em>帮忙</em><em>看看</em>,有<em>错误</em>的请告诉我一声,<em>谢谢</em>
Eclipse 导入已有工程出现一堆编译错误
用Eclipse导入现有Adnroid工程,<em>编译</em>后出现很多<em>错误</em>,原来的字符串变成了乱码,字符串左边是一个双引号,右边则没有对应双引号而是一个乱码,因此<em>编译</em>不通过。 由于<em>错误</em>太多,手动修改不太现实。   解决方法: 点击工程右键 -> 属性(properties) -> 资源(resource) -> Text file encoding ,选择Other -> UTF-8 ,再次<em>编译</em>即可。
调试出现一大堆错误···
1>c:\program files\microsoft sdks\windows\v6.0a\include\tlhelp32.h(30) : error C2146: 语法<em>错误</em> : 缺少“;”(在标识符“WINAPI”的前面)1>c:\program files\microsoft sdks\windows\v6.0a\include\tlhelp32.h(30) : error C4430:
密码库LibTomCrypt学习记录——(1.1)分组密码算法——算法描述子cipher_descriptor
LibTomCtypt中为密码算法定义了一个算法描述子cipher_descriptor,可以把它理解为一个类,里面描述了密码算法应该有的变量和函数操作。密码算法描述子的详细描述可以参见tomcrypt_cipher.h   extern struct ltc_cipher_descriptor {    char *name;            // 密码算法名,最后一个会被置为NUL...
VS编译程序遇到gl.h很多出错
原因是没有加入windows.h
错误的提示
虚拟机<em>错误</em>的提示,<em>帮忙</em><em>看看</em>
全局Hook失败.......
窗口失去焦点时, 钩子钩不到消息, 哪位大侠<em>帮忙</em><em>看看</em>,给小弟指点迷津~<em>谢谢</em>!
ssm例子一直报错userDao无法注入
哪个大神<em>帮忙</em><em>看看</em>,<em>谢谢</em>啦
使用LibTomCrypt实现RSA加密解密算法,公钥、私钥分离
最近研究非对称算法,发现LibTomCrypt库算法完善并且方便,但网上的实现了RSA算法的并不多,有实现了RSA算法的代码,但是加密和解密使用的是一套KEY没有体现出非对称算法的概念。这段代码生成key后提取了公钥和私钥,多次算法验证并记录加密解密时间,欢迎下载。
C++编译过程中的错误集锦集锦(持续更新)
C++<em>编译</em><em>错误</em>信息集锦 1、fatal error C1010: unexpected end of file while looking for precompiled header directive。   寻找预<em>编译</em>头文件路径时遇到了不该遇到的文件尾。 就是没有找到预<em>编译</em>指示信息的头文件。(一般是没有#include "stdafx.h")  问题一般发生在:通过添加文件的方式,添加了一
VS2013 编译VC6.0等比较老版本的MFC工程字符集错误问题的解决方法
用VS2013<em>编译</em>网络上一些用比较老版本的VS写的MFC程序总会出现字符集<em>错误</em>问题,原因是2013取消了对 (MBCS) 库的多字节字符集的默认支持,改成
求助打印预览的问题!
请<em>帮忙</em>解决,<em>谢谢</em>! 请<em>帮忙</em>解决,<em>谢谢</em>! 请<em>帮忙</em>解决,<em>谢谢</em>! 请<em>帮忙</em>解决,<em>谢谢</em>! 请<em>帮忙</em>解决,<em>谢谢</em>!
只有vb6下不能加载的ocx
<em>谢谢</em>大家<em>帮忙</em>测试<em>谢谢</em>大家<em>帮忙</em>测试<em>谢谢</em>大家<em>帮忙</em>测试<em>谢谢</em>大家<em>帮忙</em>测试
opencv3.4.1和opencv_contrib编译安装出错合集
系统:win7 VS:2017版 opencv:3.4.1 opencv_contrib:3.4.1 cmake: 3.11 因为官网下的opencv解压后没有tracking这个包,所以就自己用cmake重新<em>编译</em>了一下。安装过程就不放了,网上很多。这里列一下自己踩过的坑: 1. opencv和opencv_contrib版本一定要配套,不要这个网站下一个那个网站下一个免得版本不匹配...
stm32 标准库一些比较容易犯的错误
1,忘记给开模块时钟,特别是GPIO  AF 等功能,结果调试了半天,发现某个功能模块功能不正常,不过这个<em>错误</em>很好发现,在DEBUG模式下,查看一下对应模块的寄存器是否被赋值,如果左边情况多半是模块时钟没打开!RCC_AHBPeriphClockCmd( RCC_AHBPeriph_GPIOC | RCC_AHBPeriph_GPIOD , ENABLE);RCC_APB1PeriphClockC...
使用libTomCrypt库实现RSA编程源代码
使用libTomCrypt库实现RSA编程源代码
帮忙看看错误。。。谢谢
rn------------------------------------rn注释的那段总报有<em>错误</em>。。。很郁闷。。。。难道不能这样用吗???rn<em>帮忙</em><em>看看</em>。。。。<em>谢谢</em>rn
libjpeg库源码编译_win平台
使用vs2008 IDE<em>编译</em>libjpeg的各版本库: 1、解压源码文件,将jconfig.vc更名为jconfig.h 2、打开vs2008,新建一空的dll工程,添加源码根目录下的所有头文件,添加makelib.ds    中的与*.obj同名的.c文件。设置相应的工程输出目录。 3、右键工程,添加新建项->模块定义文件即可分别<em>编译</em>win64, win32下的debug和release
xcode上提示很多错误,但能编译。 解决办法
有少数开发者会遇到一个问题,就是在code上,bi a
boost使用log库编译报错
使用boost的log,用以下链接选项:-lboost_system -lboost_thread -lboost_log -lboost_log_setup -lboost_filesystem -lpthread当使用add_console_log函数<em>编译</em>链接时报错:/usr/local/gcc/bin/g++ ../obj/timerServer.o ../obj/CWatchThread....
密码学 hash算法实验代码及报告
利用<em>libtomcrypt</em>库进行sha1、sha512等的值计算
c++编译时常见的几个错误
因问题可能会很多,后面会不断的进行更新。如果那里不好请不吝赐教。1.requestfor member XXX which is of non-class type 'YYY'XXX是指针, 但是引用其成员的时候使用了&quot;.&quot;, 把它当作一般的变量使用了, 这样就会导致这个<em>编译</em><em>错误</em>.2.new typesmay not be defined in a returntype类的声明时别忘了加上分号!3...
密码库LibTomcrypt
关于密码学的介绍,很好很强大 嘿嘿 大家多多支持啊
Hadoop几本相关经典学习书籍打包上传
Hadoop经典学习数据 打包上传,包括: concepts+techniques-中英文版 Hadoop MapReduce Cookbook Hadoop集群与安全 Hadoop技术内幕:深入解析MapReduce架构设计i与实现原理 Hadoop技术内幕:深入解析YARN架构设计与实现原理 PrinciplesofDataMining
密码库LibTomCrypt学习记录——(1.4)分组密码算法——AES-NI指令与AES的速度
英特尔在比较新的CPU上提供了AES-NI指令,可以直接调用这些指令来进行AES加解密。关于此指令的速度提升情况,各方反应不一,最高有说提高17倍的,有说提高8-9倍左右的,还有说提高一半左右的。这可能和各人的测试平台和倾向都不一样,因此结果各有差别。      CPU是否支持AES-NI可以使用英特尔AES-NI白皮书中的函数检测。白皮书中所述检测为: checking CPUID.01H:...
RSA编程实验——使用libTomCrypt库
密码学实验五 编程实现RSA加解密程序,要求: 1. 调用LibTomCrypt库函数实现 2. 程序输入:文本串 s 3. 使用RSA算法对s加密,输出加密结果s’ 4. 解密s’ ,得到明文s’’, 比较s与s’’是否相同 5. 加解密过程要求支持RSAES-OAEP和RSAES-PKCS1-V1_5两种机制 6. 相同密钥对条件下, 多次对s加密,比较每次加密得到的s’是否相同.
关于opencv编译报无法解析错误的几点分析总结
下面经常是初学者会遇到的<em>错误</em>,如:error LNK2019: 无法解析的外部符号 _cvWaitKey,该符号在函数 _main 中被引用,像这类问题主要的原因如下: 1、是不是没有将lib库以及在文件属性里面的链接器的输入中没有将lib库的名称都输入 2、建工程的位数和opencv文件所支持机器处理位数是否相同一致,有些opencv自己<em>编译</em>的库要看最终是x86的还是x64的,这个要跟工程所
CMake编译OpenCV中遇到的问题
0 有以下五个文件无法下载,导致<em>编译</em>失败ffmpeg_version.cmakeopencv_ffmpeg.dllopencv_ffmpeg_64.dllippicv_2017u2_win_intel64_20170418.zipippicv_2017u2_win_ia32_20170418.zip1 需要自己“合成”下载地址(以opencv_ffmpeg.dll为例,其余的方法相同):打开D:\...
用C#做的简单计算器
这是我刚学C#做的,计算器可能还有<em>错误</em>。望各位<em>帮忙</em>再做改造!<em>谢谢</em>!!
自己写的链表
自己编的一段链表代码,可能对你有用,<em>错误</em>之处请<em>帮忙</em>修改一下,<em>谢谢</em>
用PB做的库存管理系统
库存管理系统的论文,有<em>错误</em>大家谅解,大家可以<em>帮忙</em>找找错的地方,<em>谢谢</em>
textbox keydown事件
在textbox1按上下键,就会有我说的那个<em>错误</em> <em>谢谢</em>大家<em>帮忙</em>
vs2005运行时库
vs2005 工程运行需要的时库,如果使用vs2005 /MDd <em>编译</em>的工程在没有vs2005环境时运行,请添加这个时库,来避免配置<em>错误</em>的提示
错误一大堆,高手帮我看看
:\microsoft visual studio\vc98\include\gdiplusinit.h(39) : error C2065: 'ULONG_PTR' : undeclared identifierrnd:\microsoft visual studio\vc98\include\gdiplusinit.h(39) : error C2065: 'token' : undeclared identifierrnd:\microsoft visual studio\vc98\include\gdiplusinit.h(39) : error C2165: 'left-side modifier' : cannot modify pointers to datarnd:\microsoft visual studio\vc98\include\gdiplusinit.h(39) : error C2071: 'NotificationHookProc' : illegal storage classrnd:\microsoft visual studio\vc98\include\gdiplusinit.h(40) : error C2146: syntax error : missing ')' before identifier 'token'rnd:\microsoft visual studio\vc98\include\gdiplusinit.h(40) : error C2165: 'left-side modifier' : cannot modify pointers to datarnd:\microsoft visual studio\vc98\include\gdiplusinit.h(40) : error C2071: 'NotificationUnhookProc' : illegal storage classrnd:\microsoft visual studio\vc98\include\gdiplusinit.h(40) : error C2059: syntax error : ')'rnd:\microsoft visual studio\vc98\include\gdiplusinit.h(91) : error C2059: syntax error : 'const'rnd:\microsoft visual studio\vc98\include\gdiplusinit.h(97) : error C2146: syntax error : missing ')' before identifier 'token'rnd:\microsoft visual studio\vc98\include\gdiplusinit.h(97) : warning C4229: anachronism used : modifiers on data are ignoredrnd:\microsoft visual studio\vc98\include\gdiplusinit.h(97) : error C2182: 'GdiplusShutdown' : illegal use of type 'void'rnd:\microsoft visual studio\vc98\include\gdiplusinit.h(97) : error C2059: syntax error : ')'rnd:\microsoft visual studio\vc98\include\gdiplusflat.h(25) : warning C4005: 'GDIPCONST' : macro redefinitionrn d:\microsoft visual studio\vc98\include\gdiplusmem.h(28) : see previous definition of 'GDIPCONST'rnColorQuantizer.cpprnd:\microsoft visual studio\vc98\include\gdiplusinit.h(39) : error C2065: 'ULONG_PTR' : undeclared identifierrnd:\microsoft visual studio\vc98\include\gdiplusinit.h(39) : error C2065: 'token' : undeclared identifierrnd:\microsoft visual studio\vc98\include\gdiplusinit.h(39) : error C2165: 'left-side modifier' : cannot modify pointers to datarnd:\microsoft visual studio\vc98\include\gdiplusinit.h(39) : error C2071: 'NotificationHookProc' : illegal storage classrnd:\microsoft visual studio\vc98\include\gdiplusinit.h(40) : error C2146: syntax error : missing ')' before identifier 'token'rnd:\microsoft visual studio\vc98\include\gdiplusinit.h(40) : error C2165: 'left-side modifier' : cannot modify pointers to datarnd:\microsoft visual studio\vc98\include\gdiplusinit.h(40) : error C2071: 'NotificationUnhookProc' : illegal storage classrnd:\microsoft visual studio\vc98\include\gdiplusinit.h(40) : error C2059: syntax error : ')'rnd:\microsoft visual studio\vc98\include\gdiplusinit.h(91) : error C2059: syntax error : 'const'rnd:\microsoft visual studio\vc98\include\gdiplusinit.h(97) : error C2146: syntax error : missing ')' before identifier 'token'rnd:\microsoft visual studio\vc98\include\gdiplusinit.h(97) : warning C4229: anachronism used : modifiers on data are ignoredrnd:\microsoft visual studio\vc98\include\gdiplusinit.h(97) : error C2182: 'GdiplusShutdown' : illegal use of type 'void'rnd:\microsoft visual studio\vc98\include\gdiplusinit.h(97) : error C2059: syntax error : ')'rnd:\microsoft visual studio\vc98\include\gdiplusflat.h(25) : warning C4005: 'GDIPCONST' : macro redefinitionrn d:\microsoft visual studio\vc98\include\gdiplusmem.h(28) : see previous definition of 'GDIPCONST'rnE:\IM\Alice\APP_Client\ColorQuantizer.cpp(508) : error C2664: 'LockBits' : cannot convert parameter 1 from 'class Gdiplus::Rect *' to 'const class Gdiplus::Rect &'rn Reason: cannot convert from 'class Gdiplus::Rect *' to 'const class Gdiplus::Rect'rn No constructor could take the source type, or constructor overload resolution was ambiguousrnE:\IM\Alice\APP_Client\ColorQuantizer.cpp(575) : error C2664: 'LockBits' : rnrnrn报错的是GDI+里面的头文件,怎么回事哦?
ISE14.7编译仿真库后错误的解决方法
主要参考的文章: 安装ISE14.7常见问题以及解决方法 ISE与Modelsim联合使用的方法出现的问题 如何设置ISE与Modelsim的联调   问题: 按照NIGNHECHUAN那个博客安装后,每次通过ISE打开Modelsim后都会提示 这是因为他没有把<em>编译</em>库的目录告诉ISE   解决方法看第一篇文章。 点击这个Process Properties这个 然后...
libtomcrypt开源密码库
DES,AES,RSA,非常全的加密算法密码库。
libtomcrypt库使用
本人想使用<em>libtomcrypt</em>库实现rsa的加密解密,下载了<em>libtomcrypt</em>-1.17,使用vc6.0打开里面的<em>libtomcrypt</em>.dsp文件,<em>编译</em>成功后得到tomcrypt.lib。rn之后我新开一个c项目,吧tomcrypt.lib放在该目录下,然后吧<em>libtomcrypt</em>-1.17文件夹里的Demo中 encrypt.c 的内容取出rn#include rnrnint main(int argc, char *argv[]) rnrn unsigned char plaintext[512],ciphertext[512];rn unsigned char tmpkey[512], key[MAXBLOCKSIZE], IV[MAXBLOCKSIZE];rn unsigned char inbuf[512]; /* i/o block size */rn unsigned long outlen, y, rn......rnrn但<em>编译</em>就多了好多<em>错误</em>rnrsa_main.obj : error LNK2001: unresolved external symbol _cipher_descriptorrnrsa_main.obj : error LNK2001: unresolved external symbol _sprng_descrnrsa_main.obj : error LNK2001: unresolved external symbol _register_prngrnrsa_main.obj : error LNK2001: unresolved external symbol _yarrow_descrnrsa_main.obj : error LNK2001: unresolved external symbol _register_hashrnrsa_main.objrnrn所以,我想知道<em>libtomcrypt</em>库是如何使用的,是否需要依赖其他库,并求一个完整的rsa加解密过程,请各位给点意见,本人qq:78626423
muduo库使用出错解决
collect2: error: ld returned 1 exit status 答:可能是交叉<em>编译</em>器使用不同
帮忙看看这个错误谢谢
我的一个ASP文件里写了这样的代码: rn执行的时候不出现w2.htm的内容,并报告有语法<em>错误</em>,请问这是怎么回事,<em>谢谢</em>各位!
帮忙看看错误谢谢
A OpenFileDialog .hrn#ifndef OPENFILEDIALOG_Hrn#define OPENFILEDIALOG_Hrnrn#include rn#include "QFileDialog"rn#include "QString"rnrnclass OpenFileDialog : public QDialogrnrn Q_OBJECTrnrnpublic:rn OpenFileDialog(QWidget *parent = 0);rn ~OpenFileDialog();rn QString filename;rn;rnrn#endif // OPENFILEDIALOG_HrnrnB OpenFileDialog .cxxrn#include "OpenFileDialog.h"rn#include rn#include rnrnOpenFileDialog::OpenFileDialog(QWidget *parent): QDialog(parent)rn rn QTextCodec::setCodecForTr(QTextCodec::codecForName("UTF-8")) ;rn filename = QFileDialog::getOpenFileName(this,rn tr("选择文件"), rn "", rn tr("Files (*.txt)")); //选择路径 rn if(filename.isEmpty()) rn rn return; rn rnrnrnrnOpenFileDialog::~OpenFileDialog()rnrnrnrnrn1 严重性 代码 说明 项目 文件 行 禁止显示状态rn<em>错误</em> LNK2019 无法解析的外部符号 "public: virtual __cdecl OpenFileDialog::~OpenFileDialog(void)" (??1OpenFileDialog@@UEAA@XZ),该符号在函数 "private: void __cdecl MainImageWindow::on_actionAddTransformInit_2_triggered(void)" (?on_actionAddTransformInit_2_triggered@MainImageWindow@@AEAAXXZ) 中被引用 ITK-SNAP E:\DeepIRT\DeepIRT2.0\SNAP3.6\itksnapui_qt.lib(MainImageWindow.obj) 1 rn2 严重性 代码 说明 项目 文件 行 禁止显示状态rn<em>错误</em> LNK2019 无法解析的外部符号 "public: __cdecl OpenFileDialog::OpenFileDialog(class QWidget *)" (??0OpenFileDialog@@QEAA@PEAVQWidget@@@Z),该符号在函数 "private: void __cdecl MainImageWindow::on_actionAddTransformInit_2_triggered(void)" (?on_actionAddTransformInit_2_triggered@MainImageWindow@@AEAAXXZ) 中被引用 ITK-SNAP E:\DeepIRT\DeepIRT2.0\SNAP3.6\itksnapui_qt.lib(MainImageWindow.obj) 1 rn3 严重性 代码 说明 项目 文件 行 禁止显示状态rn<em>错误</em> LNK1120 2 个无法解析的外部命令 ITK-SNAP E:\DeepIRT\DeepIRT2.0\SNAP3.6\Debug\ITK-SNAP.exe 1 rn
帮忙看看是什么错误,谢谢
//db2abnd.crn#include rn#include rn#include rn#include rn#include rn#include rn#include rn#include rn#include rn#include rn#include rn#include rn#include "usersys.h"rnrnvoid db2abnd(msg_dat)rnstruct msgdata *msg_dat;rnrn int space;rnrn memset((char *)&space,' ',sizeof(int));rnrn if( msg_dat->d.errmno == space )rn rn msg_dat->d.errmno = 0;rn rnrn msg_dat->d.class1 = 9500;rnrn memset(&msg_dat->d.command[7],NULL,1);rn rn sprintf(msg_dat->d.msgdat, "%8s:ERR:DATABASE '%8s' ERROR",rn msg_dat->d.pgname, msg_dat->d.command);rnrn MSnd_Rcv(msg_dat, msg_dat);rnrnrn//usersys.hrn#define UMSGNOLEN 8 /* length of no */ rn#define UMSGIDLEN 16 /* length of id */ rn#define UMSGLEN 80 /* length of message */ rn#define UMSGDTLEN 500 /* length of data */ rn rnstruct MSGDAT rn rn int class1; /* message class1 */ rn int class2; /* message class2 */ rn int errmno; /* error message rn int inpcnt; /* input count */ rn int outcnt; /* output count */ rn int inscnt; /* insert count */ rn int updcnt; /* update count */ rn int delcnt; /* delete count */ rn int fetcnt; /* fetch count */ rn int flsize; /* file size */ rn int sqlcod; /* sqlcode */ rn char command[UMSGNOLEN]; /* command name */ rn char msgno[UMSGNOLEN]; /* message number */ rn char pgname[UMSGIDLEN]; /* program name */ rn char htname[UMSGIDLEN]; /* host name */ rn char tablid[UMSGIDLEN]; /* table name */ rn char userid[UMSGIDLEN]; /* user id */ rn char dispid[UMSGIDLEN]; /* display id */ rn char msgdat[UMSGLEN]; /* message data */ rn char fldata[UMSGDTLEN]; /* data */ rn ; rn rnstruct msgdata rn rn long pid; /* process id */ rn struct MSGDAT d; /* message data */ rn ; rnrn程序<em>编译</em>执行时在if( msg_dat->d.errmno == space )处rn发生<em>错误</em>,提示:Segmentation Fault - core dumpedrn谁能帮我解释一下是什么<em>错误</em>,<em>谢谢</em>。rn rn
VS2010使用第三方库时的一般错误及解决方法
VS2010使用第三方库时的一般<em>错误</em>及解决方法   1.      LINK:fatal error LNK1123: 转换到 COFF 期间失败: 文件无效或损坏 这个是由于日志文件引起的,可以将 项目\属性\配置属性\清单工具\输入和输出\嵌入清单:原来是“是”,改成“否”。 或者将 项目\属性\配置属性\链接器\清单文件\生成清单:原来是“是”,改成“否”。  
五子棋游戏C程序代码,应该还可以,帮忙看看.
这是关于五子棋游戏的C程序代码,已经差不多了,请高手<em>帮忙</em><em>看看</em>,修改修改,<em>谢谢</em>...
libnet 安装后C程序编译仍出现未定义错误
在Linux下安装libnet两种方式: 1:Ubuntu apt-get install libnet-dev 2:下载libnet地址: https://github.com/sam-github/libnet   https://sourceforge.net/projects/libnet-dev/ 下载之后解压,安装 tar -zxvf libnet-1.2-rc3.tar...
C#编程之魔幻战士项目
自己做的 可以参考下 <em>帮忙</em><em>看看</em>哈! 给点意见啊! <em>谢谢</em>侬! (*^__^*) 嘻嘻……
密码库LibTomCrypt学习记录——(2.6)分组密码算法的工作模式——CFB模式
CFB是一种加密模式。密文被反馈当寄存器中为下一个块服务。CFB和OFC工作模式中,密码算法象流密码一样生产出密钥流供异或名密文用。 参考文献 NIST SP 800-38A CFB加解密 记: b为分组的比特大小,比如AES时b=128; s为寄存器中保留上P一个密文的比特长度,1&amp;lt;=s&amp;lt;=b;s通常为1、8、64、128。 P#j ,C#j是明文和密文的一个片段,长s比特...
常量指针和指针常量的区分问题
常量指针和指针常量的区分,如果有人需要,可以下载<em>看看</em>,如果有误,请<em>帮忙</em>改正!<em>谢谢</em>!
解决sublime在编译出错或警告时额外显示系统path的问题
解决sublime在<em>编译</em>出错或警告时额外显示系统path的问题最近在配置sublime text3的C语言环境,但是发现每次运行程序时一旦程序出错或者出现警告。折腾了半天,解决方案如下: 找到sublime text3安装目录,在目录下找到Packages里的Default.sublime-package, 比如Sublime Text 3\Packages\Default.sublime-pack
make menuconfig 常见错误分析
         一:invalid option `abi=aapcs-linux'选项<em>错误</em>scripts/kconfig/conf -s arch/arm/KconfigCHK     include/linux/version.hSYMLINK include/asm-arm/arch -> include/asm-arm/arch-s3c2410make[1]: `include/asm-arm/mach-types
密码学libtomcrypt
密码学基本密码算法的C语言实现,C语言编程可直接调用。
sophus编译错误的解决方法
原链接: https://community.bwbot.org/topic/519 error: optional in namespace Sophus does not name a template type 在使用sophus库的时候可能会遇到如上的<em>错误</em>。这可能是由于系统中安装了ros自带的sohups库的原因。 运行 sudo apt-get remove ros-kinet...
cmake配置opencv的时候出现的错误及解决方法
cmake 配置opencv的时候出现的<em>错误</em>: -- Detected version of GNU GCC: 54 (504) -- Found ZLIB: /usr/lib/i386-linux-gnu/libz.so (found suitable version &amp;quot;1.2.8&amp;quot;, minimum required is &amp;quot;1.2.3&amp;quot;) -- Could NOT find TIFF (m...
FXPLC MODBUS 通讯
有需要的<em>帮忙</em>下载下,我想要5个积分下载个东西,<em>谢谢</em>大家的<em>帮忙</em>,<em>谢谢</em><em>谢谢</em><em>谢谢</em>
vc下通过ado访问数据库
这个是<em>错误</em>的代码,麻烦大家<em>帮忙</em><em>看看</em>问题在哪里,邮箱shulin-543@163.com
ndis驱动 passthru 安装程序
这是ndis驱动的安装程序,不过我<em>编译</em>有<em>错误</em>,请高手<em>帮忙</em>解决!感激不尽
关于VS2017在编译代码时出现奇怪错误的情况分析
事先说明,本文章仅仅对Alex Mercer 写的博客中的代码生效!!! 进入正题: 在复制粘贴代码测试的时候,如果出现了类似于以下的问题: 出现这种奇奇怪怪的现象,不必着急,这是因为代码与代码间的空行太大, <em>编译</em>器无法迅速的找到对应头文件,库,以及变量和函数的定义,甚至是关键字! 解决的方法很简单,直接进行<em>编译</em>。没错!直接进行<em>编译</em> 这是我这里的结果,相信使用VS201...
index.rar JSP的首页
有<em>错误</em>,请大家指教.大家<em>帮忙</em><em>看看</em>程序吧,在这多谢各位了,
MD5加密算法C语言实现
MD5加密算法C语言实现~以<em>libtomcrypt</em>密码库中的MD5算法的实现为例
c3p0数据库连接池报错
今天在做一个转账的案例中,在最后测试的时候突然<em>报了</em>一个<em>错误</em>:Caused by: java.lang.NoClassDefFoundError: com/mchange/v2/ser/Indirector这特异常,查看了一下才发现原来c3p0数据库连接池有一个jar包没有导进去。 导入mchange-commons-java-0.2.3.1.jar这个后就解决了。
用C编写程序计算最大绿灯时间值,算法已给出
大家<em>帮忙</em><em>看看</em>,我邮箱zhangsuxiong@live.cn 请大家<em>帮忙</em><em>看看</em>
ffmpeg 编译常见错误
转自 http://blog.chinaunix.net/uid-26000296-id-4217121.html 一、FFmpeg源代码下载与<em>编译</em> # wget http://www.ffmpeg.org/releases/ffmpeg-0.5.13.tar.bz2 # tar -jxvf ffmpeg-0.5.13.tar.bz2 # vim ffmpeg_
一个简单游戏的程序
简单游戏的程序代码,大神们<em>帮忙</em><em>看看</em>。简单游戏的程序代码,大神们<em>帮忙</em><em>看看</em>。简单游戏的程序代码,大神们<em>帮忙</em><em>看看</em>。简单游戏的程序代码,大神们<em>帮忙</em><em>看看</em>。简单游戏的程序代码,大神们<em>帮忙</em><em>看看</em>。
MATLAB在调用C/C++程序成功,使用opencv库时出错,错误显示“找不到指定模块”(问题未解决)
在利用mex test.cpp后,运行test,<em>编译</em>成功并正常运行 代码如下#include "mex.h" void mexFunction(int nlhs, mxArray *plhs[], int nrhs, const mxArray *prhs[]) { Mat img; double *inData; double *outData; int M,N; i
编译后的opencv库
这个是<em>编译</em>好的OPENCV库V3.3 。本人亲测可行,这个库很好用,而且网上<em>一大堆</em>demo。当时都是基于这个库写的
dsoframer.ocx 2.3.0.0 含源码和ocx
dsoframer.ocx 2.3.0.0 Release comments: 1、增加对OFFICE2007的支持 2、删除2个文件:msword9.h/msword9.cpp <em>编译</em>生成了dsoframer.ocx 1、需要安装VC++6 2、需安装office2007 3、需安装wps office 2005 4、注意msoffice.h文件中的类路径是否正确 注:未测试是否存在问题
vivado与modelsim的关联以及器件库编译
本文转载自:http://www.cnblogs.com/geekite/p/5331995.html 一、在vivado中设置modelsim(即第三方仿真工具)的安装路径。在vivado菜单中选择“Tools”——>“Options...”,选择“General”选项卡,将滚动条拉倒最底部,在“QuestaSim/ModelSim install path”栏中输入或选择modelsim
Eclipse多项目编译假性报错的解决
多个Java项目一起<em>编译</em>时经常会出现不<em>编译</em>,或者报一些假性<em>错误</em>,需要在eclipse选型中勾掉“Abort build when build path errors occur”并将&quot;Circular dependencies&quot;改为Warring,否则出现项目循环依赖等情况就无法<em>编译</em>。出处:http://stevex.blog.51cto.com/4300375/941134...
进行编译qt-x11库出现的问题
如果用gmake无法进行<em>编译</em>,用make。 如果在<em>编译</em>过程中出现  (致命<em>错误</em>): X11/Xlib.h:没有那个文件或目录 是缺少对应的库 用命令 sudo apt-get install libx11-dev 就可以解决了...
Windows装numpy出错问题解决方案
之前学习Python为了省事儿,使用的一直都是Aanconda集成环境,省去了不少安装库文件的操作,但是今天因为特殊原因使用了Python自带的IDLE,又恰巧需要用到numpy,所以不得不手动的给自己的Windows安装一个numpy库和所有人的操作一下,我按下Windows键,输入CMD,点击回车,然后手速极快的输入pip install numpy顺手很豪气的点击一下回车,以为numpy会自...
win7 + VS2017 + tesseract4.0 64位编译失败得到静态库的另外方法
      tesseract3.04在16年的时候便停止了对它的提交更新,因为之前一直用的是3.04版本(后面附上3.04的<em>编译</em>方法),识别率并不是很理想,故重新对tesseract最新的版本进行<em>编译</em>。但是实际总是不理想,报出一堆问题(我使用VS2017 win64,但是除了Unicode那些个字符问题之外还有其他的<em>错误</em>),最后网上找了很多方法都解决不了                    ...
c#语言课本很好的一本书我认为(如果好的话大家帮忙顶下谢谢如果好的话大家帮忙顶下谢谢如果好的话大家帮忙顶下谢谢如果好的话大家帮忙顶下谢谢
这本书是我进公司才开始学的浅显易懂 只要认真2周就就可以学会 如果好的话大家<em>帮忙</em>顶下<em>谢谢</em>如果好的话大家<em>帮忙</em>顶下<em>谢谢</em>如果好的话大家<em>帮忙</em>顶下<em>谢谢</em>如果好的话大家<em>帮忙</em>顶下<em>谢谢</em>如果好的话大家<em>帮忙</em>顶下<em>谢谢</em>如果好的话大家<em>帮忙</em>顶下<em>谢谢</em>如果好的话大家<em>帮忙</em>顶下<em>谢谢</em>!
Excel VBA 提示“找不到工程或库”错误的解决办法
前不久用Excel VBA给采购部做了个“供销存管理系统”,结果在采购部的电脑上运行出现“找不到工程或库”的<em>错误</em>,一般情况下,出现此<em>错误</em>是因为找不到引用工程,或找不到与工程语言对应的引用的对象库,还有就是安装Office精简版也会出现此类<em>错误</em>。   解决方法: 1、在VBE窗口中选择出错的 VBA 工程,快捷键:ALT+F11 2、在 VBA 的主菜单【工具】->【引用】打开引用对话框
RTSP debug消息,请帮忙诊断
一个很简单的RTSP消息片段,前一次正常,后一次就不正常了,反馈403<em>错误</em>,需要诊断,<em>谢谢</em><em>帮忙</em>
数字信号处理的MATLAB函数
这是我搜集到的,比较全的MATLAB数字信号处理函数,值得一看!大家<em>帮忙</em><em>看看</em>有什么<em>错误</em>和补充的。<em>谢谢</em>
GNU regex 正则表达式 修正版
原gnu regex 0.13版本有<em>一大堆</em>warning<em>错误</em>。这个修改版修复了这些warning。支持windows和linux跨平台<em>编译</em>。
LibGeoTiff(已编译可直接使用)
LibGeoTiff(已<em>编译</em>可直接使用),源码官网可下在此不再提供。
vue 安装各种报错、警告相关问题
我觉我简直是个bug体质,安装东西总是会出各种问题,关键还老是忘记,下次再遇到同样的问题又要折腾半天。这次也是,安装一个vue感觉我将可能出现的坑踩了个遍。 1.淘宝镜像安装vue出现警告 <em>错误</em>太多就不一一例举,直接上图 前4个警告是因为node.js的版本太低了,重新下载安装一个高版本的node.js即可,最后一个则是npm版本问题,命令行输入npm install npm@4.6.1...
ARM-Linux-gcc4.3.2交叉编译错误问题
本博文针对arm-linux-gcc4.3.2版本的交叉<em>编译</em>工具出现的常见<em>错误</em>,进行了整理,总结。开发环境: ARM9 (JZ2440开发板) 开放平台: Ubuntu14.04 交叉<em>编译</em>工具: arm-linux-gcc4.3.2一. 解决 uboot1.1.6在arm-linux-gcc-4.3.2版本下<em>编译</em><em>错误</em>问题<em>编译</em><em>错误</em>如下图: 解决方案: 1.修改Makefile文件中的PLAT
Ubuntu 编译nodemcu 报的错
../tools/esptool.py elf2image --flash_mode dio --flash_freq 40m .output/eagle/debug/image/eagle.app.v6.out -o ../bin/ Traceback (most recent call last): File &quot;../tools/esptool.py&quot;, line 26, in &amp;lt;...
tomcat编译jsp是错误帮忙看看谢谢
tomcat运行测试jsp页面HTTP Status 500 <em>错误</em>rnrn没有用过tomcat今天第一天用 rn在ie中http://localhost:8080,能出现欢迎画面。 rn在tomcat\webapps中建立一个aaa的目录,内有一个jsp网页的helloword文件。在ie中调用提示 rnrnHTTP Status 500 - rnrn--------------------------------------------------------------------------------rnrntype Exception reportrnrnmessage rnrndescription The server encountered an internal error () that prevented it from fulfilling this request.rnrnexception rnrnorg.apache.jasper.JasperException: Unable to compile class for JSPrnrnAn error occurred at line: -1 in the jsp file: nullrnrnGenerated servlet error:rn [javac] Compiling 1 source filernrnrnrn org.apache.jasper.compiler.DefaultErrorHandler.javacError(Unknown Source)rn org.apache.jasper.compiler.ErrorDispatcher.javacError(Unknown Source)rn org.apache.jasper.compiler.Compiler.generateClass(Unknown Source)rn org.apache.jasper.compiler.Compiler.compile(Unknown Source)rn org.apache.jasper.JspCompilationContext.compile(Unknown Source)rn org.apache.jasper.servlet.JspServletWrapper.service(Unknown Source)rn org.apache.jasper.servlet.JspServlet.serviceJspFile(Unknown Source)rn org.apache.jasper.servlet.JspServlet.service(Unknown Source)rn javax.servlet.http.HttpServlet.service(HttpServlet.java:803)rnrnrnnote The full stack trace of the root cause is available in the Apache Tomcat/6.0.16 logs.rnrnrn--------------------------------------------------------------------------------rnrnApache Tomcat/6.0.16
编译中出现的错误,大家帮忙看看谢谢
//如果是闰年,打印年月日rn#include rn#include rnusing namespace std;rnrnclass Daternrnprivate:rn int year, month, day;rnpublic:rn void set(int y, int m, int d);rn bool isLeapYear() const;rn void print() const;rn;rnrninline void Date::set(int y, int m, int d)rnrn year=y, month=m, day=d;rnrnrninline bool Date::isLeapYear()rnrn return ( (year%4==0 && year%100!=0) || year%400==0 );rnrnrninline void Date::print()rnrn cout << setfill('0');rn cout << setw(4) << year << "-" rn << setw(2) << month << "-"rn << setw(2) << day << endl;rnrnrnint main()rnrn Date *dp = new Date;rn dp->set(2000,12,12);rn if( dp->isLeapYear())rn dp->print();rn elsern cout << "not a LeapYear.";rn return 0;rnrnrn<em>错误</em>信息://怎么会有重载的错?真不明白。rnC:\临时\f08032.cpp(21) : error C2511: 'isLeapYear' : overloaded member function 'bool (void)' not found in 'Date'rnC:\临时\f08032.cpp(6) : see declaration of 'Date'rnC:\临时\f08032.cpp(26) : error C2511: 'print' : overloaded member function 'void (void)' not found in 'Date'rn
用mfc开发的小计算器,有点错误,发我邮箱snake1900@126.com
这个计算器有点<em>错误</em>,<em>帮忙</em>修改一下 这个计算器有点<em>错误</em>,<em>帮忙</em>修改一下 这个计算器有点<em>错误</em>,<em>帮忙</em>修改一下
libtomcrypt-1.17
LibTomCrypt is a fairly comprehensive, modular and portable cryptographic toolkit that provides developers with a vast array of well known published block ciphers, one-way hash functions, chaining modes, pseudo-random number generators, public key cryptography and a plethora of other routines. LibTomCrypt has been designed from the ground up to be very simple to use. It has a modular and standard API that allows new ciphers, hashes and PRNGs to be added or removed without change to the overall end application. It features easy to use functions and a complete user manual which has many source snippet examples. LibTomCrypt is free for all purposes under the public domain. This includes commercial use, redistribution and even branching. Sports the following Public domain and open source. Written entirely in portable ISO C source (except for things like RNGs for natural reasons) Builds out of the box on virtually every box. All that is required is GCC for the source to build. Includes a 180+ page user manual in PDF format (with working examples in it) Block Ciphers Ciphers come with an ECB encrypt/decrypt, setkey and self-test interfaces. All ciphers have the same prototype which facilitates using multiple ciphers at runtime. Some of the ciphers are flexible in terms of code size and memory usage. Ciphers Supported. Blowfish XTEA RC5 RC6 SAFER+ Rijndael (aka AES) Twofish SAFER (K64, SK64, K128, SK128) RC2 DES, 3DES CAST5 Noekeon Skipjack Anubis (with optional tweak as proposed by the developers) Khazad KASUMI SEED Chaining Modes Modes come with a start, encrypt/decrypt and set/get IV interfaces. Mode supported. ECB CBC OFB CFB CTR IEEE LRW mode F8 Chaining Mode One-Way Hash Functions Hashes come with init, process, done and self-test interfaces. All hashes use the same prototypes for the interfaces. Hashes supported. MD2 MD4 MD5 SHA-1 SHA-224/256/384/512 TIGER-192 RIPE-MD 128/160/256/320 WHIRLPOOL Message Authentication FIPS-198 HMAC (supports all hashes) CMAC, also known as OMAC1 (supports all ciphers) PMAC Authentication F9-MAC Pelican MAC Message Encrypt+Authenticate Modes EAX Mode OCB Mode CCM Mode (NIST spec) GCM Mode (IEEE spec) Pseudo-Random Number Generators Yarrow (based algorithm) RC4 Support for /dev/random, /dev/urandom and the Win32 CSP RNG Fortuna SOBER-128 Public Key Algorithms RSA (using PKCS #1 v1.5 and v2.1) ECC (EC-DSA X9.62 signatures, X9.63 EC-DH) With fast Fixed Point ECC support as well X9.63 import/export of public keys DSA (Users make their own groups) The math routines are pluggable which means you can use your own math provider if you want. Other standards PKCS #1 (v1.5 and v2.1 padding) PKCS #5 ASN.1 DER for SEQUENCE, INTEGER, BIT STRING, OCTET STRING, OBJECT IDENTIFIER, IA5 STRING, PRINTABLE STRING, UTCTIME, CHOICE and NULL types. Portable code builds out of the box with a conforming C compiler Builds out of the box with platform optimizations for i386 (x86_32, gcc and msvc), x86_64 and PPC32 LibTomCrypt builds out of the box with GCC 2.95 and up as well as Visual C++ v6.00 with SP5. It can be reconfigured to eliminate algorithms, use different build options (e.g. smaller or faster code) or use different build tools. It has been successfully tested on numerous platforms ranging from the x86 (Intel and AMD), ARM7TDMI, PowerPC and MIPS series of processors. The code is all endian neutral and uses only standard C syntax
关于JAVA文件都在没问题,没有错误提示波浪线,但编译时候提示找不到对应包的问题
使用springboot做电商网站时候,修改了一点小功能,然后运行不了,提示XX.XXX.domain.XX类找不到等<em>一大堆</em>类都找不到,但是对应包是存在的,而且在编辑框里没有红色的<em>错误</em>提示波浪线,所以,猜测应该不是代码的问题. 又因为我们是git协助的,可能是谁不小心把<em>编译</em>好的文件传上去了,如果有<em>编译</em>好的文件,而且有没有改动的话,IDE肯定不会动<em>编译</em>好的文件,但是可能他的JDK版本和你的有
编译链接 protobuf时出现的错误
文章目录问题描述解决方法环境 问题描述 1.<em>编译</em>protobuf的时候会出现链接<em>错误</em>: undefined reference to `google::protobuf::Message::SpaceUsedLong() const' 2.<em>编译</em>的时候会出现 terminate called after throwing an instance of 'google::protobuf::Fata...
轻量级Java_EE企业应用实战_Struts2_Spring3_Hibernate整合开发.pdf下载
轻量级Java_EE企业应用实战_Struts2_Spring3_Hibernate整合开发.pdf 很清晰 相关下载链接:[url=//download.csdn.net/download/yinxing408033943/7863829?utm_source=bbsseo]//download.csdn.net/download/yinxing408033943/7863829?utm_source=bbsseo[/url]
扫描档案资料数结果显示下载
扫描档案资料数扫描档案资料数扫描档案资料数扫描档案资料数扫描档案资料数扫描档案资料数 相关下载链接:[url=//download.csdn.net/download/yanlijun_java/2108027?utm_source=bbsseo]//download.csdn.net/download/yanlijun_java/2108027?utm_source=bbsseo[/url]
CISCO交换机配置命令大全下载
CISCO交换机配置命令大全CISCO交换机配置命令大全 相关下载链接:[url=//download.csdn.net/download/szh608/2188694?utm_source=bbsseo]//download.csdn.net/download/szh608/2188694?utm_source=bbsseo[/url]
文章热词 机器学习教程 Objective-C培训 交互设计视频教程 颜色模型 设计制作学习
相关热词 mysql关联查询两次本表 native底部 react extjs glyph 图标 报了产品经理课程 人工智能培训谢谢
我们是很有底线的