Failed to create project"...." Could not calculate build plan:... [问题点数:20分]

Bbs1
本版专家分:0
结帖率 0%
Could not calculate build plan(问题解决)
转载:今天遇到这个问题确实解决掉了 Could not <em>calculate</em> <em>build</em> <em>plan</em>: Failure to transfer org.apache.maven.plugins:maven-surefire-plugin:pom:2.7.1 from http://repo1.maven.org/maven2 was cached in the local repository, ...
Eclipse创建的Maven项目报错Could not calculate build plan: Plugin
1.错误描述 Could not <em>calculate</em> <em>build</em> <em>plan</em>: Plugin org.apache.maven.plugins:maven-resources-plugin:2.5 or one of its dependencies <em>could</em> not be resolved 、 2.解决办法: 查看eclipse里,配置的maven的安装位置 找到安装mav...
Maven项目出现 Could not calculate build plan:plugin 错误解决办法
通常情况下 删除本地配置仓库中 org.apache.maven.plugins:maven-resources-plugin所在目录。 然后右击项目 Maven-&amp;gt;Update Project-&amp;gt;勾选 Force Update of Snapshots/Releases即可 但是当我出现这个状况的时候网上的所用的方法都不管用,不管怎么尝试都无法从中央仓库中下载东西,搞半天还是在...
Java Eclipse创建Maven项目报错:Could not calculate build plan
1 查看eclipse里,配置的maven的安装位置 2 找到安装maven的安装目录,进入conf目录下,打开setting.xml文件,查看maven本地仓库的位置 3.进入本地仓库文件夹,找到--》org\apache\maven目录,会看到有个plugins的文件夹,这个文件夹就是maven的插件,可以打成zip,然后删除这个文件夹,是的,删掉 4. 进入eclipse,找到项...
maven异常:Could not calculate build plan
错误信息:eclipse + maven Could not <em>calculate</em> <em>build</em> <em>plan</em>: Failure to transfer org.apache.maven.plugins:maven-surefire-plugin:pom:2.7.1 from http://repo1.maven.org/maven2 was cached in the local repository,...
创建maven项目时,出现Could not calculate build plan错误(其中一种解决办法)
    近期,自己开始重新对java方面知识补课,过程中学到了Maven,在Eclipse中创建Maven项目时候发现并不是一帆风顺,出现了如下错误(图片是借用本站网友博客中的一张)问题原因:         发现大概是因为maven本地仓库中缺少maven-resource-plugin:2.6这个相应的依赖文件;         PS:网上很多解决方案都是说将/org/apche/maven/...
maven -- 问题解决(二)解决“Could not calculate build plan”问题
错误提示如下:(eclipse+maven)rnrnCould not <em>calculate</em> <em>build</em> <em>plan</em>: Failure to transfer org.apache.maven.plugins:maven-surefire-plugin:pom:2.7.1 from http://repo1.maven.org/maven2 was cached in the local reposi
myeclipse创建maven工程报错 Could not resolve
myeclipse创建maven工程报错 Could not resolve
Maven使用中新建项目遇到的问题
1.Could not <em>calculate</em> <em>build</em> <em>plan</em>: Plugin org.apache.maven.plugins:maven-resourn解决方案:n删除\.m2\repository路径下所有的文件 重新<em>build</em>maven项目
MyEclipse导入项目一系列问题处理(Eclipse也适用)
导入项目问题处理:一、编码修改 n n二、感叹号、叉号问题处理其实这个也包括上面的编码修改问题,需要注意下。 n1)查看JDK的引用路径是否报错。jdk引用路径问题,修改下jdk的引用路径就好了,具体的就是 n n2)web工程看是否引入了web App library(web 应用程序库),若没有,项目右键properties 选项java <em>build</em> path 右侧 add libraries
Maven項目创建报错:Could not calculate build plan: Failure to transfer org.apache.maven.plugins。。。。
Could not <em>calculate</em> <em>build</em> <em>plan</em>: Failure to transfer org.apache.maven.plugins:maven-surefire-plugin:pom:2.7.1 from http://repo1.maven.org/maven2 was cached in the local repository, resolution will not ...
Could not calculate build plan: Plugin org.apache.maven.plugins:maven-resources-plugin:2.7 or one of
        今天在新环境部署系统时,发现项目出现故障!由于已经解决了,就不上错误图片了,大致的错误信息如:Could not <em>calculate</em> <em>build</em> <em>plan</em>: Plugin org.apache.maven.plugins:maven-resources-plugin:2.7 or one of ,后来网上看了几个解决办法,好像都不行!最后看了一下错误的原因,大体知道是啥意思了,就是...
Maven项目出现 could not calculate build plan:plugin 错误
刚刚创建Maven项目的时候出现了一点问题,新建工程的时候出现错误对话框:<em>could</em> not <em>calculate</em> <em>build</em> <em>plan</em>:plugin。(我是在开始配好Maven之后,在自动下载的时候给关了…),总之,解决方法就是找到maven的 .m2\repository\org\apache\maven\plugins\maven-deploy-plugin 文件夹,然后把这个文件夹下的文...
DICOM:dcm4che开源项目导入Eclipse编译错误问题解决方案
背景:马上跨年了,记得小时候元旦都不是事儿,怎么长大了长大了感觉越来越热闹了反而。各种饭局、各种party,有点hold不住。还是回来整理一下这一年的笔记比较舒服,比较有收获。看了看这个月竟然发文量还不足四篇,遂将Evernote中的一篇老文贴出来水一下,赶巧解决一下之前网友邮件中遇到的相关问题。
Jmeter自动化测试平台搭建之错误二
ant执行<em>build</em>.xml文件报错信息:找了很久没找到问题所在,所以重新写了一遍<em>build</em>.xml配置文件。 nD:\studysoft\apache-ant-1.9.9-bin\apache-ant-1.9.9\bin&amp;amp;amp;gt;ant -<em>build</em>file Anny_<em>build</em>.xml nBuildfile: D:\studysoft\apache-ant-1.9.9-bin\apache-an...
react 基础2-安装成功
在文件夹路径下打开cmdnn注:这方法可能就我自己觉着省事儿,聊作借鉴nn安装成功后,直接关闭管理员权限的命令行n在项目所在的文件夹下,把文件夹路径删掉,打 cmd 然后敲回车n1、文件夹路径 ↓ ↓ ↓nn2、选中文件夹路径 ↓ ↓ ↓nn3、嵌入cmd ↓ ↓ ↓nn4、打开该路径下的cmd ↓ ↓ ↓nnn5、创建项目nD:\git_work2\reactProject&amp;amp;gt;<em>create</em>-...
记录Android-Studio遇到的各种坑
开此文章,主要是为了记录在使用虐我千百遍,我还待他如初恋的AS的过程中所遇到的各种坑,一来是希望做个记录,方便查找,防止再次踏入同样的坑;二来也希望能帮助到有遇到有跟我相同问题的人。nn1,首先每次导入一个新的AS工程的时候,肯定会有各种gradle配置问题,只要把<em>build</em>.gradle改为与自己系统相匹配即可,如果报nnError:(1, 0) Plugin is too old, pleas...
使用maven的tomcat插件启动时报错问题
1、最近在学习Apache下的一个权限框架shiro。在eclipse上建了一个web项目,使用maven引入对应的依赖。在spring和springMVC等配置都准备好后,准备跑一下JSP页面确保环境没问题,跑的时候使用的也是maven的tomcat7插件,在pom.xml的插件配置处配置如下:&amp;lt;<em>build</em>&amp;gt;n &amp;lt;finalName&amp;gt;shiro&amp;lt;/finalName...
dubbo-admin构建报错
刚从GitHub下载下来的dubbo-admin直接构建汇报如下错误,原因是maven库里没有该dubbo的jar包。[INFO] Scanning for projects...n[WARNING] n[WARNING] Some problems were encountered while <em>build</em>ing the effective model for com.alibaba:dubbo-a
unity-android开发编译错误一
问题描述nn编译apk时,报错nnCommandInvokationFailure: Gradle <em>build</em> <em>failed</em>. nD:/programfile/Java/jdk1.8.0_131\bin\java.exe -classpath &quot;C:\Program Files\Unity\Editor\Data\PlaybackEngines\AndroidPlayer\Tools\gradle...
Docker错误集合
本文收集我在使用Docker时遇到的一些错误及解决办法
Android studio开发中遇到的一些异常
本文主要总结我个人在开发中遇到的一些问题,本文将持续记载!
编译安装spark-2.2.0
编译安装spark,来指定自己的hadoop的版本
Eclipse中使用Maven我遇到过的常见报错解决整理
[INFO] Scanning for projects...rn[ERROR] The <em>build</em> <em>could</em> not read 1 project -> [Help 1]rn[ERROR]   rn[ERROR]   The project com.MyProjectX:MyProjectX-manager-web:0.0.1-SNAPSHOT (E:\prj\Tech_accumulatio
unity升级2017版本后,安卓出包遇到Could not compile build file.问题的解决办法
一、nn打开Unity--&amp;gt;Edit--&amp;gt;Preferences--&amp;gt;External Toolsnnnn    JDK 版本需1.8以上,具体可前往官网下载,SDK至少包含API 26 或以上!nn二、nn    如果上诉均已满足,打开unity 安装路径:Unity\Editor\Data\PlaybackEngines\AndroidPlayer\Tools\GradleT...
React native 开发遇到的一些坑
 nnReactNative 报错或使用AndroidStaudio打包出来的安装包不是新数据:unable to load script from assets 'index.android.bundlnn解决方法:nn在项目根目录下运行:nnreact-native bundle --platform android --dev false --entry-file index.js --bu...
Maven问题总结及笔记汇总
常用命令备忘
cordova 安装配置 及遇到的问题解决
1,需要先按照node.js  rn下载地址:https://nodejs.org/en/  rn默认安装目录:C:\Program Files\nodejsrnrnrn2,cmd下运行命令 npm install -g cordova (如果安装出错 就是网络连接失败 因为是国外网 需要 网络代理软件  这里我用的软件是  proxy999 rnrnrn 安装完后 运行cordova  运行成功
导入maven项目,build maven project时出现的常见问题解决办法.
1.     一下两种方法各有适用的情况,请根据实际情况两个都试用一下(优先选择第2种)(尽量每尝试一步,都update一下project)问题如下Failed to execute goal on project project_management: Could not resolve dependencies for project ... Connection refused: conne...
启动spring boot项目maven报错
用spring-boot:run启动项目报错,刚接触,求大神指导。rn[ERROR] Failed to execute goal org.springframework.boot:spring-boot-maven-plugin:1.5.2.RELEASE:run (default-cli) on project jspxcms: Execution default-cli of goal or
解决Android Studio中Gradle版本不对应无法调试app的问题
遇到的问题nWindows操作系统下,在导入一个Android工程到Android Studio中时,调试时Gradle拨错,错误提示如下:n--------------------------------------------------------------------------------------------nFAILURE: Build <em>failed</em> with an exc
Gradle系列之从init.gradle说起
用过maven的开发者都知道,在maven里一些信息可以定义在全局的配置文件中,比如把一些仓库信息定义在用户目录/.m2/setting.xml文件中,这样就不用每个项目都配置这些相同的配置了。对于Andorid开发者来说,使用gradle比使用maven更常见,在开发中说不定你会在每一个项目中配置一遍公司的仓库地址,定义一些相同的配置,那么在gradle中有没有类似maven的这么一个配置文件可以
解决升级到Xcode10,react native项目运行报错问题
今天刚升级到Xcode10,就遇到两个报错问题nn错误一:Xcode 10: Build input file double-conversion cannot be foundnnerror: Build input file cannot be found: '../node_modules/react-native/third-party/double-conversion-1.1.6/sr...
Tinker接入踩的坑
问题一:rnError:A problem occurred configuring project ':app'.rn> Could not resolve all dependencies for configuration ':app:_debugApkCopy'.rn   > Could not resolve com.tencent.tinker:tinker-android-lib:1
react-native遇到过的错误
记录下使用react-native过的错误,实习期间一直没空写博客~~~n1、development return response error 500:一般是引用文件组件等的路径错误,找不到; n2、cannot excute importjavascriptexception: 一般是写错变量名称等; n3、导入图片资源时,需要重新打包; n4、Application has not been
导入、build elasticsearch源码异常
老是报错如下nnnnLoading Gradle project preview <em>failed</em> due to an error in the referenced Gradle <em>build</em>.nCould not fetch model of type 'GradleBuild' using Gradle installation 'C:\Gradle\gradle-4.9'.nnBuild fil...
Gradle 庖丁解牛(构建生命周期核心委托对象创建源码浅析)
上一篇《Gradle 庖丁解牛(构建源头源码浅析)》我们分析了 Gradle 框架自身初始化(非构建生命周期初始化)的核心流程,这一篇我们续着前面的分析继续(如果没看过前一篇的建议先去看前一篇,因为这一系列存在非常高的关联性)。
maven常见错误
n错误如下: ‘packaging’ with value ‘’ is invalid. Aggregator projects require ‘pom’ as packaging. @ line 11, column 16nn[INFO] Scanning for projects...n[ERROR] [ERROR] Some problems were encountered while...
6.4、calculate member【计算成员】的实现原理
Calculate member【计算成员】的实现原理rn rn1          计算成员的使用与普通的层次结构成员一样,但它是基于普通层次结构成员计算得来,不保存在cube中rn rn2          计算成员也必须依附于某一层次结构,也就是依附于某根轴上,如果没有指定则落在默认的度量值轴上rn rn3          声明计算成员rnwithnmember [x] as1+2+3n
Ant运行build.xml执行服务器scp,异常解决jsch.jar
Ant运行<em>build</em>.xml执行服务器scp,异常解决jsch.jarrnrnBUILD FAILEDrnD:\workspace\xmol\<em>build</em>.xml:193: Problem: <em>failed</em> to <em>create</em> task or type scprnCause: Could not load a dependent class com/jcraft/jsch/Loggerrn     
flutter环境搭建及其遇到的坑
总的来说需要的也就4样东西,找齐了配置一下就OK;nnFlutter SDK (建议下载官网的,下载完直接能用)nnhttps://flutter.io/docs/get-started/install/windowsnnnn下载Dart插件nnn下载Flutter插件nn配置环境变量nnnn准备ide(Androidstudio或者IntelliJ IDEA)配置flutter的SDK即可nnn...
ORA-00907: 缺失右括号
好久没写sql脚本创建oracle表,之前也是没注意,最近写了一个创建表语句如下:rnrnCREATE TABLE jc_task (n task_id number(11) primary key,n task_code varchar2(255) default NULL,n task_type number(1) NOT NULL default '0',n task_name va
玩转Ambari之二----基于ubuntu的源码编译和安装
网上关于ambari安装的有很多,有直接从现成的源直接下载安装的,也有自己构建本地源安装的,还有不少自己从apache网站下载源码编译安装的。前两者相对简单,依赖小,期间遇到问题也少,顺利的话,可能什么问题都碰不到就完成了。后者会遇到各种不同的问题。apache网上公布的最新版本是2.5.2,鉴于网上能搜到的基于源码安装帖子的版本都较老,并且很多都是基于centos的,基于Ubuntu的很少。我们
Jenkins+Gradle实现android开发持续集成问题汇总
Jenkins+Gradle实现android开发持续集成问题汇总
react-native 环境搭建遇到问题
1.  nD:\Android\WorkSpace\AwesomeProject>react-native run-androidnJS server already running.nBuilding and installing the app on the device (cd android && gradlew.bat installDebug...nnnFAILURE: B
dubbo-admian的打包和平台搭建
本文简单介绍下dubbo-admin的搭建过程,包括dubbo-admin的打包细节,以及在打包过程中jdk8的一些坑的解决。
JavaFX在导出可执行文件时所遭遇的问题以及解决办法
其实导出可执行文件这最后一步本应是非常简单的,但是由于忽视各种细节,导致不能成功,耗费太多时间。n在一个JavaFX项目如果第一次对项目进行Generate ant <em>build</em>.xml and run时,报出以下提示时:n"Not a JDK", "The project is attached to a JRE only so ant would be started with a JRE
React native开发中常见的错误
react native环境搭建请移步:react native环境搭建n这里说说react native创建完成之后,运行中出现的常见问题,nn问题1:njava.lang.RuntimeException: SDK location not found. Define location with sdk.dir in the local.properties file or with
Android Studio开发过程中Gradle Sync报错解决方法
本文会汇总遇见的报错问题及其解决方案,不断更新nn更新于2018年12月3日nn(1)nnnGradle sync <em>failed</em>: No toolchains found in the NDK toolchains folder for ABI with prefix: mips64el-linux-androidnn解决方法:nnA:设置project srtucture如下nnnnB:手动设置...
maven笔记
笔记:n n 1)pom文件中依赖的使用范围&lt;scope&gt;的取值:nn compile 默认值。编译、运行时都可以使用该依赖。该依赖会被打包。nn provided 该依赖在编译时可以用,在运行时不可用,运行时如果容器提供了该依赖,则程序可以使用容器提供的依赖。该依赖不会被打包。nn runtime 该依赖在编译时不可用,在运行时可以使用。nn test 只有在测试编译...
Ambari2.5.2在CentOS7上的源码编译
文章目录Ambari编译准备maven环境搭建nodejs的安装Ambari源码下载Ambari源码编译替换Ambari-metrics较大的包打版本号编译编译问题解决nAmbari编译准备nn详细Ambari编译参考文档参考:https://cwiki.apache.org/confluence/display/AMBARI/Ambari+Developmentnnmaven环境搭建nn参考博客...
Android开发错误汇总
1、Caused by: android.view.InflateException: Binary XML file line #60: Error inflating class &amp;lt;unknown&amp;gt;文件布局解析错误:xml布局中存在错误,XML file line #60显示是在xml中60行解决方式:找到错误指示解析的布局,修改对应行2、Caused by: libcore.io...
源码编译zepplin踩过的那些坑
最近项目需要从源码安装zepplin,所以就来试下源码安装。rn官方教材: http://zeppelin.apache.org/docs/0.7.3/install/<em>build</em>.htmlrnStep1. 确定系统环境和需要的各软件版本rnrnCentos6.7rnOrace JDK1.8rnHadoop 2.6.0-cdh5.10.2nhbase 1.2.0-cdh5.10.2nspark 2.
运行grpc官方的hello world示例
下载源码n执行git clone -b v1.18.0 https://github.com/grpc/grpc-java下载相关源码,然后执行cd grpc-java/examples进入要执行后续操作的文件夹。nhelloworld.proton将examples文件夹作为项目根目录导入idea或者eclipse,helloworld.proto位于s...
spark2.1源码编译
本文介绍spark2.1.0的源码编译1.编译环境:Jdk1.8或以上Hadoop2.7.3Scala2.10.4必要条件:Maven 3.3.9或以上(重要)点这里下载http://mirror.bit.edu.cn/apache/maven/maven-3/3.5.2/binaries/apache-maven-3.5.2-bin.tar.gz 修改/conf/setting.xml&amp;lt;m...
maven 使用时,遇到的错误,及解决办法
1、使用maven命令行(mvn archetype:<em>create</em> -DgroupId= xx DartifactId=simple -DpackageName=xx), n创建一个项目时,一直报下面的错误:[ERROR] Could not find goal '<em>create</em>' in plugin org.apache.maven.plugins:maven-archetype-plugin:3.
Android Studio不能获取远程依赖包的解决方法
       最近被一个AS的sync问题困扰,在引入远程依赖包的时候,会出现一个sync错误,提示找不到这个类库。然而,并不是所有的工程都会出现这个问题,有的工程引入同样的类库却没有问题。nn       Error:(25, 13) Failed to resolve: com.jakewharton:butterknife:5.1.1nnnn       网上查了下(http://stack...
[torch]安装遇到的问题
最近提特征提的整个tsubame的空间都要满了..今天安torch,http://torch.ch/docs/getting-started.htmlgit clone https://github.com/torch/distro.git ~/torch --recursivencd ~/torch; bash install-deps;n./install.shtsubame没法和外部网络联系,
Android Studio 报错合集(持续更新中)Ps:有错误欢迎指出,万分感谢
Cause: peer not authenticated:rn网上大部分解析是说有依赖冲突或者是jar包冲突,如果没有找到冲突的话,可以把依赖module中的版本跟主module设置成一样的试一下,或者把项目<em>build</em>中的gradle换个版本rn比如:classpath 'com.android.tools.<em>build</em>:gradle:3.1.4rnConnection timed out: conne...
gradle与jenkins编译常见报错及解决
一、jenkins编译错误总结nnnn1.错误一:  nn/data/jenkins/workspace/tv-child-release/tvApp/libraryPrj/lecore/src/com/letv/core/utils/DevicesUtils.java:1335: error: cannot find symbol
常见异常
一、Struts2rn1.1 NoSuchBeanDefinitionExceptionrn rn rnrnrnrnrnrn异常描述:rnrnrn没有suchbean定义异常:没有匹配的PlatformTransactionManager  Beanrnrnrnrnrn异常信息:rnrnrnrnrnrnrn rnrnrnrnrnrnrn rnrnrnorg.springframework.bean
使用QT点击运行按钮无任何反应,出现错误Could not create directory
初次接触QT,使用QT写了一个特别简单程序,写完之后点击运行按钮,却发现没有任何反应。然后上网找答案,尝试了很多解决方案都没有成功。有可能是搜索的关键字不对,也可能是搜索的方法技巧太拙劣,折腾了很久。n虽然点击运行一点反应都没有,但是在QT的编译输出中出现了错误Could not <em>create</em> directory  路径  in
升级android studio3.0遇到的问题
问题1nn场景:nnError:A problem occurred configuring root project '项目名'.n&gt; Could not resolve all dependencies for configuration ':classpath'.n &gt; Timeout waiting to lock artifact cache (/Users/Skyf/....
记一次在Windows上搭建React Native Android环境踩过的坑
要说最近技术圈什么比较活跃,我想除了动态加载框架和热修复技术之外,非Facebook的React Native莫属了吧,其实RN对IOS的支持比较早,但是Android似乎难产了,直到9月份才刚开源。距离RN开源也有一段时间了,一直没有去学习,今天兴趣来潮,索性学一把吧。本文假设你的Windows上安装了Android SDK,并配置好了环境变量。安装Node.js从官网https://nodejs
pinyougou.sql
该资源为本博客PYG项目中第一天的建表语句,所用到的数据库为MySQL数据库。
添加ijkplayer-java 导致的报错
Error:FAILURE: Build <em>failed</em> with an exception.nn* What went wrong:nCould not determine the dependencies of task ':app:lintVitalDevPackagingOptions'.n&amp;gt; Could not resolve all task dependencies for co...
maven中端口占用报错
Failed to execute goal org.codehaus.mojo:tomcat-maven-plugin:1.1:run (default-cli) on project maven-first: Could not start Tomcat: Protocol handler initialization <em>failed</em>: java.net.BindException: Addre
svn代码倒入出现的3个问题
svn代码倒入出现的3个问题问题一问题二:问题三:n问题一nError:FAILURE: Build <em>failed</em> with an exception.nn* What went wrong:nCould not <em>create</em> service of type TaskOutputFilesRepository using TaskExecutionServices.<em>create</em>TaskOutput...
github项目导入Android studio 出现的问题及解决
前言rnrn刚用AS的时候,真心觉得坑不要太多,尤其是导入项目的时候,所以特此整理一些错误信息,方便以后查询和修改 rnps:很多错误,如果重新在AS里创建一个project,自己看着对应修改基本上就能解决问题,大多问题是新旧版本不一致或者jar包冲突导致,多google搜索,一般都是可以解决的.rnrnrnrn错误一rnrnrn Error:(19, 0) Gradle DSL method not found...
cordova创建项目失败问题
cmd执行nnncordova <em>create</em> hello com.demo.hello hellonn报错信息nnnCreating a new cordova project.nUnhandled &quot;error&quot; event. ( Error from Cordova Fetch: Error: cmd: Command <em>failed</em> with exit code 1 Error output...
Java之品优购课程讲义_day01(8)
4.1.1 商家管理后台nn构建 web 模块 pinyougou-shop-web        与运营商管理后台的构建方式类似。区别:nn(1)定义 tomcat 的启动端口为 9102nn(2)springmvc.xmlnnn&amp;lt;!-- 引 用 dubbo 服 务 --&amp;gt;n n&amp;lt;dubbo:application name=&quot;pinyougou-shop-web&quot; /&amp;g...
Appium的一些坑问题错误解决 与 技巧集锦
问题rn 1. error: Failed to start an Appium session, err was: Error: Requested a new session but one was in progressrn  之前的会话没有关闭,然后你又运行了测试实例,也没有设置覆盖. 解决: 1. 重新停止appium服务,开启Appium服务 2. 在Genarel Settin
AspMVC -EF 使用过程中出现错误及解决
在.Net 使用EF如果不正确,可能会出现异常错误。一般而言,有可能以下错误场景1,在程序集“XXX”中未找到迁移配置类型“XXX.Migrations.Configuration”。这种错误出现在定义的DBContext 类与定义的web.config 数据连接串名称不一致,应将两者保持一致。如下面所示配置文件:&amp;lt;add name=&quot;MusicStoreEntities&quot; connecti...
Ambari 2.7.3版本编译报错各问题解决
执行编译命令:# mvn -B clean install rpm:rpm -DnewVersion=2.7.3.0.0 -DskipTests -Dpython.ver="python &gt;= 2.6" -Drat.skip=true -Xnn1、报错:nn[DEBUG] Configuring mojo org.apache.rat:apache-rat-plugin:0.12:check...
FlashBuilder提示Fail to create the Java Virtual Machine
FlashBuilder提示Fail to <em>create</em> the Java Virtual Machine FlashBuilder提示Fail to <em>create</em> the Java Virtual Machine FlashBuilder提示Fail to <em>create</em> the Java Virtual Machine FlashBuilder提示Fail to <em>create</em> the Java Virtual Machine FlashBuilder提示Fail to <em>create</em> the Java Virtual Machine
Cordova项目迁入记录
D:\project\HXHGit>cordova <em>build</em> androidnANDROID_HOME=D:\Software\android_dev\android-sdknJAVA_HOME=D:\Program Files\Java\jdk1.8.0_65nnFAILURE: Build <em>failed</em> with an exception.nn* What went wrong:nA pro
android studio使用错误排查记录
配环境这玩意儿真是考验耐力和碰运气啊!!!!rn导入一个已有的gradle项目rn一开始提示 Error:<em>failed</em> to find Build Tools revision 21.1.1rn来回改project structure里面的配置,指定不同的SDK,反正安装android studio默认的sdk不能使用rnError:(11, 0) Gradle DSL method not fo
rocketmq-console-ng编译后jar
rocketmq-console-ng 编译后的jar, jdk1.7 已配置好rocketmq服务, rocketmq.config.namesrvAddr=127.0.0.1:9876 项目访问url;http://127.0.0.1/rocketmq 项目启动java -jar rocketmq-console-ng-1.0.0.jar
升级Android Studio3.0时遇到的几个问题
1.gradle打包,自定义apk名称代码报错(Cannot set the value of read-only property 'outputFile' )rnrn报错rnrnError:(56, 0) Cannot set the value of read-only property 'outputFile' for ApkVariantOutputImpl_Decorated{apkD
工作环境下Apache Jmeter + ANT +Jenkins 持续集成环境搭建
最近工作需要在公司使用jmeter实现接口自动化测试,我就选取了jmeter+ant+jenkins,搭建环境过程如下nn本地环境:win7 64位 云桌面系统nn1,本地电脑上JDK安装,网上教程很多,这里不再记录nn2,本地电脑上Apache jmeter下载与安装nn地址:http://jmeter.apache.org/nnnn这里我选择下载的是4.0版本的,下载到D盘nn下载下来之后解压...
NDK开发 从入门到放弃(七:Android Studio 2.2 CMAKE 高效NDK开发)
前言之前,每次需要边写C++代码的时候,我的内心都是拒绝的。 n1. 它没有代码提示!!!这意味着我们必须自己手动敲出所有的代码,对于一个新手来说,要一个字母都不错且大小写也要正确,甚至要记得住所有的jni函数等,真是太折磨人了…平时写java代码的时候都是写几个字母会出来一大堆提示然后选择的,这样还有一个好处就是很多时候我们不知道有那些函数,但是我们可以通过obj.,然后就可以看到它有哪些方法函数
spark-cdh版本编译过程中的各种坑
spark-cdh版本编译过程中的各种坑rn** bug1 **rn[ERROR] Failed to execute goal on project spark-launcher_2.11: Could not resolve dependencies for project org.apache.spark:spark-launcher_2.11:jar:2.1.0: Could not fin...
flutter入门-flutter开发环境搭建
Flutter是谷歌新推出的一款能够支持Android和IOS跨平台开发的全新的UI框架。目前来看,还是有点小火爆的,有引领下一代移动开发的势头。nn特别是,在Oracle马上要将Java收费的情况下,或许是未来的一个很好的额选择。nnFlutter拥有自己的一套UI渲染引擎,所以目前的测试数据来看,在性能上面,并没有比原生App性能低多少,所以目前来看,还是一套可以跟进的跨平台方案。nnhttp...
idea新建项目或者导入项目出现Failed to notify build listener(识别不了java文件)
出现该问题的根本原因是idea与gradle的版本不匹配;nn解决方案:更新gradle版本nnnn异常如下:nnFailed to notify <em>build</em> listenernn或者nnnnnn参考:https://blog.csdn.net/Evan_L/article/details/87368075nn可知安装的idea与gradle应该匹配的版本号的关系;nnnn比如我本地的ide...
Eclipse下使用Maven创建项目出现的archetype错误
欢迎使用Markdown编辑器写博客本Markdown编辑器使用StackEdit修改而来,用它写博客,将会带来全新的体验哦:nMarkdown和扩展Markdown简洁的语法n代码块高亮n图片链接和图片上传nLaTex数学公式nUML序列图和流程图n离线写博客n导入导出Markdown文件n丰富的快捷键n快捷键n加粗 Ctrl + B n斜体 Ctrl + I n引用 Ctrl
ubuntu上启动模拟器报错解决
出错信息:nn上午11:11 Emulator: <em>failed</em> to <em>create</em> drawablenn上午11:11 Emulator: <em>failed</em> to <em>create</em> drawablenn上午11:11 Emulator: getGLES2ExtensionString: Could not make GLES 2.x context current!nnn参考资料: nhttp://www...
解决lint task执行失败问题
Android Studio 执行 lint task的时候出错
Failed to notify build listener因为Gradle版本问题导致的项目无法构建
有一次pull完代码以后,需要重新构建,但是报Failed to notify <em>build</em> listener。nnnn经过排查发现是Gradle版本问题nnnn我用的版本是4.3的,公司统一用4.4的,升级版本就好了,这是修改之后的,use local gradledistributennn...
cordova 打包ionic2项目遇到的坑
一    ionic cordova <em>build</em> android的时候报错rn      报错 1* What went wrong:rn              A problem occurred evaluating root project 'android'.rn              > No installed <em>build</em> tools found. Install the An
Spark-2.2.0源码编译报错
环境:n系统:Linux(CentOS7)nSpark:spark-2.2.0.tgz(Apache 官网下载)nScala:scala-2.11.8.tgznHadoop:hadoop-2.9.0nnn编译方式:使用Spark源码解压目录下的spark-2.2.0/dev/make-distribution.sh 脚本进行编译n命令:./dev/make-distribution
maven中无法下载依赖
Could not resolve dependencies for projectFailed to execute goal on project otsstreamreader: Could not resolve dependencies for project com.alibaba.datax:otsstreamreader:jar:0.0.1-SNAPSHOT: Could not ...
Hive源码编译常见问题
笔者将自己编写的UDF函数集成到Hive编译过程中遇到了如下几个问题,如果你在编译过程中也遇到了类似的问题,可以参考下面的解决方法。Hive 通过Maven来编译,命令如下$ mvn clean package -Phadoop-2,dist -DskipTestsn问题一n异常信息:Failed to execute goal norg.apache.maven.plugins:maven-co
React Native 一:开发环境搭建
在学习React Native的过程中,相信对于一个App开发工程师,没有充分的学习过前端开发技术的同学来说,顺利的搭建好开发环境还是比较纠结的。下面,我就根据我自己学习过程中的总结,跟大家讲解讲解如何从零开始顺利的搭建React Native的开发环境,希望对大家的学习有所帮助。我是以Ubuntu操作系统进行开发的,具体步奏如下:1.安装Git    apt-get install git2.安
NV显卡软件版本不一致运行TensorFlow出错
当使用NV显卡运行TensorFlow出错时,如下:<em>failed</em> s.ok() <em>could</em> not find cudnn<em>create</em> in cudnn dso dlerror cudnn需要检查cudnn的版本与cuda的版本一致。否则就会出上面这个错误。我这里使用两个版本没有问题:cuda_8.0.61_win10.execudnn-8.0-windows10-x64-v5.1.zip1. C+
制作mesos的docker镜像(centos7.2)
使用的基础镜像是centos7.2,安装的mesos版本为0.28.2。关于mesos的安装,可以参考之前的安装博客。docker容器里不能直接用systemctl命令来启动mesos,所以使用mesos-slave的脚本命令来启动。但是在启动时,出现systemd的报错:n Failed to initialize systemd: Failed to locate systemd runtim
android 添加依赖出现Failed to resolve:"你添加的依赖名" 或者出现 debug@Compileclasspath问题
首先出现的问题是 debug@Compileclasspath的问题,经过一波百度之后都说是AS <em>build</em>.gradle版本3.0以上的问题,但是经过一波修改之后并没有什么卵用,并没有解决这个问题,并且出现了新的问题,就是Failed to resolve:.......这个问题了,这面贴下终极解决方案,希望可以帮到你。rn问题截图:rnrnrn解决方案:在整个工程的<em>build</em>.gradle中添
在Linux下安装Maven,编译Apache Eagle项目
编译调试过程花了好几天,要做好心理准备,编译一次可能要花几个小时,特别是加上-X参数输出debug会更慢,不带还快点,每次编译出问题,调完后都得再从头开始编译,不然可能也出其他与全部编译不同的错误。带-e参数也行,可以输出完整的错误信息,编译时长会短点。后面会快一些,但至少也得半个小时起步。nn另外编译过程由于要下载很多文件,所以经常会卡在一个文件下载那,我是一般卡在一个文件下载的地方时,超过10...
上传项目到JCenter以及Maven仓库的步骤和错误解决
介绍了将项目上传到仓库,并获得相关的compile地址的步骤,并且给出了一些错误的解决方案。
DynamicSkinForm delphi2009下载
DynamicSkinForm delphi2009 相关下载链接:[url=//download.csdn.net/download/hongsheng11/2824807?utm_source=bbsseo]//download.csdn.net/download/hongsheng11/2824807?utm_source=bbsseo[/url]
UNIX网络编程第三版英文卷一下载
经典教材,有朋友需要者请进啊,另附上源码。 相关下载链接:[url=//download.csdn.net/download/mr2005/3090086?utm_source=bbsseo]//download.csdn.net/download/mr2005/3090086?utm_source=bbsseo[/url]
javame在线答题下载
在手机上运行的在线答题项目,支持数据库管理的增删改查,支持手机答题等功能,技术是javame的高级编程部分。 相关下载链接:[url=//download.csdn.net/download/LihuaMeng/3276439?utm_source=bbsseo]//download.csdn.net/download/LihuaMeng/3276439?utm_source=bbsseo[/url]
文章热词 机器学习教程 Objective-C培训 交互设计视频教程 颜色模型 设计制作学习
相关热词 mysql关联查询两次本表 native底部 react extjs glyph 图标 怎么学习互联网大数据 村干部学习大数据心得
我们是很有底线的