Linux下mvn compile报错

Java > Java SE [问题点数:20分,结帖人jhams]
等级
本版专家分:0
结帖率 98%
等级
本版专家分:0
等级
本版专家分:0
等级
本版专家分:0
jhams

等级:

mvn install -X指令报错解决

mvn install -X指令报错:Plugin org.apache.maven.plugins:maven-resources-plugin:2.4.3 one of its dependencies could not be resolved.问题解决 1.在网上查找了方法如下: 在pom.xml文件中加入maven-...

centosmaven编译 mvn package 报错:No compiler is provided in this environment. Perhaps you are ...

centosmaven编译 mvn package 报错:[ERROR] Failed to execute goal org.apache.maven.plugins:maven-compiler-plugin:3.1:compile (default-compile) on project helloworld: Compilation failure [ERROR] No ...

maven命令行,输入命令mvn clean compile报错:Perhaps you are running on a JRE rather than a JDK?

如题: 原因:jdk是通过.exe安装的,或者未配置环境变量,加入JAVA_HOME C:\Program Files\Java\jdk1.8.0_251环境变量即可

linux下执行mvn clean package -Dmaven.test.skip=true报错

[INFO] --- maven-compiler-plugin:3.8.0:compile (default-compile) @ code-review-manage --- [INFO] Changes detected - recompiling the module! [INFO] Compiling 172 source files to /var/lib/jenkins/...

执行mvn clean报错

在使用mvn中 在项目所在目录执行mvn clean报下面的错误 Unknown lifecycle phase "...在MyEclipse中执行mvn clean不报错。 解决问题的方法: 1.mvn install 2.mvn compiler:compile 3.mvn org...

Maven Install报错:Perhaps you are running on a JRE rather than a JDK?

[ERROR] Failed to execute goal org.apache.maven.plugins:maven-compiler-plugin:3.5.1:compile (default-compile) on project busiservice: Compilation failure [ERROR] No compiler is pro...

maven 使用命令package或者compile报错 错误: 需要class, interface或enum

maven 使用命令package或者compile报错 [ERROR] Failed to execute goal org.apache.maven.plugins:maven-compiler-plugin:2.3.2:compile (default-compile) on project confmanager: Compilation ...

maven执行"mvn clean package" 命令报错

昨天利用mvn打包,执行程序'mvn clean package' 命令,发现打包失败 问题描述 具体看代码 发信tomcat的log 清除不掉。为什么呢?忽然想起来我的项目服务还起着,于是我把服务关了。在执行一次。 结果成功了。 总结...

Linux下安装maven-及常用命令

Linux下安装maven 1.首先到Maven官网下载安装文件,目前最新版本为3.0.3,下载文件为apache-maven-3.0.3-bin.tar.gz,下载可以使用wget命令; 2.进入下载文件夹,找到下载的文件,运行如下命令解压 tar -xvf ...

mvn报错:No goals have been specified for this build

选择【Run As】-【Maven build】的时候,报: [INFO] Scanning for projects…[INFO] [INFO] BUILD FAILURE[INFO] [INFO] Total time: 0.109s[INFO] Finished at: Wed Apr 13 11:04:20 CST 2011[INFO] Final ...

master分支直接执行mvn clean install会报错

<div><p>报错信息如下: [ERROR] Failed to execute goal org.apache.maven.plugins:maven-compiler-plugin:3.1:testCompile (default-testCompile) on project tracer-core: Compilation failure [ERROR] ...

命令行mvn打包的时候报错:No compiler is provided in this environment. Perhaps you are running on a ...

这部分是安装Elasticsearch-ik中文分词的时候,用mvn打包报错: No compiler is provided in this environment. Perhaps you are running on a JRE rather than a JDK? 在网上百度,大部分是讲解IDE的解决方案,...

Maven 编译报错:Perhaps you are running on a JRE rather than a JDK?解决方法

[ERROR] Failed to execute goal org.apache.maven.plugins:maven-compiler-plugin:3.5.1:compile (default-compile) on project busiservice: Compilation failure [ERROR] No compiler is provided i...

linux mvn 命令_maven svn linux命令行打包java代码

linux svn服务器命令行maven打包java代码,最终生成的XXX3.war为我需要的,它依赖XXX1、XXX2生成的jar1. 安装mavena)安装jdkb)配置maven环境wget ...

Maven: mvn -X 执行报错:No goals have been specified for this build.

Maven: mvn -X 执行报错:No goals have been specified for this build. No goals have been specified for this build. You must specify a valid lifecycle phase or a goal in the format...

springboot打包部署到linux服务器,以及maven install报错的(最全)解决办法!

1.由于springboot集成了tomcat,所以打包的时候不再使用war,而是使用jar   &lt;groupId&gt;cn&lt;/groupId&gt; &lt;artifactId&gt;back&lt;/artifactId&...pack...

centos7 打包 mvn clean compile时 "401 Unauthorized and 'parent.relativePath' points at wrong local ...

近期公司一个项目需要打补丁,刚搭建的补丁部署环境,第一次使用,结果在编译时报如图错误,把解决错误的步骤整理了一下,希望给有...在maven的settings.xml中节点设置自己的nexus私服账户 此处server中的id要与...

java打包类路径填写_maven打包报错:在类路径或引导类路径中找不到程序包 java.lang...

了个新项目,跑了maven报错了:E:\workspace\wlf>mvn clean install[INFO] Scanning for projects...[WARNING][WARNING] Some problems were encountered while building the effective model for ...

mvn package 打包常见错误及解决方案

[ERROR] Failed to execute goal org.apache.maven.plugins:maven-compiler-plugin:3.2:compile (default-compile) on project testkmeans: Fatal error compiling: 无效的目标发行版: 1.7.0_65 -> [Help 1] ...

使用lombok后,项目编译失败

问题:如题,maven中引用lombok 工具后,编译失败。 原因:maven-compiler-plugin 版本过低。 解决:pom文件中指定 maven-compiler-plugin 版本为 3.8.0 后编译成功。 转载于:...

运行mvn提示错误No goals have been specified for this build

运行mvn提示错误 No goals have been specified for this build. You must specify a valid lifecycle phase or a goal in the format : or :[:]:. Available lifecycle phases are:...

Maven报错 解决方案。ERROR: No goals have been specified for this build. You must specify a valid ...

2019独角兽企业重金招聘Python工程师标准>>> ...

mvn命令错误提示,BUILD FAILURE

现在在命令行执行mvn -v 版本信息正确; 但是直接执行mvn就错误了,信息如下: C:\Users\dansan>mvn [INFO] Scanning for projects... [INFO] -----------------------------------------------------------------...

mvn install : operation not permitted

1074 error path D:\workspace2\spring\basic\node_modules\fsevents\node_modules\getpass\node_modules1075 error code EPERM1076 error errno -40481077 error syscall scandir1078 error Error: EPERM: operatio...

android studio configure build报错_MS8.0 在linux系统中安装报错,教你一招化解,So easy...

支持Windows 98、2000、NT、Unix以及Linux等多种操作平台的Materials Studio使化学及材料科学的研究者们能更方便地建立三维结构模型,并对各种晶体、无定型以及高分子材料的性质及相关过程进行深入的研究。...

linux下maven项目打包编译期找不到alipay的jar包 解决

先来错误的提示吧 ERROR] COMPILATION ERROR : [INFO] ------------------------------------------------------------- [ERROR] /developer/git-repository/kykanmall_learning/src/main/java/...

mvn常用命令

Maven总结 概述Mvn是开发人员比较常用的一个项目管理工具,主要是对项目的创建,编译,打包操作,命令简单使用。接下来简单总结一下常用的命令。 软件下载及配置软件下载mvn需要jdk的支持,jdk下载地址:...

相关热词 c# 数据结构和算法 c#+lable加下划线 c# 结构体函数参数 c# 委托 本类 c# 页游辅助 c#绘制虚线 乘法表c# c# 引用反射类 c# 激活进程 c# cs 编译