安装svn时报错 Castom action IntallWMISchemaExecute Failed:无效类 [问题点数:20分]

Bbs1
本版专家分:0
结帖率 0%
Bbs1
本版专家分:0
Bbs1
本版专家分:94
Blank
GitHub 绑定GitHub第三方账户获取
Bbs1
本版专家分:0
安装SVN报错2053
这是<em>安装</em>权限不足的问题。但是右键<em>安装</em>包又没有以管理员身份运行,此时,只能用管理员权限的cmd才行。方法,win+s 搜索cmd右键,以管理员身份运行,接着msiexec \package /你自己的<em>svn</em><em>安装</em>包的路径<em>安装</em>包路劲不要有中文。
eclipse安装SVN报错
eclipse<em>安装</em>SVN<em>报错</em>。 地址:http://subclipse.tigris.org/update_1.8.x 错误消息: An error occurred while collecting items to be installed session context was:(profile=epp.package.jee, phase=org.eclipse.equ
安装svn插件报错
An error occurred while collecting items to be installed session context was:(profile=epp.package.jee, phase=org.eclipse.equinox.internal.p2.engine.phases.Collect, operand=, <em>action</em>=). Unable to read
安装SVN报错
初接触SVN,了解不多,给的材料里有很多<em>安装</em>包,看的眼花缭乱,也不知道该双击哪个,想着问别人吧,肯定秒懂,但是就失去了一次犯错误或者说成长的机会,思来想去,果断掐掉了问同学的念头,当弹出<em>安装</em>错误提示框的时候,心中大喜,为自己没有问别人这一英明决策点了一万个赞     下图是发的<em>安装</em>包,对它三次回眸之后才明白了各个文件都是什么东西     从上到下
svn post-comit hooks failed 报错255
linux上的post-commit文件用记事本打开过,之后<em>svn</em>提交代买就出现post-commit hook <em>failed</em> 错误255,有哪个大神遇到过帮回答一下
MyEeclipse用svn版本控制时,svn报错
我个我的一个项目加<em>svn</em>时<em>报错</em>说:Error while creating module:org.tigris.subversion.javahl.ClientException:rnAuthorization.<em>failed</em> rn 请问这是怎么回事。急谢谢各位大哥的帮助 ,小弟感激不尽。[img=C:\Documents and Settings\Administrator\桌面\截图00.jpg][/img]
SVN提交时Commit Failed的解决方案
SVN提交时Commit Failed,是因为SVN的服务没有打开,解决方案:我的电脑——右击,选择“管理”——点击“服务和应用程序”——右击“VisualAVN Server”,选择“Start”。 操作完成后,再次提交。
svn登陆时它出现:Authorization failed
它包这种错误:rnrnorg.tigris.subversion.javahl.clientexeptin: Authorization <em>failed</em>rnrn这是为什么啊!rnrn我从网上查了好多的资料:rnrn在<em>svn</em>serve.confrnrn[general]rnanon-access = readrnauth-access = writernpassword-db = passwdrnauthz-db = authzrnrn前面的 # 号去掉,然后去掉他前面的空格。保存。rn有的是anon-access = read 但有的是anon-access = none;rnrn在password中:rnrn[users] rnharry = harryssecret rnsally = sallyssecret rnrn最后在authz中:rnrnharry=rwrnrnsally=rwrnrn但是它还是错啊!这是为什么啊!rn
Jenkins在配置SVN验证账户时failed
[img=https://img-bbs.csdn.net/upload/201604/15/1460683075_928030.png][/img]rn是放在TOMCAT环境下的,系统设置里的JDK也是无误的,非MAVEN项目,求大神赐教。
安装时jar文件无效???
1 <em>安装</em>的时候提示jar文件<em>无效</em>,这是什么原因导致的啊?rn2 连发两条信息的时候,提示的时间特别长(这个不是alert的那个提示时间,是我的一个页面显示时间加长了),这个我该怎么办啊rn大家帮帮忙
配置默认action报错
错误描述:Caused by: 元素类型为 "package" 的内容必须匹配 "(result-types?,interceptors?,default-interceptor-ref?,default-<em>action</em>-ref?,default-class-ref?,global-results?,global-exception-mappings?,<em>action</em>*)" 该错误的意思是:pa
SVN更新代码时报错
错误提示: cleanup E:/Eclipse-workspace5-eclipse-mar/Myproject/hebei2-product3.9.0 Problem running log <em>svn</em>: Failed to run the WC DB work queue associated with 'E:\Eclipse-workspace5-eclipse-mar\Myproject
svn 提交时时常报错
Filesystem has no itemrn<em>svn</em>: Commit <em>failed</em> (details follow):rn<em>svn</em>: 没有找到文件: 事务“293-9o”,路径 “/dataSynchro/src/com/ledaojia/dao/BaseDao.java”rn有没有那位高手帮我解答一下啦 谢谢喽
svn更新报错需要cleanup时报错
问题描述:<em>svn</em> update失败,提示已被locked,请执行cleanup。于是执行<em>svn</em> cleanup,发现<em>报错</em>。解决方法:1.用Navicate打开.<em>svn</em>文件夹中的wc.db文件;2.清空wc_lock,work_queue表中的记录,并保存文件;3.执行<em>svn</em> cleanup,成功。...
编译WebRTC时,svn报错
If you are getting the &quot;Mac OS X server certificate verification <em>failed</em>: issuer is not trusted issue&quot; error there is a simple fix which has been found to work:   In Mac OS X open a terminal:   s...
svn update时报错问题!
更新到某个文件夹时报Failed to add directory 'E;/...' a versioned directory of the same name already exists!rnrn 有人遇到过这个问题吗?网上找的试了都不行!换个<em>svn</em>版本也不行!求高手!
STS安装SVN插件报错
[size=24px][color=#FF0000]我是按着步骤做的[/color][/size]rn[img=https://img-bbs.csdn.net/upload/201609/05/1473059984_532280.png][/img]rn[size=24px][color=#FF0000]但是全部完成后,开始下载插件,报出这个错误:[/color][/size]rn[img=https://img-bbs.csdn.net/upload/201609/05/1473060078_957311.png][/img]rn[color=#FF0000][color=#FF0000]怎么解决呢?3.7.1的STS,1.7的JDK, maven还没配置[/color][/color]
MyEclipse 在线安装Svn报错
<em>安装</em>出错,Subclipse Integration for Mylyn 3.x (Optional) 3.0.0。 去掉Integration 这个选项就可以了。
Eclipse 安装SVN插件报错
JDK: 1.7 OS: Mac OSX 简述:Eclipse <em>安装</em> SVN 插件后,使用 SVN 创建本地资源仓库<em>报错</em>: java.security.cert.CertificateException: Certificates does not conform to algorithm constraints 解决办法:JAVA_HOME/jre/lib/security/
liunx下安装svn服务报错
checking whether Apache version is compatible with APR version... nornconfigure: error: Apache version incompatible with APR versionrn请问这是什么意思,难就就是简单的版本不兼容吗。除了更换版本外,还有其他的解决方法吗?rn非常感谢。
安装IBM Agent Controller时报错,service failed to start
[img=C:\Documents and Settings\lshen\Desktop\untitled.JPG][/img]
svn authorization failed
重装了系统,C:\Documents and Settings\Administrator\Application Data\Subversion\auth下面三个文件夹里面全部是空的,我记得原来有用户信息的,怎么在生成一个?
weblogic9.2生产服务器安装报错Domain Creation Failed!
weblogic9.2<em>安装</em>时,配置base_domain,最后一步冒出下面这一段,<em>安装</em>失败了……rnrnPreparing...rnExtracting Domain Contents...rnCreating Domain Security Information...rnSaving the Domain Information...rnStoring Domain Information...rnString Substituting Domain Files...rnPerforming OS Specific Tasks...rnPerforming Post Domain Creation Tasks...rnDomain Creation Failed!rnrnDomain Location: d:\bea\user_projects\domains\salary_domainrnrnReason: Got error in writing the node manager D:\bea\weblogic92\common\nodemanager\nodemanager.domains property file!rnrnException:rnrnjava.lang.Exception: Got error in writing the node manager D:\bea\weblogic92\common\nodemanager\nodemanager.domains property file!rn at com.bea.plateng.domain.DomainNodeManagerHelper.registerDomainToNodeManager(DomainNodeManagerHelper.java:141)rn at com.bea.plateng.domain.DomainNodeManagerHelper.registerDomainToNodeManager(DomainNodeManagerHelper.java:173)rn at com.bea.plateng.domain.DomainGenerator.generate(DomainGenerator.java:435)rn at com.bea.plateng.wizard.domain.gui.tasks.DomainCreationGUITask$1.run(DomainCreationGUITask.java:231)rnrnrnrn坐等答案。rn注:本地<em>安装</em>正常,这是通过远程桌面连接生产服务器<em>安装</em>报的错。
SVN 上传代码出现commit failed 和authorization failed
1.首先上传权限没问题,有读写权限,因为用别人可以上传的帐号在我的电脑上登录上传也会出现问题rn2.已经在save data 中清楚过用户数据,没有作用,在C盘中的用户\AppData\Roaming\Subversion中也清除过,没有解决问题。rn3.重新<em>安装</em>SVN和下载代码还是出现问题rn希望各位帮忙解答一下,谢谢[img=https://img-bbs.csdn.net/upload/201602/25/1456385223_603153.png][/img]
eclipse 安装svn时的svn地址
http://subclipse.tigris.org/update_1.4.x    
struts2下在命令行编译Action类时报错---程序包com.opensymphony.xwork2不存在
我在命令行编译Action类的时候一直都是<em>报错</em>--程序包com.opensymphony.xwork2不存在,但是我是在WEB-INF/lib文件夹里面添加了struts的必要的几个这几个jar包的,这个问题困扰了我几天还是没有解决,希望大家可以帮我解决一下,谢谢啦。rn[img=https://img-bbs.csdn.net/upload/201411/23/1416677733_545712.png][/img]rn[img=https://img-bbs.csdn.net/upload/201411/23/1416677743_551162.png][/img]rn[code=java]package org.crazyit.app.<em>action</em>;rnimport com.opensymphony.xwork2.ActionContext;rnimport com.opensymphony.xwork2.ActionSupport;rnpublic class LoginAction extends ActionSupportrnrn //定义封装请求参数的username和password属性rn private String username;rn private String password;rn rn public String getUsername()rn rn return username;rn rn public void setUsername(String username)rn rn this.username = username;rn rn rn public String getPassword()rn rn return password;rn rn public void setPassword(String password)rn rn this.password = password;rn rn //定义处理用户请求的execute方法rn public String execute() throws Exceptionrn rn //当username为crazyit.org,password为leegang时即登录成功rn if (getUsername().equals("crazyit.org")rn && getPassword().equals("leegang") )rn rn ActionContext.getContext().getSession()rn .put("user" , getUsername());rn return SUCCESS;rn rn elsern rn return ERROR;rn rn rn[/code]rn不知道是什么问题就是不能解决,导致LoginAction类无法编译,谢谢大家啦
使用jacob时报错 Description: 类 Workbook 的 SaveAs 方法无效
[code=Java]rnpackage com.walkman.jacob;rnrnimport java.io.File;rnimport java.io.FileFilter;rnimport java.util.Calendar;rnimport java.util.Date;rnrnimport com.jacob.activeX.ActiveXComponent;rnimport com.jacob.com.ComThread;rnimport com.jacob.com.Dispatch;rnimport com.jacob.com.Variant;rnrnpublic class ExcelToPdf rn private String path;rnrn public ExcelToPdf(String path) rn this.path = path;rn rnrn public void saveExcelAsPdf(String filePath, String outFile) rn ComThread.InitSTA();rn ActiveXComponent actcom = new ActiveXComponent("Excel.Application");rn Dispatch excel = null;rn try rn System.out.println((new Date()).toString()rn + " start convert from : " + filePath + " to " + outFile);rn actcom.setProperty("Visible", new Variant(false));rn Dispatch excels = actcom.getProperty("Workbooks").toDispatch();rn excel = Dispatch.invoke(rn excels,rn "Open",rn Dispatch.Method,rn new Object[] filePath, new Variant(false),rn new Variant(false) , new int[9]).toDispatch();rn Dispatch.invoke(excel, "SaveAs", Dispatch.Method, new Object[] rn outFile, new Variant(57), new Variant(false),rn new Variant(57), new Variant(57), new Variant(false),rn new Variant(true), new Variant(57), new Variant(false),rn new Variant(true), new Variant(false) , new int[1]);rnrn File temp = new File(filePath);rn temp.renameTo(new File(filePath + "." + getDateStr()));rn temp = new File(filePath);rn temp.deleteOnExit();rn temp = null;rn System.out.println((new Date()).toString() + " convert ok : "rn + filePath + " to " + outFile);rn// Dispatch.invoke(dispatchTarget, dispID, wFlags, oArg, uArgErr)rn catch (Exception es) rn es.printStackTrace();rn finally rn Dispatch.call(excel, "Close", new Variant(false));rn if (actcom != null) rn actcom.invoke("Quit", new Variant[] );rn actcom = null;rn rn ComThread.Release();rn rn rnrn public void listAllFile() rn// runFlag = true;rn String fileName = "", appdex = "";rn File temp = null;rn try rn File[] list = new File(path).listFiles(new FileFilter() rn public boolean accept(File pathname) rn boolean x = false;rn if (pathname.getName().toLowerCase().endsWith(".xls")) rn x = true;rn rn return x;rn rn );rn System.out.println((new Date()).toString()rn + " Total Convert File : " + list.length);rn for (int i = 0; i < list.length; i++) rn fileName = list[i].getName().substring(0,rn list[i].getName().indexOf("."));rn appdex = list[i].getName().substring(rn list[i].getName().indexOf("."));rn temp = new File(path + fileName + ".pdf");rn if (temp.exists()) rn temp.renameTo(new File(path + fileName + "-" + getDateStr()rn + ".pdf"));rn rn saveExcelAsPdf(path + fileName + appdex, path + fileNamern + ".pdf");rn rn catch (Exception ex) rn ex.printStackTrace();rn rn// runFlag = false;rn rnrn public String getDateStr() rn Calendar cl = Calendar.getInstance();rn cl.setTime(new Date());rn String str = cl.get(Calendar.YEAR) + "" + (cl.get(Calendar.MONTH) + 1)rn + "" + cl.get(Calendar.DATE) + "" + cl.get(Calendar.HOUR) + ""rn + cl.get(Calendar.MINUTE) + "" + cl.get(Calendar.SECOND);rn return str;rn rnrnrn[/code]rnrn在Main函数中调用上述代码rnrn[code=Java]rnpackage com.walkman.jacob;rnrnimport java.io.File;rnrnpublic class RunTask rn public static void main(String[] args) throws Exception rn String path = "D:\\java_dev\\java_output_20120715.xls";rn String output_path = "D:\\java_dev\\java_output_20120715.pdf";rn try rn File file = new File(path);rn if (file.exists()) rn ExcelToPdf et = new ExcelToPdf(path);rn et.saveExcelAsPdf(path, output_path);rn System.exit(0);rn else rn System.out.println("Path Not Exist,Pls Comfirm: " + path);rn rn catch (Exception ex) rn System.outrn .println("Pls Check Your Format,Format Must Be: java com/olive/util/RunTask Path(Exist Path) Frequency(Run Frequency,int)");rn ex.printStackTrace();rn rn rnrnrnrn[/code]rnrn结果<em>报错</em>如下:rnrn[code=Java]rnMon Jul 16 23:39:24 CST 2012 start convert from : D:\java_dev\java_output_20120715.xls to D:\java_dev\java_output_20120715.pdfrncom.jacob.com.ComFailException: Invoke of: SaveAsrnSource: Microsoft Office ExcelrnDescription: 类 Workbook 的 SaveAs 方法<em>无效</em>rnrn at com.jacob.com.Dispatch.invokev(Native Method)rn at com.jacob.com.Dispatch.invokev(Dispatch.java:625)rn at com.jacob.com.Dispatch.invoke(Dispatch.java:498)rn at com.walkman.jacob.ExcelToPdf.saveExcelAsPdf(ExcelToPdf.java:36)rn at com.walkman.jacob.RunTask.main(RunTask.java:25)rnrn[/code]rnrn没有找到对应的解决办法。请各路高手赐教。
关于svn汉化包安装无效的解决办法
下载<em>svn</em>汉化包要和对应的<em>svn</em>客户端版本对应,否则<em>安装</em><em>无效</em>, 在<em>安装</em>前要想将<em>svn</em><em>安装</em>目录下的languages目录下的文件全部删除 还有一点要注意的是 汉化包<em>安装</em>要放在<em>svn</em><em>安装</em>目录下进行<em>安装</em>,它才能正常汉化 <em>安装</em>完后就可以选择语言了
svn commit失败svn: Authorization failed
仓库建立:<em>svn</em>admin create /srv/<em>svn</em>/repos/debutrnrn<em>svn</em>serve.conf rn[general]rnanon-access = nonernauth-access = writernpassword-db = passwdrnauthz-db = authzrnrn[sasl]rnrnpasswd rn[users]rngy = guo123456rnrnauthz rn[aliases]rnrn[groups]rnrn[/]rngy = rwrnrn/etc/sysconfig/<em>svn</em>serve rnSVNSERVE_OPTIONS="-d -R -r /srv/<em>svn</em>/repos"rnSVNSERVE_USERID="wwwrun"rnSVNSERVE_GROUPID="www"rnrn目录结构:rncvssA:/srv/<em>svn</em> # ll */*/*rn-rw-r--r-- 1 wwwrun www 229 Feb 22 14:13 repos/debut/README.txtrn-r--r--r-- 1 wwwrun www 2 Feb 22 14:13 repos/debut/formatrnrnrepos/debut/conf:rntotal 12rn-rw-r--r-- 1 wwwrun www 1093 Feb 22 19:06 authzrn-rw-r--r-- 1 wwwrun www 324 Feb 22 18:43 passwdrn-rw-r--r-- 1 wwwrun www 2271 Feb 22 19:05 <em>svn</em>serve.confrnrnrepos/debut/db:rntotal 36rn-rw-r--r-- 1 wwwrun www 2 Feb 22 14:13 currentrn-r--r--r-- 1 wwwrun www 22 Feb 22 14:13 formatrn-rw-r--r-- 1 wwwrun www 5 Feb 22 14:13 fs-typerndrwxr-sr-x 3 wwwrun www 4096 Feb 22 14:13 revpropsrndrwxr-sr-x 3 wwwrun www 4096 Feb 22 14:13 revsrndrwxr-sr-x 2 wwwrun www 4096 Feb 22 14:13 trans<em>action</em>srn-rw-r--r-- 1 wwwrun www 2 Feb 22 14:13 txn-currentrn-rw-r--r-- 1 wwwrun www 0 Feb 22 14:13 txn-current-lockrndrwxr-sr-x 2 wwwrun www 4096 Feb 22 14:13 txn-protorevsrn-rw-r--r-- 1 wwwrun www 37 Feb 22 14:13 uuidrn-rw-r--r-- 1 wwwrun www 0 Feb 22 14:13 write-lockrnrnrepos/debut/hooks:rntotal 36rn-rw-r--r-- 1 wwwrun www 2015 Feb 22 14:13 post-commit.tmplrn-rw-r--r-- 1 wwwrun www 1638 Feb 22 14:13 post-lock.tmplrn-rw-r--r-- 1 wwwrun www 2268 Feb 22 14:13 post-revprop-change.tmplrn-rw-r--r-- 1 wwwrun www 1567 Feb 22 14:13 post-unlock.tmplrn-rw-r--r-- 1 wwwrun www 2934 Feb 22 14:13 pre-commit.tmplrn-rw-r--r-- 1 wwwrun www 2038 Feb 22 14:13 pre-lock.tmplrn-rw-r--r-- 1 wwwrun www 2764 Feb 22 14:13 pre-revprop-change.tmplrn-rw-r--r-- 1 wwwrun www 1980 Feb 22 14:13 pre-unlock.tmplrn-rw-r--r-- 1 wwwrun www 2758 Feb 22 14:13 start-commit.tmplrnrnrepos/debut/locks:rntotal 8rn-rw-r--r-- 1 wwwrun www 139 Feb 22 14:13 db-logs.lockrn-rw-r--r-- 1 wwwrun www 139 Feb 22 14:13 db.lockrnrnrn可以checkout,checkout时需要输入用户名和密码,但是在commit的时候出现异常:rn<em>svn</em>: Commit <em>failed</em> (details follow):rn<em>svn</em>: Authorization <em>failed</em>rnrn<em>svn</em> --versionrn<em>svn</em>, version 1.5.2 (r32768)rn compiled Feb 25 2009, 15:18:05rn
安装MySQL5.7时的报错
<em>报错</em>信息 [mysqladmin@mysql ~]$ scripts/mysql_install_db \ &gt; --user=mysqladmin \ &gt; --basedir=/usr/local/mysql \ &gt; --datadir=/usr/local/mysql/data Installing MySQL system tables...2019-04-10 15:...
安装报错
我在<em>安装</em> 找歌,金山快译等软件时弹出对话框如下rn错误号码:0x80070725rn说明:RPC 占位程序的版本不兼容。rn<em>安装</em>程序将立即终止。rn我的机器装的是98第二版的系统rn
安装weblogic1036时报错
我在server 2008 r2上运行weblogic1036.exe时提示错误!rn错误如图rnrn很急,可以解决的话50块红包,微信立马转!rn钱虽少但是英雄的恩情永记rnrn[[img=https://img-bbs.csdn.net/upload/201801/22/1516591548_451617.jpg][/img]
Exchange安装报错
OS: Windows Server2012 R2rnExchange : 2013 U9rn<em>安装</em>时<em>报错</em>-----------------rn错误:rn运行"$error.Clear(); rn Install-ExchangeCertificate -WebSiteName "Exchange Back End" -services "IIS, POP, IMAP" -DomainController $RoleDomainController -InstallInTrustedRootCAIfSelfSigned $truern if ($RoleIsDatacenter -ne $true -And $RoleIsPartnerHosted -ne $true)rn rn Install-AuthCertificate -DomainController $RoleDomainControllerrn rn "时生成以下错误:"Microsoft.Exchange.Management.SystemConfigurationTasks.AddAccessRuleCryptographicException: 由于引发了加密异常,无法授予网络服务访问包含指纹 0A5873E0413F6AA2A8C5BAC88E370BCF7B8DED7C 的证书的权限。 - System.Security.Cryptography.CryptographicException: 拒绝访问。rnrn 在 Microsoft.Exchange.Security.Cryptography.X509Certificates.TlsCertificateInfo.CAPIAddAccessRule(X509Certificate2 certificate, AccessRule rule)rn 在 Microsoft.Exchange.Security.Cryptography.X509Certificates.TlsCertificateInfo.AddAccessRule(X509Certificate2 certificate, AccessRule rule)rn 在 Microsoft.Exchange.Management.SystemConfigurationTasks.ManageExchangeCertificate.EnableForServices(X509Certificate2 cert, AllowedServices services, String websiteName, Boolean requireSsl, ITopologyConfigurationSession dataSession, Server server, List`1 warningList, Boolean allowConfirmation, Boolean forceNetworkService)rn --- 内部异常堆栈跟踪的结尾 ---rn 在 Microsoft.Exchange.Configuration.Tasks.Task.WriteError(Exception exception, ErrorCategory category, Object target, Boolean reThrow, String helpUrl)rn 在 Microsoft.Exchange.Configuration.Tasks.Task.WriteError(Exception exception, ErrorCategory category, Object target)rn 在 Microsoft.Exchange.Management.SystemConfigurationTasks.InstallExchangeCertificate.EnableForServices(X509Certificate2 cert, AllowedServices services)rn 在 Microsoft.Exchange.Management.SystemConfigurationTasks.InstallExchangeCertificate.InternalProcessRecord()rn 在 Microsoft.Exchange.Configuration.Tasks.Task.b__b()rn 在 Microsoft.Exchange.Configuration.Tasks.Task.InvokeRetryableFunc(String funcName, Action func, Boolean terminatePipelineIfFailed)"。rnrn
安装pycocotools时报错
<em>安装</em>pycocotools: 下载好<em>安装</em>包到本地(链接:https://github.com/cocodataset/cocoapi),进入cocoapi-master/PythonAPI/文件夹下执行make编译: $ cd cocoapi-master/ $ cd PythonAPI/ $ make <em>报错</em>: python setup.py build_ext --inplace r...
安装openssl时报错
提示:operating system:i686-whatever-linux2rnthis system(linux-elf) is not supported. rnrn红旗2.0rn rn
安装libva时报错
<em>安装</em>libva时<em>报错</em> 1、make时提示:exec: g++: not found 解决方案:<em>安装</em>gcc-c++ yum install -y gcc-c++ 2、make时<em>报错</em> libtool: link: unsupported hardcode properties libtool: link: See the libtool documentation
安装libpcap时报错
1 下载了libpcap-1.5.2.tar.gz。rn2 tar -vxf libpcap-1.5.2.tar.gzrn3 ./configurern4 make 发生错误。rn[root@master libpcap-1.5.2]# makerngcc -fpic -I. -I/usr/include/dbus-1.0 -I/usr/lib64/dbus-1.0/include -DHAVE_CONFIG_H -D_U_="__attribute__((unused))" -g -O2 -c ./pcap-dbus.crn./pcap-dbus.c: In function ‘dbus_write’:rn./pcap-dbus.c:111: 错误:‘DBUS_ERROR_INIT’ 未声明 (在此函数内第一次使用)rn./pcap-dbus.c:111: 错误:(即使在一个函数内多次出现,每个未声明的标识符在其rn./pcap-dbus.c:111: 错误:所在的函数内只报告一次。)rn./pcap-dbus.c: In function ‘dbus_activate’:rn./pcap-dbus.c:165: 错误:‘DBUS_ERROR_INIT’ 未声明 (在此函数内第一次使用)rnmake: *** [pcap-dbus.o] 错误 1rnrn求解!thanks
安装win32Oracle11g时报错
<em>安装</em>文件是在官网上用迅雷下载的,共两个文件,解压到同一个文件夹时提示有文件重复,选择覆盖或者不覆盖<em>安装</em>效果都一样,报如下错误[img=https://img-bbs.csdn.net/upload/201307/13/1373693967_732526.jpg][/img]rn请高手帮忙解决,还是说<em>安装</em>文件有错误,若<em>安装</em>文件问题求可用版本
delphi安装报错
delphi<em>安装</em>是<em>报错</em>如下:rn此产品的配置信息已损坏,请与您的技术支持人员联系!
安装Vue-cli时报错
<em>安装</em>Vue-cli时<em>报错</em> vue init webpack my-proj vue-cli · Failed to download repo vuejs-templates/webpack: read ECONNRESET 可能原因访问不到GitHub,试下用自己的手机开启无线网连接 ...
安装MySQL-python时报错
<em>安装</em>MySQL-python时<em>报错</em> (py27) [root@test SimpletourDevops]# pip install MySQL-python DEPRECATION: Python 2.7 will reach the end of its life on January 1st, 2020. Please upgrade yo...
swoole安装报错
PHP Warning:  PHP Startup: Unable to load dynamic library 'swoole' (tried: /usr/local/php/lib/php/extensions/no-debug-non-zts-20170718/swoole (/usr/local/php/lib/php/extensions/no-debug-non-zts-201707...
安装beautifulsoup时报错
<em>安装</em>beautifulsoup4时<em>报错</em>,然后在当前目录中将bs4改名为beautifulsoup,可以运行,不过他显示继续<em>报错</em>。 求指导该怎么解决。
安装profiler时报错
[img=https://img-bbs.csdn.net/upload/201508/08/1438997832_822798.png][/img]
安装JK2时报错
我在<em>安装</em>JK2时:rn./configure --with-apxs2=/usr/local/web/apache/bin/apxs --with-apr-lib=/usr/local/web/apache/bin --with-tomcal-41=/usr/local/apache-tornmcat-6.0.35 --with-java-home=/usr/java/jdk1.7.0_02 --with-jnirnrn<em>报错</em>:rnerrorrncompiler discovered by configure: gccrncompiler used by apache: gcc -std=gnu99rndelete config.cache and try CC=gcc -std=gnu99 ./configurernconfigure: error: jk2 and apache compilers must be the samernrn在网上查了下这个错误,只找到了这个:rn[url=http://forums.gentoo.org/viewtopic-p-2227818.html][/url]rnrn但是我不太懂怎么搞,有谁能帮我下吗?谢谢rn
fastdfs 安装报错
[2018-10-22 18:50:14] ERROR - file: tracker_proto.c, line: 48, server: 192.168.2.111:22122, response status 2 != 0 [2018-10-22 18:50:14] ERROR - file: ../client/tracker_client.c, line: 907, fdfs_recv_...
安装mssql2005时报错
我的操作系统是xp sp2的以前也<em>安装</em>也都是可以的,就这一次我系统重装后再<em>安装</em>2005就<em>报错</em>,提示当前脚本页面发生错误.rn错误:%1 不是有效的Win32用应程序!rn请各位大侠帮助解决一下
安装perl-GD-2.35-2ext.i386.rpm时报错
当我“rpm -ivh perl-GD-2.35-2ext.i386.rpm ”,却报如下错误:rn錯誤:相依性失。?rn gd >= 2.0 是 perl-GD-2.35-2ext.i386 所需要的rn libgd.so.2 是 perl-GD-2.35-2ext.i386 所需要的rn 建議的解方法:rn /home/buildcentos/CENTOS/en/4.0/i386/CentOS/RPMS/gd-2.0.28-5.4E.i386.rpmrnrn但是libgd.so.2系统中是存在的啊?rn那个 "gd >= 2.0"是什么东东啊?rn谢谢了。rn
安装react时报错
用npm<em>安装</em>react时<em>报错</em>Refusing to install react as a dependency of itself不能把项目取名为 react,项目的 package.json 里面 name 的值不能是 react,也不能是你项目其他依赖包的名字,也就是和依赖包不能重名
安装ROSE时报错
弹出信息:rn无法定位程序输入点?setHostName@CLicense@RationalSuite@@QAEXABV_bstr_t@@@Z于动态链接库license.dll上.
安装myeclipse8.5时报错
[img=http://img.my.csdn.net/uploads/201212/21/1356099055_8766.png][/img]<em>安装</em>myeclipse8.5时报如图错误,请有遇到过此错误的朋友赐教
vs2005 在类关系图 添加类 报错 failed to create class
在vs2005中 创建一个(ClassLibrary)项目 点击类关系图 在工具箱中拖动“class”或任意一个“工具”添加 都会<em>报错</em> rn<em>报错</em>内容 rn“<em>failed</em> to create class”或“<em>failed</em> to create enum”。请问高手这是怎么会是?是那里设置的不对么?谢谢
安装MSDE时报错说“指定的实例名无效
<em>安装</em>MSDE时<em>报错</em>说“指定的实例名<em>无效</em>”,然后就退出<em>安装</em>rn不知哪位遇到过这种问题rn怎么解决
下载了一天的 sp2,安装报错“updatebr.inf 无效
怎么办??帮忙~~rnrn会不会和D版有关?
svn 报错
刚装SVN插件的时候没问题,可以连接服务器,后来因为公司一些googledocs需要上代理才能打开,所以就装了个代理。之后又从新连到SVN服务器时就出现了问题 RA layer request <em>failed</em><em>svn</em>: OPTIONS of 'https://192.168.0.104/<em>svn</em>/waps': could not connect to server (https://192.168.0...
SVN报错
新编译的文件上传遗漏。
svn报错
一、期望文件系统格式在“1”到“4”之间;发现格式“6” 1,有说是因为客户端版本的问题,可我在服务器上测试也是一样的情况;有说是可以在SVN 的服务端仓库里 当前项目/db/format 文件打开 把6改为4即可 2,或者 重启服务 二、<em>svn</em>图标不显示问题:http://jingyan.baidu.com/article/36d6ed1f4c96901bce48835...
关于SVN报错svn : RA layer request failed,不能正常使用SVN
关于SVN<em>报错</em>,<em>svn</em> : RA layer request <em>failed</em>,链接不上<em>svn</em>地址,问题可能如网上的所诉有很多,但我的是修改了一个client客户端接口就可以了,我的<em>svn</em>是淘宝的一个网络地址,可本地<em>svn</em>地址使用javaHL就可以,如果有大神明白,说一下原因,谢谢;     下文有图可见:
报错not overflow on horizontal.assert failed!
今天写的程序运行时报这个错,请问下怎么回事?
Debug Assertion failed报错
程序的debug版在运行时出现Debug Assertion <em>failed</em>!<em>报错</em>,因为一时找不出错在那里,rn请问有其它的方法使debug版在运行时不出Debug Assertion <em>failed</em>!<em>报错</em>
Nginx报错 malloc failed
Nginx 版本:1.9.6.1 一开始那几天还好,最近几天经常报内存不足的错误,而且是不稳定重现,rnrn[img=https://img-bbs.csdn.net/upload/201510/30/1446171676_265204.png][/img]rnrn贴上配置,服务器配置:16核32G windows 2008rnrn#user nobody;rnworker_processes 8;rn#error_log logs/error.log;rn#error_log logs/error.log notice;rn#error_log logs/error.log info;rn#pid logs/nginx.pid;rnevents rnworker_connections 32768;rnrnhttp rninclude mime.types;rndefault_type application/octet-stream;rn#log_format main '$remote_addr - $remote_user [$time_local] "$request" 'rn# '$status $body_bytes_sent "$http_referer" 'rn# '"$http_user_agent" "$http_x_forwarded_for"';rnrn#access_log logs/access.log main;rn#large_client_header_buffers 8 128k;rnrnrn # 设定请求缓冲 设置开始 rnrn #server_names_hash_bucket_size 128;rnrn client_header_buffer_size 128k;rnrn large_client_header_buffers 4 256k;rnrn client_max_body_size 64M; # 允许客户端请求的最大单文件字节数rnrn client_body_buffer_size 128k; # 缓冲区代理缓冲用户端请求的最大字节数rnrn # 设定请求缓冲 设置结束rnrn #log_format main '$remote_addr - $remote_user [$time_local] "$request" 'rnrn # '$status $body_bytes_sent "$http_referer" 'rnrn # '"$http_user_agent" "$http_x_forwarded_for"';rnrn #access_log logs/access.log main;rnrn sendfile on;rnrn tcp_nopush on;rnrn #keepalive_timeout 0;rnrn keepalive_timeout 150;rnrn tcp_nodelay on;rnrn fastcgi_connect_timeout 300;rnrn fastcgi_send_timeout 300;rnrn fastcgi_read_timeout 300;rnrn fastcgi_buffer_size 64k;rnrn fastcgi_buffers 4 64k;rnrn fastcgi_busy_buffers_size 128k;rnrn fastcgi_temp_file_write_size 128k;rnrn ##cache 配置 ##rnrn proxy_connect_timeout 600;#nginx 跟后端服务器连接超时时间 ( 代理连接超时 )rnrn proxy_read_timeout 600;# 连接成功后,后端服务器响应时间 ( 代理接收超时 )rnrn proxy_send_timeout 600; # 后端服务器数据回传时间 ( 代理发送超时 )rnrn proxy_buffer_size 64M; # 设置代理服务器( nginx )保存用户头信息的缓冲区大小rnrn proxy_buffers 4 64M; #proxy_buffers 缓冲区,网页平均在 32k 以下的话,这样设置rnrn proxy_busy_buffers_size 128M;# 高负荷下缓冲大小( proxy_buffers*2 )rnrn proxy_temp_file_write_size 200m;# 设定缓存文件夹大小,大于这个值,将从 upstream 服务器传rnrnrn #gzip 压缩开始rnrn gzip on;rnrn gzip_min_length 1k;rnrn gzip_buffers 4 8k;rnrn gzip_http_version 1.1;rnrn gzip_types text/plain image/jpg image/jpeg image/gif image/png;rnrn gzip_disable "MSIE [1-6]\.";rnrn #gzip 压缩结束rnrn #服务器的集群 rn upstream ********* rn #ip_hash;rn #服务器集群名字 rn #server 172.16.21.13:8081 weight=1;#服务器配置 weight是权重的意思,权重越大,分配的概率越大。 rn server 10.251.148.218 max_fails=3 fail_timeout=30s weight=10; rn server 10.144.229.83 max_fails=3 fail_timeout=30s weight=10;rn server 10.163.200.195 max_fails=3 fail_timeout=30s weight=15;rn server 10.163.226.8 max_fails=3 fail_timeout=30s weight=20;rnrn #server 10.165.59.203:8001 max_fails=3 fail_timeout=30s weight=10; rn #server 10.165.59.203:8002 max_fails=3 fail_timeout=30s weight=10; rn #server 10.165.59.203:8003 max_fails=3 fail_timeout=30s weight=10; rn rnrnserver rn listen 80;rn server_name *********rn #charset koi8-r;rnrn access_log logs/host.access.log ;rnrn if ($http_user_agent ~* "Googlebot|Googlebot-Mobile|Googlebot-Image|Mediapartners-Google|Adsbot-Google|Feedfetcher-Google|Yahoo! Slurp|Yahoo! Slurp China|MSNBot|ia_archiver|Tomato Bot") rn return 403; rn rnrnrn location / rn proxy_pass ********* rn proxy_redirect default; rnrn # 传递真实 ip 给分发服务器 获取真实访问用户 iprn # 在后台可以使用 HttpContext.Current.Request.Headers["X-Real-IP"]rnrn proxy_set_header Host $host;rn proxy_set_header X-Real-IP $remote_addr;rn proxy_set_header X-Forwarded-For $proxy_add_x_forwarded_for;rn rnrn # 请求包含 Admin 带头的所有文件rnrn location /Content rnrn proxy_pass *********rnrn proxy_redirect off;rnrn proxy_set_header Host $host;rnrn # 请求静态文件设置rnrn proxy_cache_valid 200 302 1d;# 设置 http 状态码为 200,302 缓存时间为 1 小时rnrn proxy_cache_valid 301 1d;# 设置失期时间,为 30 天rnrn proxy_cache_valid any 1h;rnrn expires 30d;rnrn # 传递真实 ip 给分发服务器rnrn proxy_set_header X-Real-IP $remote_addr;rnrn rnrn # 请求包含 Resource 带头的所有文件rnrn location /Resource rnrn proxy_pass *********rnrn proxy_redirect off;rnrn proxy_set_header Host $host;rnrn # 请求静态文件设置rnrn proxy_cache_valid 200 302 1d;# 设置 http 状态码为 200,302 缓存时间为 1 小时rnrn proxy_cache_valid 301 1d;# 设置失期时间,为 30 天rnrn proxy_cache_valid any 1m;rnrn expires 30d;rnrn rnrnrn #error_page 404 /404.html;rnrn # redirect server error pages to the static page /50x.htmlrn #rn error_page 500 502 503 504 /50x.html;rn #location = /50x.html rn # root html;rn #rnrn # proxy the PHP scripts to Apache listening on 127.0.0.1:80rn #rn #location ~ \.php$ rn # proxy_pass http://127.0.0.1;rn #rnrn # pass the PHP scripts to FastCGI server listening on 127.0.0.1:9000rn #rn #location ~ \.php$ rn # root html;rn # fastcgi_pass 127.0.0.1:9000;rn # fastcgi_index index.php;rn # fastcgi_param SCRIPT_FILENAME /scripts$fastcgi_script_name;rn # include fastcgi_params;rn #rnrn # deny access to .htaccess files, if Apache's document rootrn # concurs with nginx's onern #rn #location ~ /\.ht rn # deny all;rn #rnrnrnrn# another virtual host using mix of IP-, name-, and port-based configurationrn#rn#server rn# listen 8000;rn# listen somename:8080;rn# server_name somename alias another.alias;rnrn# location / rn# root html;rn# index index.html index.htm;rn# rn#rnrnrn# HTTPS serverrn#rn#server rn# listen 443;rn# server_name localhost;rnrn# ssl on;rn# ssl_certificate cert.pem;rn# ssl_certificate_key cert.key;rnrn# ssl_session_timeout 5m;rnrn# ssl_protocols SSLv2 SSLv3 TLSv1;rn# ssl_ciphers HIGH:!aNULL:!MD5;rn# ssl_prefer_server_ciphers on;rnrn# location / rn# root html;rn# index index.html index.htm;rn# rn#
Action类和action请求
WEB资源:       HttpServletRquest,HttpServletSession,Cookie等,原生Servlet  API   Servlet访问WEB资源的方式     Servlet API解耦的方式(只能访问到有限的Servlet API对象和方法)        >使用ActionContext import java.util.Map;
svn cleanup failed错误的解决方法
有时候执行<em>svn</em>的clean up 的时候会<em>报错</em>: <em>svn</em> cleanup <em>failed</em>–previous operation has not finished; run cleanup if it was interrupted 并且那些文件的标志都不再显示 解决办法:清空SVN的队列 1、下载sqlite3.exe并将其写入系统环境变量 2、找到你项目的.<em>svn</em>文件,查看
sybase12.5安装时Adaptive Server Configuration failed
<em>安装</em>过程中,配置adaptive Server <em>报错</em>。日志如下:rn12/28/15 11:30:46 AM SyBatch/12.5.2/P/PC INTEL/Windows NT 4.0/4/OPTrn12/28/15 11:30:46 AM Confidential property of Sybase, Inc. rn Copyright Sybase Inc., 1996 - 2004.rn Sybase, Inc. All rights reserved.rn Unpublished rights reserved under U.S. copyright lawsrn rn This software contains confidential and trade secretrn information of Sybase, Inc. Use, duplication, or diclosurern of the software and documentation by the U.S. Governmentrn is subject to restrictions as set forth in a license rn agreementrn between the Government and Sybase,Inc. or other writtenrn agreement specifying the Government's rights to use thern software and any applicable FAR provisions, for example,rn FAR 52.227-19.rn Sybase, Inc. One Sybase Drive, Dublin, CA 94568, USA.rn rn12/28/15 11:30:46 AM BEGIN ENVIRONMENT INFORMATIONrnrnUSER ENVIRONMENTrn----------------------------------------rncurrent directory: D:\sybase12.5rncharacter set: iso_1rnlanguage: us_englishrnauditinit release directory: D:\sybase12.5rnworking release directory: D:\sybase12.5rnrnrn12/28/15 11:30:46 AM END ENVIRONMENT INFORMATIONrn12/28/15 11:30:46 AM Using resource file 'D:\sybase12.5\ASE-12_5\sqlsrv.res' for rn product attributes.rn12/28/15 11:30:46 AM Running task: update Sybase Server entry in interfaces rn file.rn12/28/15 11:30:46 AM Task succeeded: update Sybase Server entry in interfaces rn file.rn12/28/15 11:30:46 AM Running task: create the master device.rn12/28/15 11:30:48 AM Calling the shell with rn 'D:\sybase12.5\ASE-12_5\bin\sqlsrvr.exe rn -dD:\sybase12.5\data\master.dat -b30M -z2048 rn -eD:\sybase12.5\ASE-12_5\install\YINJISENPC.log rn -sYINJISENPC -MD:\sybase12.5\ASE-12_5 '.rn12/28/15 11:30:59 AM Calling the shell with '-1073741515 = return code.'.rn12/28/15 11:30:59 AM Donern12/28/15 11:30:59 AM Begin output from 'sqlsrvr':rn12/28/15 11:30:59 AM End output from 'sqlsrvr'.rn12/28/15 11:30:59 AM Task <em>failed</em>: create the master device. Terminating rn configuration.rn12/28/15 11:30:59 AM Configuration <em>failed</em>.rn12/28/15 11:30:59 AM Exiting.rn12/28/15 11:30:59 AM The log file for this session is rn 'D:\sybase12.5\ASE-12_5\init\logs\log1228.001'.rn12/28/15 11:30:59 AM Log close.
datawindow的按钮 action无效!!
我想用按钮实现对每一列的过滤功能。rn比如,点击按钮,按用户名分组列出,或者点击按钮,使得插入记录按插入时间(表中字段)排序。rn但是,按钮的<em>action</em>中我写入查询表达式,点击按钮之后没有任何效果。rn但是在Row--filter中同样的表达式就没有问题,请教一下是怎么回事?
svn cleanup无效解决方法
windows下 del lock /q/s linux下 rm lock -fr C:\Documents and Settings&gt;del /? 删除一个或数个文件。 DEL [/P] [/F] [/S] [/Q] [/A[[:]attributes]] names ERASE [/P] [/F] [/S] [/Q] [/A[[:]attributes]] names ...
svn 认证配置无效
1.可能原因之一:服务端conf目录下的两个文件authz和passwd中可能存在重复的用户名或者组名(随着时间的推移,由于用户组和用户多了,就极可能存在重复),而导致客户端认证配置<em>无效</em>。 2.其它可能原因:比如存在多余空格,中文标点,中文字符,权限不对,路径不对,组名不对,用户名不对,等等。需要仔细逐行排查。goodluck!!!...
ssh中表单提交到action报错
org.springframework.beans.ConversionNotSupportedException: Failed to convert property value of type 'com.sun.proxy.Proxy25implementingper.czt.blog.service.interfaces.UsersServiceInter,per.czt.blog.bas...
action返回前台jsp时报错
Method public java.lang.String org.apache.commons.lang.exception.NestableRuntimeException.getMessage(int) threw an exception when invoked on net.sf.json.JSONException: Object is nullrnThe problematic instruction:rn----------rn==> $msg[0] [on line 68, column 29 in org/apache/struts2/dispatcher/error.ftl]rn----------rnrnJava backtrace for programmers:rn----------rnfreemarker.template.TemplateModelException: Method public java.lang.String org.apache.commons.lang.exception.NestableRuntimeException.getMessage(int) threw an exception when invoked on net.sf.json.JSONException: Object is nullrn at freemarker.ext.beans.SimpleMethodModel.exec(SimpleMethodModel.java:130)rn at freemarker.ext.beans.SimpleMethodModel.get(SimpleMethodModel.java:138)rn at freemarker.core.DynamicKeyName.dealWithNumericalKey(DynamicKeyName.java:111)rn at freemarker.core.DynamicKeyName._getAsTemplateModel(DynamicKeyName.java:90)rn at freemarker.core.Expression.getAsTemplateModel(Expression.java:89)rn at freemarker.core.Expression.getStringValue(Expression.java:93)rn at freemarker.core.DollarVariable.accept(DollarVariable.java:76)rn at freemarker.core.Environment.visit(Environment.java:221)rn at freemarker.core.MixedContent.accept(MixedContent.java:92)rn at freemarker.core.Environment.visit(Environment.java:221)rn at freemarker.core.IfBlock.accept(IfBlock.java:82)rn at freemarker.core.Environment.visit(Environment.java:221)rn at freemarker.core.IteratorBlock$Context.runLoop(IteratorBlock.java:179)rn at freemarker.core.Environment.visit(Environment.java:428)rn at freemarker.core.IteratorBlock.accept(IteratorBlock.java:102)rn at freemarker.core.Environment.visit(Environment.java:221)rn at freemarker.core.MixedContent.accept(MixedContent.java:92)rn at freemarker.core.Environment.visit(Environment.java:221)rn at freemarker.core.IfBlock.accept(IfBlock.java:82)rn at freemarker.core.Environment.visit(Environment.java:221)rn at freemarker.core.MixedContent.accept(MixedContent.java:92)rn at freemarker.core.Environment.visit(Environment.java:221)rn at freemarker.core.Environment.process(Environment.java:199)rn at freemarker.template.Template.process(Template.java:259)rn at org.apache.struts2.dispatcher.Dispatcher.sendError(Dispatcher.java:830)rn at org.apache.struts2.dispatcher.Dispatcher.serviceAction(Dispatcher.java:534)rn at org.apache.struts2.dispatcher.ng.ExecuteOperations.executeAction(ExecuteOperations.java:77)rn at org.apache.struts2.dispatcher.ng.filter.StrutsExecuteFilter.doFilter(StrutsExecuteFilter.java:88)rn at org.apache.catalina.core.ApplicationFilterChain.internalDoFilter(ApplicationFilterChain.java:241)rn at org.apache.catalina.core.ApplicationFilterChain.doFilter(ApplicationFilterChain.java:208)rn at com.zst.cloudzst.util.UrlFilter.doFilter(UrlFilter.java:60)rn at org.apache.catalina.core.ApplicationFilterChain.internalDoFilter(ApplicationFilterChain.java:241)rn at org.apache.catalina.core.ApplicationFilterChain.doFilter(ApplicationFilterChain.java:208)rn at org.apache.struts2.dispatcher.ng.filter.StrutsPrepareFilter.doFilter(StrutsPrepareFilter.java:82)rn at org.apache.catalina.core.ApplicationFilterChain.internalDoFilter(ApplicationFilterChain.java:241)rn at org.apache.catalina.core.ApplicationFilterChain.doFilter(ApplicationFilterChain.java:208)rn at org.apache.catalina.core.StandardWrapperValve.invoke(StandardWrapperValve.java:218)rn at org.apache.catalina.core.StandardContextValve.invoke(StandardContextValve.java:122)rn at org.apache.catalina.authenticator.AuthenticatorBase.invoke(AuthenticatorBase.java:505)rn at org.apache.catalina.core.StandardHostValve.invoke(StandardHostValve.java:169)rn at org.apache.catalina.valves.ErrorReportValve.invoke(ErrorReportValve.java:103)rn at org.apache.catalina.valves.AccessLogValve.invoke(AccessLogValve.java:956)rn at org.apache.catalina.core.StandardEngineValve.invoke(StandardEngineValve.java:116)rn at org.apache.catalina.connector.CoyoteAdapter.service(CoyoteAdapter.java:442)rn at org.apache.coyote.http11.AbstractHttp11Processor.process(AbstractHttp11Processor.java:1082)rn at org.apache.coyote.AbstractProtocol$AbstractConnectionHandler.process(AbstractProtocol.java:623)rn at org.apache.tomcat.util.net.AprEndpoint$SocketProcessor.doRun(AprEndpoint.java:2517)rn at org.apache.tomcat.util.net.AprEndpoint$SocketProcessor.run(AprEndpoint.java:2506)rn at java.util.concurrent.ThreadPoolExecutor.runWorker(ThreadPoolExecutor.java:1145)rn at java.util.concurrent.ThreadPoolExecutor$Worker.run(ThreadPoolExecutor.java:615)rn at org.apache.tomcat.util.threads.TaskThread$WrappingRunnable.run(TaskThread.java:61)rn at java.lang.Thread.run(Thread.java:722)rnCaused by: java.lang.NullPointerExceptionrn at freemarker.ext.beans.SimpleMemberModel.unwrapArguments(SimpleMemberModel.java:86)rn at freemarker.ext.beans.SimpleMethodModel.exec(SimpleMethodModel.java:106)rn ... 51 morern十一月 26, 2016 4:08:36 下午 org.apache.catalina.core.StandardWrapperValve invokernSEVERE: Servlet.service() for servlet [default] in context with path [/co] threw exceptionrnjava.lang.IllegalStateException: Cannot call sendError() after the response has been committedrn at org.apache.catalina.connector.ResponseFacade.sendError(ResponseFacade.java:450)rn at org.apache.struts2.dispatcher.Dispatcher.sendError(Dispatcher.java:834)rn at org.apache.struts2.dispatcher.Dispatcher.serviceAction(Dispatcher.java:534)rn at org.apache.struts2.dispatcher.ng.ExecuteOperations.executeAction(ExecuteOperations.java:77)rn at org.apache.struts2.dispatcher.ng.filter.StrutsExecuteFilter.doFilter(StrutsExecuteFilter.java:88)rn at org.apache.catalina.core.ApplicationFilterChain.internalDoFilter(ApplicationFilterChain.java:241)rn at org.apache.catalina.core.ApplicationFilterChain.doFilter(ApplicationFilterChain.java:208)rn at com.zst.cloudzst.util.UrlFilter.doFilter(UrlFilter.java:60)rn at org.apache.catalina.core.ApplicationFilterChain.internalDoFilter(ApplicationFilterChain.java:241)rn at org.apache.catalina.core.ApplicationFilterChain.doFilter(ApplicationFilterChain.java:208)rn at org.apache.struts2.dispatcher.ng.filter.StrutsPrepareFilter.doFilter(StrutsPrepareFilter.java:82)rn at org.apache.catalina.core.ApplicationFilterChain.internalDoFilter(ApplicationFilterChain.java:241)rn at org.apache.catalina.core.ApplicationFilterChain.doFilter(ApplicationFilterChain.java:208)rn at org.apache.catalina.core.StandardWrapperValve.invoke(StandardWrapperValve.java:218)rn at org.apache.catalina.core.StandardContextValve.invoke(StandardContextValve.java:122)rn at org.apache.catalina.authenticator.AuthenticatorBase.invoke(AuthenticatorBase.java:505)rn at org.apache.catalina.core.StandardHostValve.invoke(StandardHostValve.java:169)rn at org.apache.catalina.valves.ErrorReportValve.invoke(ErrorReportValve.java:103)rn at org.apache.catalina.valves.AccessLogValve.invoke(AccessLogValve.java:956)rn at org.apache.catalina.core.StandardEngineValve.invoke(StandardEngineValve.java:116)rn at org.apache.catalina.connector.CoyoteAdapter.service(CoyoteAdapter.java:442)rn at org.apache.coyote.http11.AbstractHttp11Processor.process(AbstractHttp11Processor.java:1082)rn at org.apache.coyote.AbstractProtocol$AbstractConnectionHandler.process(AbstractProtocol.java:623)rn at org.apache.tomcat.util.net.AprEndpoint$SocketProcessor.doRun(AprEndpoint.java:2517)rn at org.apache.tomcat.util.net.AprEndpoint$SocketProcessor.run(AprEndpoint.java:2506)rn at java.util.concurrent.ThreadPoolExecutor.runWorker(ThreadPoolExecutor.java:1145)rn at java.util.concurrent.ThreadPoolExecutor$Worker.run(ThreadPoolExecutor.java:615)rn at org.apache.tomcat.util.threads.TaskThread$WrappingRunnable.run(TaskThread.java:61)rn at java.lang.Thread.run(Thread.java:722)rn这是具体<em>报错</em>信息,debug跟进的时候后台<em>action</em>返回success,走完debug之后就出现以上<em>报错</em>信息,试过百度的解决方案判断各value值是否为空也还是<em>报错</em>,望各路大神能给分析分析这是什么原因?急急急!!!
struts2调用Action的list方法时报错
直接访问,localhost/project/user,可以找到Action,并执行execute()方法;rn现在想访问Action中的list()方法;rnpublic String list() throws Exception rn return "list" ;rnrnrnstruts.xmlrn rn rn /success.jsprn /list.jsprn rn rnrn浏览器访问localhost/project/user!list会<em>报错</em>rn-------------------rnThere is no Action mapped for namespace / and <em>action</em> name user!list.rn-------------------rnrn请问这是怎么回事?
SVN认证配置无效
在<em>svn</em>serve.conf中的“authz-db = authz.conf”这行的#号去掉,打开SVN的时候就会出现“认证配置<em>无效</em>”,,为什么啊?郁闷的是 我authz.conf里面什么都没有的,全是#号标注了呀。。。问了老大,问题依旧啊,请大家出出主意吧,真没辙了啊 撞墙了啊
对话框类程序退出时报错!!
我做了一个基于对话框的TCP/IP聊天程序,程序运行时点击关闭,就会内存<em>报错</em>,请问可能是哪些方面出错?rn[img=http://ys-g.ys168.com/?error.jpg_4s7bsp7e1ejs7bs5btmrool1btlpjt0c4b5btn0cpllju0u12f03za][/img]rn说明:我写了两个线程,一个线程用以监听,另一个用以接收,是线程的原因么?
使用File类时报错!!
import java.io.*;rnclass Filern public static void main(String[] args)rn File dir=new File("F:\\javaml\\1");rn dir.mkdir();rn rnrn编译<em>报错</em>:rntest.java:4: 找不到符号rn符号: 构造函数 File(java.lang.String)rn位置: 类 Filern File dir=new File("F:\\javaml\\1");rn ^rntest.java:5: 找不到符号rn符号: 方法 mkdir()rn位置: 类 Filern dir.mkdir();rn ^rn2 错误rn
Junit测试时数据库链接类报错
我的WEB项目中有个数据库连接的工具类,单独运行或者测试时就会报系统找不到指定路径的错。但是整个项目运行时则不会。请高手解答。
svn报错:新建url时,连不上
新建URL时报些错:org.tigris.subversion.javahl.ClientException:Authorization <em>failed</em>   出现authorization <em>failed</em>异常,一般都是authz文件里,用户组或者用户权限没有配置好,只要设置[/]就可以,代表根目录下所有的资源,如果要限定资源,可以加上子目录即可。...
SVN重新更新或者提交时报错
错误描述:    Attempted to lock an already-locked dir <em>svn</em>: Working copy 'D:\user\workspace\ColdChainServer' locked. <em>svn</em>: 'D:\user\workspace\ColdChainServer' is already locked. 解决方法: 选择你要选择的proje
eclipse svn资源同步时报错
今天早上,在eclipse里的<em>svn</em>里进行资源同步时,发现一个问题,在对java文件进行同步时,正常情况下,双击文件会打开一个本地文件和资源库文件的比较窗口,会显示本地文件和资源库文件的不同之处,可是今天打开java文件时,本地文件会自动被替换成资源库文件,对jsp进行操作时则是正常的。这是什么原因?
SVN `Clean up`时报错如何处理
更新SVN 时,提示需先clean up, 而后执行 Clean up时却<em>报错</em>(Cleanup <em>failed</em> to process the follo paths:)了。 其实通过提示也不难看出,是文件名定义了一些SVN 不支持的字符。处理也很简单,你可以修改文件名或提醒作者更改。但有时候,你没有权限,也联系不上相关人员,此时应该如何处理呢? 首先准备一个sqllite3的工具。(链接:http...
SVN在导入工程时报错,显示的是乱码
出现错误:璁よ瘉澶辫触rn然后就完成了,不知道这个乱码什么意思,我把客户端语言改为英文了,还是一样的报这个,我用的版本<em>svn</em>-1.4.6-setup.exe|SVNServiceSetup-0.6.0.msi|TortoiseSVN-1.5.2.13595-win32-<em>svn</em>-1.5.1.msi
SVN导入项目转变为Maven项目时pom.xml报错
今天在加用自己的小本本导入项目时,pom.xml文件一直<em>报错</em>,说missing artifact xxxx.jar包。。。。。。。。。各种找答案,什么删除.lastupdate结尾的文件,然后重新Maven-update project……..等等!!!!!最后发现其实是忘了改Maven的Setting.xml文件,公司项目上的Mavne的Setting.xml和自己的Setting.xml不一样!
SVN——提交代码时没冲突,但是报错
SVN已经与资源库同步,并且没有任何冲突,该更新的也更新了,就提交的时候还是会报以下的错误。 在写那个Action的时候,就出现了三个奇怪的文件,比如“.mini”结尾的啊,然后就把那三个删了,就可以提交了。真是个奇怪的问题。 类似、terminalAction的三个文件,应该是本地编译出来的吧。删掉就行了。如果你害怕删错了,你可以先把他们拷出来一份,再进行操作。 解决后...
svn执行clean up命令时报错
<em>svn</em>执行clean up命令时<em>报错</em>“Previous operation has not finished; run ‘cleanup’ if it was interrupted”。无论你到那个父层次的目录执行“clean up “,都是报一样的错。执行cleanup时候,提示要cleanup。看来是进入死循环了。 这个也该算是<em>svn</em>的bug吧。 问题的关键看来需要找到死锁的地方,解锁才行。
svn对比时报错,费解!请教大家了
<em>安装</em>并设置完成,但一比较就报 Working copy not locked; this is probably a bug, please reportrn<em>svn</em>: Directory 'D:\workspace\h960\WebRoot\WEB-INF\classes\.<em>svn</em>' containing working copy admin area is missing ,而且奇异的是还显示结果说没有不一致的
连接SVN时报错:文件夹“”已不存在
1.问题描述 <em>svn</em>地址在eclipse中显示文件夹不存在。     2.测试 把地址粘贴到浏览器地址栏中可以正常访问。         3.解决办法 <em>安装</em>本地<em>svn</em>客户端,下载之前路径中任意一个文件到本地。然后在eclipse中使用<em>svn</em>就可以下载项目了。   ...
Eclipse向SVN提交maven项目时报错
Error while creating module:org.apache.subversion.javahl.ClientException:Authorization <em>failed</em> <em>svn</em>:Authorization <em>failed</em> 一开始,我以为是maven的父类模块和子模块提交出错。后来发现是提交的SVN资源库没有配置匿名用户读写权限!比较明显的是出现这个错误: Error whil
SVN从服务器update时报错
详情   今天在使用SVN从服务器上更新代码的时候,出现了一个错误异常,异常内容如下。   这是因为,由于一些中断操作,或者上传过程中取消,导致本地文件被锁定了,所以不能正常的更新代码。      解决方法:   1.在命令中找到锁定文件路径,使用clean up命令清除锁定,如图。   2.换一个路径,重新下载一份代码。这个比较麻烦,要下载好久。   3.在.<em>svn</em>文件中,找到名...
svn导入maven项目时pom.xml报错
从<em>svn</em>版本库导出项目后,项目右键点击转换成maven项目后,pom.xml文件<em>报错</em>。解决:cmd进入到项目目录下,执行mvn compile,等BUILD SUCCESS以后,eclipse项目右键,maven-&amp;gt;update projecteclipse用subclipse导入<em>svn</em>项目时,没有选择项目类型。 当使用ctrl键点击java方法时,没有反应,原因:不是java项目打开wor...
向VISUAL SVN SERVER上传文件时报错
往VISUAL SVN SERVER上传文件时<em>报错</em>:1、问题一:"Commint bloacked by pre-commit hook(exit code 1)with output:" "Your commit has been blocked because you didn't give any log message" "提交日志不能为空" "如果你想要破除锁定,请使用'检查修改'对话框或
eclipse indigo在线安装svn报错
今天在用eclipse在线<em>安装</em><em>svn</em>插件过程中,用的是这个url: Eclipse update site URL: http://subclipse.tigris.org/update_1.8.x ,碰见了<em>安装</em>不成功的问题,以前从没有遇见过,搜索了很多错误信息,都没能解决,最后用的是这个url:https://dl.bintray.com/subclipse/releases/subclipse...
Eclipse安装其它插件导致SVN报错
最近,由于<em>安装</em>插件导致Eclipse的SVN插件不能使用,出现的问题实在很烦恼,通过试验发现当新<em>安装</em>的插件<em>安装</em>完毕后,只需要把 Eclipse/configuration目录下的org.eclipse.update目录删除即可,并且这个目录在Myeclipse重启之后会重新生成 MyEclipse通用
MyEclipse10.0安装SVN,重新启动后报错...
[img=https://img-bbs.csdn.net/upload/201407/01/1404204812_579720.jpg][/img]rnrn在网上查看了一些资料,很多提示删一些文件,可是每个人删除的文件又不一样,求指教。[img=https://forum.csdn.net/PointForum/ui/scripts/csdn/Plugin/001/face/54.gif][/img]
使用CreateOleObject时报错--'无效的类别字符串'
我在使用函数CreateOleObject(Purchasing.COM)时报如下的错误。在执行该语句之前,我已经用Registerdll注册了该路径下的DLL文件了啊。哪位大侠能帮忙解决下啦,谢谢!rnrn---------------------------rnDebugger Exception Notificationrn---------------------------rnProject Drive.exe raised exception class EOleSysError with message '<em>无效</em>的类别字符串'. Process stopped. Use Step or Run to continue.rn---------------------------rnOK Help rn---------------------------rn
svn安装出现报错问题解决办法
<em>svn</em>的<em>安装</em>问题<em>svn</em> <em>安装</em>常见问题小计1.<em>安装</em>目录路径一般不要有中文,容易导致<em>安装</em>失败。2.<em>安装</em>出现<em>报错</em> ——VisualSVN Server —— Service“Visual Server” <em>failed</em> to start. 出现这个<em>报错</em>,大致意思为“SVN服务端启动失败,请在事件查看器中查看SVN服务端的日志以获得更多细节”。此时VisualSVN Server已经<em>安装</em>在电脑上了,我们点...
ubuntu 下安装 eclipse svn插件报错
ubuntu下的eclipse 总是<em>报错</em>: Failed to load JavaHL Library. These are the errors that were encountered: no lib<em>svn</em>javahl-1 in java.library.path no <em>svn</em>javahl-1 in java.library.path no <em>svn</em>javahl in java.li...
手机号码搜索专家破解版下载
手机号码搜索软件是根据用户输入的关键词列表,通过百度和谷歌引擎快速搜集大量目标城市和行业的公司企业客户手机号码的搜索软件工具。 百度和谷歌中收录了全世界的中文公司企业网页,输入与手机号码相关的字符即可快速检索大量的手机号码,而且这些号码都是活跃的、有效的,具有极高的市场营销价值。 软件通过一次性导入上千万个检索关键词列表,自动搜索和提取手机号码,自动纠正错误的手机号码。 它可以全天候24小时无人值守工作,是一个真正的手机号码搜索机器人,为您通过手机短讯营销方式推销或采购产品助一臂之力。搜索到的号码可以保存为一行一个手机号码的文本文件,或是可以自由导出为Exlce工作表。本软件是服务型企业 相关下载链接:[url=//download.csdn.net/download/shanghaizhuce/2381307?utm_source=bbsseo]//download.csdn.net/download/shanghaizhuce/2381307?utm_source=bbsseo[/url]
杭电选课器下载
杭电选课器 杭电选课器 杭电 相关下载链接:[url=//download.csdn.net/download/caiweiguo111/3982451?utm_source=bbsseo]//download.csdn.net/download/caiweiguo111/3982451?utm_source=bbsseo[/url]
金山快盘123下载
喜欢的金山快盘 相关下载链接:[url=//download.csdn.net/download/oqzuser32456987/4950688?utm_source=bbsseo]//download.csdn.net/download/oqzuser32456987/4950688?utm_source=bbsseo[/url]
我们是很有底线的