VS2017配置PCL1.9.1出现的问题 [问题点数:20分]

Bbs1
本版专家分:0
结帖率 0%
Bbs1
本版专家分:0
windows10 VS2017 下PCL1.9.1配置问题(已解决)
windows10 VS2017 下PCL1.9.1<em>配置</em><em>问题</em>(已解决) 第一次用PCL这个库,碰到许多的<em>问题</em>。把一些<em>问题</em>记录在这里,这样有同样的人遇到也可以解决。 <em>配置</em> 基本的<em>配置</em>我就不说了,大家可以参考下这篇博客。我觉得已经说的很详细了。 尤其是建议大家弄一个属性表,这样之后就不需要在<em>配置</em>了。 <em>问题</em> 在我参照这篇博客<em>配置</em>完成之后遇到了好几个<em>问题</em>。 E2512功能测试宏的参数必须是简单表示符 VS...
win10 vs2017 opencv3.3.1配置完成后出现问题
根据网上教程在vs的工程里<em>配置</em>好了opencv3.3.1,当运行的时候还是报错了 找不到opencv_world331d.dll文件 解决方法: 把opencv\build\x64\vc14\bin目录下的三个dll文件复制到C:\Windows\System32 <em>问题</em>解决
pcl1.9.1源码
PCL(Point Cloud Library)是在吸收了前人点云相关研究基础上建立起来的大型跨平台开源C++编程库,它实现了大量点云相关的通用算法和高效数据结构,涉及到点云获取、滤波、分割、配准、检索、特征提取、识别、追踪、曲面重建、可视化等。
VS2017编译jsoncpp出现问题
include\json\config.h(8): fatal error C1083: 无法打开包括文件: “stddef.h”: No such file or directoryn没找到这个头文件 但是新建项目的时候包含这个头文件是可以的,求知道的人帮一下小弟,谢谢n在网上找到的那些都没有解决。。
关于VS2017配置GLFW的问题
在用CMAKE编译GLFW源文件的时候,可能会报错:ERROR in configuration progress,project files  may be invaild。 这个时候关闭CMAKE,重新启动CMAKE,以管理员身份启动,就可以了,因为在VS2017中编译opengl项目如果没有一管理员身份启动,就会报错找不到环境变量的错误,这个时候重启以管理员身份运行就能编译成功了
VS2017的使用时出现
VS2017社区版是免费的,但是第一次安装时,没有登录,导致只要30天的试用期。 最佳解决方案:此时我们只需要用微软账户登录即可。
使用vs2017出现错误
[img=https://img-bbs.csdn.net/upload/201708/11/1502417231_245634.png][/img]rn电脑用的是win10系统 然后vs是2017版本 不知道怎么解决 用了好几种办法都不行 求帮助
opencv3.2在VS2017中的配置
网上的<em>配置</em>虽然很多了,但是我还是想写下自己的<em>配置</em>。 首先建立空项目:
opencv和vs2017配置
1、在此电脑环境编辑变量新建路径:D:\opencv\build\x64\vc15\bin 2、打开vs项目属性 包含目录、库目录、附加依赖项 并且把opencv_world400.dll改为opencv_world400.lib ...
VS2017永久配置openCV
openCV下载链接https://sourceforge.net/projects/opencvlibrary/files/opencv-win/3.2.0/opencv-3.2.0-vc14.exe/download解压的时候这个不用再新建文件夹直接放在D:\Program Files就好了,然后<em>配置</em>环境变量【控制面板】-&amp;gt;【系统和安全】-&amp;gt;【系统】-&amp;gt;【高级系统设置】,在系...
VS2017下OpenGL库配置
OpenGL库文件可以直接下载也可以自行编译,不管哪种方法都会得到三种文件:.h文件、.dll文件、.lib文件,分别将这三种文件拷贝到相应的目录下即可 .h文件:VS安装目录下的visualstudio\VC\Tools\MSVC\14.13.26128\include\新建文件夹gl拷贝进去;当然也可以不拷贝,直接在VS项目属性中<em>配置</em>相应的“包含路径”。 .dll文件:如果是32位的dll,...
vs2017需要什么配置
什么样的机器跑的动,虽然我现在用2015,不会用2017,还是关注下吧
vs2017 配置cuda 项目
在这里记录一下,我用<em>vs2017</em><em>配置</em>cuda项目过程中的种种<em>问题</em>,具体总结归类可分为如下几个步骤: 一、增加.cu源码拓展类型 打开VS,  依次打开  工具=》选项=》文本编辑器=》文件拓展名,  新增扩展名  .cu   编辑器  Microsoft Visual C++   添加   二、搜索,设置 cuda -&amp;lt;version&amp;gt;的生成模板 右键  点击具体项目, ...
vs2017 配置QT环境
<em>vs2017</em>的安装这里就不讲述,先下载qt QT下载 qt的版本很多,windows目前是将64位和32位编在一起的,下载地址 http://download.qt.io/archive/qt/ 安装也很简单,主要是第二部,要求登录,可以直接 skip,然后再选择第一项中,打开下拉 勾选<em>vs2017</em> 64位(这个根据你的项目和安装的vs版本选择) 安装后,在qt\Tools\QtCr...
VS2017配置Qt5.9教程
前提:电脑已安装VS2017及Qt5.9 步骤: 点击工具–&amp;gt;扩展和更新–&amp;gt;联机–&amp;gt;搜索Qt–&amp;gt;选择Qt Visual studio tools,关闭VS2017后会自动安装,然后再重启。(一定要关闭,否则无法完成安装) 安装完毕打开后,可以在菜单栏看到 Qt VS Tools 的选项,然后点击Qt Options–&amp;gt;Qt Versions–&amp;gt;Add–...
Windows10下配置VS2017环境变量
 我的电脑-&amp;gt;属性-&amp;gt;环境变量-&amp;gt;打开Path,添加:D:\Program Files (x86)\Microsoft Visual Studio\2017\Community\VC\Tools\MSVC\14.10.25017\bin\HostX86\x86 新建Lib变量,添加三个路径:变量名:LIB 变量值:D:\Program Files (x86)\Microsoft ...
VS2017环境下配置winpcap
我的系统:win10 64位;VS2017 安装时请先参考下面的教程,并根据我的提示修改步骤。winpcap教程几个可能<em>出现</em>的<em>问题</em>:中文手册的例程可能有<em>问题</em>,这个是我能运行的程序:(从onenote复制只能是图片,凑合看吧)...
win10下vs2017配置mpi.doc
<em>vs2017</em>+ 微软mpi Win10下<em>配置</em> 有实例代码
dlib vs2017 环境的配置
1.通过官网下载dlib 和 cmake2.解压dlib和cmake的安装3.用cmake编译dlib 4.在-T选项中输入 host=x645.打开工程,生成dlib的工程,分别生成Debug和release的两个版本,生成路径在.\dlib-19.14\build\Debug和.\dlib-19.14\build\Release6.在<em>vs2017</em>中将dlib的文件路径放在包含目录中,同时加入....
OpenGL在VS2017下的配置
方法一:1.然后开始<em>配置</em>opengl 下载库文件:http://www.opengl.org/resources/libraries/glut/glutdlls37beta.zip2.找到目录(VS下载位置)放置<em>配置</em>文件: &amp;lt;1&amp;gt;、Win10系统,所以glut.dll与glut32.dll两个文件放到了C:\WINDOWS\SysWOW64 &amp;lt;2&amp;gt;、GL.H、GLAUX.H...
VS2017下Opengl的配置
    想<em>配置</em>VS下的Opengl,看了不少blog,发现都不能解决找不到“glut32.lib”的<em>问题</em>,后来新建项目,在项目属性里找到了其他库文件,用Everything搜一下发现原来库文件都藏在了Windows Kits目录下,经过多番周折,总算装上了glut32.lib。     缺少&quot;glut32.lib&quot;的解决方法是第一步:一,将“glut32.lib”文件复制到“C:\Program ...
VS2017下编译和配置boost库
VS2017下编译和<em>配置</em>boost库 第一步: 到官网http://www.boost.org/下载boost库,最好下载1.6x最新版 第二步:解压。 可解压到固定的目录,我是解压到E:\mylib\boost 第三步:环境<em>配置</em> VS2017更加注重跨平台性,安装文件较多,VC有三个版本,分别是arm、Hostx64、Hostx86,本文使用Hostx64。 注意,
MPIR VS2017配置及使用
MPIR VS2017<em>配置</em>及使用MPIR VS2017<em>配置</em>及使用所需YASM相关(64位)yasm readmeBuilding MPIR其他汇编程序优化版本测试Visual Studio的MPIR版本 MPIR VS2017<em>配置</em>及使用 因为要使用大数运算,自己在GitHub上找到star最多的c++版本BigNumber用string实现,但是在实际使用过程中,发现其运算能力有限,主要是乘法和除...
Qt5.11.1安装与VS2017配置
Qt5.11.1安装与VS2017<em>配置</em> @toc 注:这里以Qt5.11.1,VS2017 ,Windows10作为演示设备 一、Qt下载安装 (一)软件下载 1.Qt下载网址点这里 2.选择对应的版本下载即可: 3.下载完成后的安装包如下图: (二)安装 1.双击安装包:等待片刻之后点击 next 2.这里需要登录,如果没有账号在下面sign up中注册一...
vs2017配置openGL的解决方案
这两天刚尝试使用openGL将球体网格化。<em>vs2017</em><em>配置</em>openGL的解决方案如下: 跑的是这个链接https://blog.csdn.net/xdg_blog/article/details/52864872的代码,下面需要的库文件也是针对这个代码的,需要其他库添加的方法也一样。   1. 在官网下载glut,官网连接:https://www.opengl.org/resources/l...
vs2017配置OpenCV教程
     最近由于将电脑的vs10版本升级到vs17版,于是需要重新<em>配置</em>OpenCV库,故在这里做个记录吧。 一、安装vs新版本      这个时候就看你自己的需求咯。不同版本的vs对c++11标准支持程度和一些新功能都是不一样的,大家可以去微软官网下载,也可以去网上找下破解版的,这里我就只提供一下vs10、vs15的云盘链接吧:https://pan.baidu.com/s/1mjrMfon...
openGL在VS2017环境下的配置
下载openGL,网址https://www.opengl.org/resources/libraries/glut/  解压之后如下:   找到目录..\VC\Tools\MSVC\14.10.25017\include\gl(没有的话就建立一个)。 将glut.h放到里面。 找到目录..\VC\Tools\MSVC\14.10.25017\lib\x86  将glut.lib,...
VS2017配置EGE图形库
在网上查了一波资料,发现都是VS2013或者VS2015的EGE<em>配置</em>教程,本文在自己踩坑无数后,终于是<em>配置</em>成功了 首先到:EGE下载地址 把云盘里的内容全部下载,然后把EGE_for_Visual_Studio_2017.zip解压出来 找到VS的安装目录,默认在C:\Program Files (x86)\Microsoft Visual Studio\2017\Commu
VS2017项目移植到其他电脑出现问题
将OpenCV中的项目从本子上移到台式机上<em>出现</em>的<em>问题</em><em>问题</em>1、&quot;xxxx.vcxproj”<em>配置</em>“Debug|x64”的 Designtime 生成失败。IntelliSense 可能不可用.设置环境变量 TRACEDESIGNTIME = true 并重启 Visual Studio 以进行调查。解决方法:参考博客,在工具-选项-文本编辑器-c\c++-高级-禁用IntelliSense属性设置为t...
VS2017编译gdal-2.2.4库出现问题
情况一: 在<em>vs2017</em>终端安装gdal库<em>出现</em>了找不到或者无法打开包括文件”stdio.h”,”string.h”,”stdlib.h”这种类似VS2017系统自带的头文件时。我们应该去! 这几个文件中看有没有这样两个文件夹,没有的话创建之后再copy一份过去就可以了。这是针对VS2017版本。 情况二: 若是在<em>vs2017</em>桌面中没有找到上面的文件,首先去看一下工程属性中这个有没有:...
vs2017中关于sort()函数出现问题
<em>vs2017</em>中关于sort()函数<em>出现</em>的<em>问题</em> 1.显示sort为未定义标识符 解决方案:检查是否漏写头文件: 检查是否漏写 using namespace std; 2.sort参数<em>问题</em> 共有三个参数,第一个是要排序数据的首地址,第二个是要排序数据的尾地址,第三个是排序函数指针,即自己定义的给数据排序的函数的名字。 ...
关于VS2017下的linux C++开发配置问题
开发环境Win7上安装VS2017,虚拟机安装centos,已经安装好环境,也可以启动远程编译,但是总会报出找不到lib64目录下的库,这个一直没有搞清是要拷贝linux文件到win目录还是直接<em>配置</em>VS就可以链接的到,高人指导。rnrn输出信息如下:rn=thread-group-added,id="i1"rnGNU gdb (GDB) 7.9rnCopyright (C) 2015 Free Software Foundation, Inc.rnLicense GPLv3+: GNU GPL version 3 or later rnThis is free software: you are free to change and redistribute it.rnThere is NO WARRANTY, to the extent permitted by law. Type "show copying"rnand "show warranty" for details.rnThis GDB was configured as "--host=i686-pc-mingw32 --target=x86_64-linux-gnu".rnType "show configuration" for configuration details.rnFor bug reporting instructions, please see:rn.rnFind the GDB manual and other documentation resources online at:rn.rnFor help, type "help".rnType "apropos word" to search for commands related to "word".rn=cmd-param-changed,param="pagination",value="off"rnLoaded 'shared libraries loaded at this time.'. Cannot find or open the symbol file.rnStopped due to shared library event:rn Inferior loaded /lib64/libstdc++.so.6rn /lib64/libm.so.6rn /lib64/libgcc_s.so.1rn /lib64/libc.so.6rn /lib64/ld-linux-x86-64.so.2rnLoaded '/lib64/libstdc++.so.6'. Cannot find or open the symbol file.rnLoaded '/lib64/libm.so.6'. Cannot find or open the symbol file.rnLoaded '/lib64/libgcc_s.so.1'. Cannot find or open the symbol file.rnLoaded '/lib64/libc.so.6'. Cannot find or open the symbol file.rnLoaded '/lib64/ld-linux-x86-64.so.2'. Cannot find or open the symbol file.
vs2017配置opencv3.30遇到的问题
我是刚开始接触opencv的新人,把vs和opencv3.30下载好之后就开始上网找<em>配置</em>方法,很多帖子都教我新建一个win32控制台文件(c++)然后<em>配置</em>环境变量(添加新变量opencv或者编辑进path路径都试过),在工程文件的属性管理器下的x64环境下(特别注意了)增加opencv—Debug的属性库,然后把include,lib,链接器的dll文件<em>配置</em>都反复倒腾好几遍了,但是每次运行测试程序时总是报错,一直是同一个:0x00007FFCAFFC3C58 处(位于 opencv测试.exe 中)有未经处理的异常: Microsoft C++ 异常: cv::Exception,位于内存位置 0x000000FC3B6FF510 处。 (未加载kernlbase。pdb)上网也只找到一些解决方案不是<em>配置</em>环境变量就是<em>配置</em>不对,我很头疼,希望有大神能给我点建议。
vs2017和qt5.8出现编译不通过
使用<em>vs2017</em>时候测试时候,发现编译不通过 https://bbs.csdn.net/topics/392143513 官网下载qalgorithms.h直接替换即可
vs2017调试出现“服务器拒绝了连接”
情况描述:同解决方案下两个项目一个可以正常调试,另一个“服务器拒绝了连接”<em>问题</em> 解决方案:在项目名称处右击--属性--web--修改:项目url(j)  和     覆盖应用程序根URL(U)的      地址输入框中    的端口号 注       意:不要使用已占用的端口号      ...
解决vs2017调试出现脚本错误
新装的最新版本<em>vs2017</em> ,调试时或者运行时<em>出现</em>以下错误: 点击“是”,可以继续运行,但后续发现有可能会导致程序崩溃的情况<em>出现</em>,解决崩溃的办法很简单,不直接点击运行,而选择开始执行(不调试)即可,这样既然<em>出现</em>脚本错误,后续的操作中也不会导致程序崩溃的情况了。这不是彻底解决<em>问题</em>原因。 <em>vs2017</em>需要搭配Internet Explorer11 或者更高版本,才是实现VS2017...
VS2017编程出现错误问题汇总
1,ObReferenceObjectByName等导出函数无法解析! 这种函数直接导出用,前面加上extern "C". 2,#include文件&lt;ntifs.h&gt;,&lt;ntddk.h&gt;<em>出现</em>重定义,将&lt;ntifs.h&gt;放在前面,其他的放在后面,每个文件都要注意改! 3,warning LNK4098: 默认库“MSVCRT”与其他库的使用冲突; 解决方法...
在VS2017上配置Opencv342(完整配置过程)
因为一些实验的原因,借鉴了一些晚上的<em>配置</em>方法,跌跌撞撞中终于完成 了这个<em>配置</em>。一路过来不容易,所以想写点东西下来,希望对大家有一些些帮助吧。 首先需要下载opencv342,这个如果 ...
vs2017配置opencv3.4.1实验报告(简单配置
本博客对应<em>vs2017</em>版本以及opencv3.4.1版本,其他版本请进行相应更改。 1.<em>配置</em>windows环境: 选择左侧高级系统设置→高级→环境变量→系统变量→path(双击)→添加opencv目录下的bin文件夹: (vc15对应<em>vs2017</em>版本,x64对应64位操作系统,根据实际情况选择路径,以下相同) E:\opencv\opencv\build\x64\vc15\bin 2.打开...
vs2017环境下配置ffmpeg出错
1、下载dev,shared两个版本即可(注意自己电脑的位数32bit or 64bit) 2、在VS2017中创建一个win32控制台程序,然后将dev中include和lib 以及shared中的bin文件夹下的.dll文件复制到项目目录【在c或cpp文件目录】中。 3.<em>配置</em>头文件和依赖库路径 右键项目-属性-<em>配置</em>属性-C/C++-常规-附加包含目录:添加include文件夹路径,即包含头...
VS2017配置opencv4.0.1及其扩展模块
视频教程: OPEN_CV4.0.0+WIN10+VS2017+OPENCV_CONTRIBU 这个视频里给的是Opencv4.0.0,但是同样适用于Opencv4.0.1. Setup Visual Studio 2017 (C++) for OpenCV 4, Deep Learning, Computer Vision(这个是Youtube上的教程,需要翻墙) 我主要是参考这两个视频进行的配...
Eigen库在VS2017下的配置与使用
参考: Eigen 的简介和下载安装 https://www.cnblogs.com/goingupeveryday/p/5699053.html C++矩阵处理工具——Eigen https://blog.csdn.net/abcjennifer/article/details/7781936 C++开源矩阵计算工具——Eigen 在VS2005中的下载、<em>配置</em>与使用 ...
opencv3.4.4在VS2017中的配置实现
新建空项目,建立main.cpp 视图-&amp;gt;其他窗口-&amp;gt;属性管理器-&amp;gt;Debug|x64-&amp;gt;Microsoft.Cpp.x64.user Microsoft.Cpp.x64.user属性页面: 1、VC++目录&amp;gt;包含目录:add D:\gf_app\opencv3.4.4\opencv\build\include\opencv2 D:\gf_app\opencv...
VS2017中配置QT5.12开发环境
VS2017中<em>配置</em>QT5.12开发环境一.安装VS2017二.安装QT5.12.01.下载2.安装合理的创建标题,有助于目录的生成如何改变文本的样式插入链接与图片如何插入一段漂亮的代码片生成一个适合你的列表创建一个表格设定内容居中、居左、居右SmartyPants创建一个自定义列表如何创建一个注脚注释也是必不可少的KaTeX数学公式新的甘特图功能,丰富你的文章UML 图表FLowchart流程图导...
easyRTMP在vs2017上的配置过程
由于我们搞无人机最后展示要实现一个直播功能,所以就研究了下easyRTMP,坑真的多,先上个github地址https://github.com/EasyDSS/EasyRTMP 1.<em>配置</em>easyRTMPHIK 直接运行会报错: 然后要在HCNetSDK.h和PlayM4.h两个文件里改这个 #if defined( _WINDLL) #define PLAYM4_API ext...
vs2017配置作业环境【opengl+opencv】
参考博客: http://blog.csdn.net/songqiu65/article/details/68067715?locationNum=15&amp;amp;fps=1 作者:songqiu65 http://blog.csdn.net/qq_19003345/article/details/76098781 作者:葡萄君 为了做图形学大作业总结的一个<em>配置</em>,,大神略过 1....
如何用vs2017配置freetype?
想使用opencv和freetype在图片上加中文,但是下载的是2017版的visual studio,没办法打开freetype的项目,求问各位大佬怎么解决?
VS2017在win8下配置PCL1.8.1属性页
下载后,可直接在vs属性管理器页面 添加现有属性页使用
code block 配置vs2017编译器
安装vs2010编译器,无奈不支持C+11rntdm编译器下载过程慢的要死,rn而且编译出的exe文件莫名其妙的体积大许多,启动的时候还慢,好像是加壳运行的rn所以想用支持C++11标准的<em>vs2017</em>编译器rn从2017安装目录直接复制过来就可以了吗,rn跟<em>配置</em>vs2010一样吗?rnrn还有一个<em>问题</em>,<em>配置</em>tdm后,切换回2010,莫名其妙的不能debugger了,以前明明是可以的,,,rnrnrnrnrnrnrnrn
《OpenGL编程指南》第九版——VS2017配置
参考: https://blog.csdn.net/guyuealian/article/details/85262650 1.在官网下载书中例子的源码 http://www.opengl-redbook.com/ 2.下载CMake https://cmake.org/download/ 在下载的例子中的README中可以看到,作者建议我们使用CMake...
VS2017中配置opencv3.1的步骤
1.创建一个空项目。文件-&amp;gt;新建-&amp;gt;项目 2.开始<em>配置</em>opencv。对Debug&amp;amp;x64进行<em>配置</em>。 打开解决方案资源管理器,右击<em>配置</em>的项目名称,进入属性。 <em>配置</em>的对象为包含目录、库目录、附加依赖项 3.<em>配置</em>包含目录。<em>配置</em>属性-&amp;gt;VC++目录-&amp;gt;包含目录 4.<em>配置</em>库目录。<em>配置</em>属性-&amp;gt;VC++目录-&amp;gt;库目录 5.<em>配置</em>附加依赖项。链接器-&amp;gt;输入-...
vs2017中如何配置opengl
花了一个多小时把老师留的作业<em>配置</em>好了,有以下心得 1 头文件 glut.h gl.h ... 统一放到 D:\应用-编程\<em>vs2017</em>\VC\Tools\MSVC\14.10.25017\include 2 dll文件 由于是64位系统,故放到了C:\Windows\SysWOW64下 3 lib文件,即库文件;    1)由于库文件本身就会分32位和64位故下载时一定区分,而现在容易找到
vs2017配置opengl所用的文件
里面所含了glut.dll glut.h glut.lib glut32.dll glut32.lib文件
VS2017使用OpenCV2.4.1配置说明
需同时安装OpenCV2.4.1及VS2017所支持的最低OpenCV版本(本说明采用的是OpenCV3.4.1)。 将OpenCV2.4.1“D:\openCV2.4\opencv\build\x86\vc12\bin”目录下的文件拷贝到OpenCV3.4.1安装目录“D:\opencv\build\x64\vc15\bin”下。 将OpenCV2.4.1“D:\openCV2.4\openc...
VS2017配置PCL1.9(win10环境)
由于实验需要用到点云数据,正好网上搜PCL点云库的时候看到PCL1.9出来了,就索性跟随时代的步伐直接在VS2017上安装PCL1.9试一下。
VS2017配置opencv3.4.0教程(详细)
1、下载opencv3.4.0https://www.opencv.org/releases.html 2、下载VS2017https://visualstudio.microsoft.com/zh-hans/downloads/ 4、打开我的电脑 -&amp;gt; 右击属性 -&amp;gt; 高级系统设置 -&amp;gt; 环境变量 -&amp;gt; 找到Path编辑 添加 VS2017对应VC版本为VC15...
opencv的安装及vs2017环境的配置
最近毕设开始了,我做的方面主要是图像处理方向,于是单独来记关于opencv的学习笔记。
VS2017完成配置OpenCV3.2.0心得
对于此次环境的搭建我只能说,眼睛好疼啊。那么,经过反反复复一次又一次的<em>配置</em>,我是怎么完成的呢?首先,下载安装Visual Studio2017:https://www.visualstudio.com/zh-hans/downloads/OpenCV呢,因为在官网上下载老是断掉,所以:https://blog.csdn.net/yanzi1225627/article/details/476680...
初学者VS2017配置OpenGl的解决方案
最近刚刚接触OpenGL,但因为无法容忍VC++6.0过于简陋的界面和过时的功能,因此使用了个人版的VS2017.。下面是我从各种各样的错误中摸索出来的解决方案,不一定是最正确的,但也是较网上其他各解决方案中最有效的。         一.OpenGL文件在电脑中的<em>配置</em>                      1.因为我使用的是Win10系统,所以glut.dll与glut32.dll两个文
vid2vid配置出现问题
PyTorch 0.4.0 /lib/include/TH/THMath.h:134:3: error: ‘for’ loop initial declarations are only allowed in C99 mode export CXXFLAGS=&quot;-std=c++11&quot; export CFLAGS=&quot;-std=c99&quot; /lib/include/THC/THCGeneral....
配置opengl出现问题
<em>配置</em>opengl<em>出现</em>的<em>问题</em>: glut32.lib引用不到 环境:vs2013 原因&amp;amp;解决办法:只需要在VC++目录-&amp;gt;库目录里面定义外接lib的文件夹地址就可以了,如果再在C/C++目录-&amp;gt;附加包含目录里面再添加一遍VS反倒会报错。 结论:VS在属性<em>配置</em>上真心不好用…emmmmm ...
jira配置出现问题
这个<em>问题</em>要怎么解决,连接服务器显示网址不存在rn2014-07-30 14:54:12,526 localhost-startStop-1 WARN [atlassian.jira.startup.ChecklistLauncher] Setting an unset default variable "plugin.webresource.batching.off" to: falsern2014-07-30 14:54:12,527 localhost-startStop-1 INFO [atlassian.jira.startup.JiraStartupLogger] Running JIRA startup checks.rn2014-07-30 14:54:12,527 localhost-startStop-1 FATAL [atlassian.jira.startup.JiraStartupLogger] Startup check failed. JIRA will be locked.rn七月 30, 2014 2:54:12 下午 org.apache.catalina.util.SessionIdGenerator createSecureRandomrnINFO: Creation of SecureRandom instance for session ID generation using [SHA1PRNG] took [178] milliseconds.rn七月 30, 2014 2:54:12 下午 org.apache.catalina.core.StandardContext startInternalrnSEVERE: Error filterStartrn七月 30, 2014 2:54:12 下午 org.apache.catalina.core.StandardContext startInternalrnSEVERE: Context [] startup failed due to previous errorsrn2014-07-30 14:54:12,835 localhost-startStop-1 INFO [atlassian.jira.startup.DefaultJiraLauncher] Stopping launchersrn七月 30, 2014 2:54:12 下午 org.apache.coyote.AbstractProtocol startrnINFO: Starting ProtocolHandler ["http-bio-8080"]rn七月 30, 2014 2:54:12 下午 org.apache.catalina.startup.Catalina startrnINFO: Server startup in 7360 msrn七月 30, 2014 2:56:07 下午 org.apache.coyote.AbstractProtocol pausernINFO: Pausing ProtocolHandler ["http-bio-8080"]rn七月 30, 2014 2:56:07 下午 org.apache.catalina.core.StandardService stopInternalrnINFO: Stopping service Catalinarn七月 30, 2014 2:56:07 下午 org.apache.coyote.AbstractProtocol stoprnINFO: Stopping ProtocolHandler ["http-bio-8080"]rn七月 30, 2014 2:56:08 下午 org.apache.coyote.AbstractProtocol destroyrnINFO: Destroying ProtocolHandler ["http-bio-8080"]rn七月 30, 2014 2:56:47 下午 org.apache.catalina.core.AprLifecycleListener initrnINFO: The APR based Apache Tomcat Native library which allows optimal performance in production environments was not found on the java.library.path: /usr/java/packages/lib/amd64:/usr/lib64:/lib64:/lib:/usr/librn七月 30, 2014 2:56:47 下午 org.apache.tomcat.util.digester.Digester endElementrnWARNING: No rules found matching 'Server/Service/Engine/Host/Context/parameter'.rn七月 30, 2014 2:56:47 下午 org.apache.coyote.AbstractProtocol initrnINFO: Initializing ProtocolHandler ["http-bio-8080"]rn七月 30, 2014 2:56:47 下午 org.apache.catalina.startup.Catalina loadrnINFO: Initialization processed in 367 msrn七月 30, 2014 2:56:47 下午 org.apache.catalina.core.StandardService startInternalrnINFO: Starting service Catalina
clion配置出现问题
刚装上新建一个项目就报错了,报错如下,第一次用clion啊,求帮帮忙,谢谢了.rnrn对了环境是fedora,cmake是clion自带的,gdb也是clion自带的.以前我可以用g++和gcc的.rnrnError:ERROR /home/xxxhome/Soft/clion/clion-1.0.3/bin/cmake/share/cmake-3.2/Modules/CMakeTestCXXCompiler.cmake:54: The C++ compiler "/usr/bin/g++" is not able to compile a simple test program.rnIt fails with the following output:rn Change Dir: /home/xxxhome/.clion10/system/cmake/generated/11ecfa14/11ecfa14/__default__/CMakeFiles/CMakeTmprnRun Build Command:"/usr/bin/gmake" "cmTryCompileExec577085962/fast"rn/usr/bin/gmake -f CMakeFiles/cmTryCompileExec577085962.dir/build.make CMakeFiles/cmTryCompileExec577085962.dir/buildrngmake[1]: Entering directory '/home/xxxhome/.clion10/system/cmake/generated/11ecfa14/11ecfa14/__default__/CMakeFiles/CMakeTmp'rn/home/xxxhome/Soft/clion/clion-1.0.3/bin/cmake/bin/cmake -E cmake_progress_report /home/xxxhome/.clion10/system/cmake/generated/11ecfa14/11ecfa14/__default__/CMakeFiles/CMakeTmp/CMakeFiles 1rnBuilding CXX object CMakeFiles/cmTryCompileExec577085962.dir/testCXXCompiler.cxx.orn/usr/bin/g++ -o CMakeFiles/cmTryCompileExec577085962.dir/testCXXCompiler.cxx.o -c /home/xxxhome/.clion10/system/cmake/generated/11ecfa14/11ecfa14/__default__/CMakeFiles/CMakeTmp/testCXXCompiler.cxxrnLinking CXX executable cmTryCompileExec577085962rn/home/xxxhome/Soft/clion/clion-1.0.3/bin/cmake/bin/cmake -E cmake_link_script CMakeFiles/cmTryCompileExec577085962.dir/link.txt --verbose=1rn/usr/bin/g++ CMakeFiles/cmTryCompileExec577085962.dir/testCXXCompiler.cxx.o -o cmTryCompileExec577085962 -rdynamicrn/usr/bin/ld: cannot find -lstdc++rncollect2: error: ld returned 1 exit statusrnCMakeFiles/cmTryCompileExec577085962.dir/build.make:88: recipe for target 'cmTryCompileExec577085962' failedrngmake[1]: Leaving directory '/home/xxxhome/.clion10/system/cmake/generated/11ecfa14/11ecfa14/__default__/CMakeFiles/CMakeTmp'rnMakefile:117: recipe for target 'cmTryCompileExec577085962/fast' failedrngmake[1]: *** [cmTryCompileExec577085962] Error 1rngmake: *** [cmTryCompileExec577085962/fast] Error 2rnCMake will not be able to correctly generate this project.
配置jb8+weblogic7+oracle出现问题.
1.在置连接池和<em>配置</em>数据源中,择Targets->Server页: rn将myserver(服务器名称)移至右侧的列表中,单击Apply时皆<em>出现</em>下面错误,不知什么原因?怎么解决?rnException rnjava.lang.NullPointerExceptionrn at weblogic.management.console.utils.MBeans.getMBeanClassNameFor(MBeans.java:1153)rn at weblogic.management.console.actions.mbean.EditMBeanAction.getMBeanClass(EditMBeanAction.java:210)rn at weblogic.management.console.actions.mbean.EditMBeanAction.getDialogTypeKey(EditMBeanAction.java:188)rn at weblogic.management.console.actions.internal.InternalActionContext.setAction(InternalActionContext.java:158)rn at weblogic.management.console.actions.internal.ActionServlet.doAction(ActionServlet.java:170)rn at weblogic.management.console.actions.internal.ActionServlet.doPost(ActionServlet.java:85)rn at javax.servlet.http.HttpServlet.service(HttpServlet.java:760)rn at javax.servlet.http.HttpServlet.service(HttpServlet.java:853)rn at weblogic.servlet.internal.ServletStubImpl$ServletInvocationAction.run(ServletStubImpl.java:945)rn at weblogic.servlet.internal.ServletStubImpl.invokeServlet(ServletStubImpl.java:332)rn at weblogic.servlet.internal.ServletStubImpl.invokeServlet(ServletStubImpl.java:242)rn at weblogic.servlet.internal.WebAppServletContext$ServletInvocationAction.run(WebAppServletContext.java:5363)rn at weblogic.security.service.SecurityServiceManager.runAs(SecurityServiceManager.java:721)rn at weblogic.servlet.internal.WebAppServletContext.invokeServlet(WebAppServletContext.java:3043)rn at weblogic.servlet.internal.ServletRequestImpl.execute(ServletRequestImpl.java:2466)rn at weblogic.kernel.ExecuteThread.execute(ExecuteThread.java:152)rn at weblogic.kernel.ExecuteThread.run(ExecuteThread.java:133)rn--------------- nested within: ------------------rnweblogic.utils.NestedRuntimeException - with nested exception:rn[java.lang.NullPointerException]rn at weblogic.management.console.utils.MBeans.getMBeanClassNameFor(MBeans.java:1156)rn at weblogic.management.console.actions.mbean.EditMBeanAction.getMBeanClass(EditMBeanAction.java:210)rn at weblogic.management.console.actions.mbean.EditMBeanAction.getDialogTypeKey(EditMBeanAction.java:188)rn at weblogic.management.console.actions.internal.InternalActionContext.setAction(InternalActionContext.java:158)rn at weblogic.management.console.actions.internal.ActionServlet.doAction(ActionServlet.java:170)rn at weblogic.management.console.actions.internal.ActionServlet.doPost(ActionServlet.java:85)rn at javax.servlet.http.HttpServlet.service(HttpServlet.java:760)rn at javax.servlet.http.HttpServlet.service(HttpServlet.java:853)rn at weblogic.servlet.internal.ServletStubImpl$ServletInvocationAction.run(ServletStubImpl.java:945)rn at weblogic.servlet.internal.ServletStubImpl.invokeServlet(ServletStubImpl.java:332)rn at weblogic.servlet.internal.ServletStubImpl.invokeServlet(ServletStubImpl.java:242)rn at weblogic.servlet.internal.WebAppServletContext$ServletInvocationAction.run(WebAppServletContext.java:5363)rn at weblogic.security.service.SecurityServiceManager.runAs(SecurityServiceManager.java:721)rn at weblogic.servlet.internal.WebAppServletContext.invokeServlet(WebAppServletContext.java:3043)rn at weblogic.servlet.internal.ServletRequestImpl.execute(ServletRequestImpl.java:2466)rn at weblogic.kernel.ExecuteThread.execute(ExecuteThread.java:152)rn at weblogic.kernel.ExecuteThread.run(ExecuteThread.java:133)rn--------------- nested within: ------------------rnweblogic.management.console.actions.ActionException - with nested exception:rn[weblogic.utils.NestedRuntimeException - with nested exception:rn[java.lang.NullPointerException]]rn at weblogic.management.console.actions.ErrorAction.(ErrorAction.java:38)rn at weblogic.management.console.actions.internal.ActionServlet.doAction(ActionServlet.java:190)rn at weblogic.management.console.actions.internal.ActionServlet.doPost(ActionServlet.java:85)rn at javax.servlet.http.HttpServlet.service(HttpServlet.java:760)rn at javax.servlet.http.HttpServlet.service(HttpServlet.java:853)rn at weblogic.servlet.internal.ServletStubImpl$ServletInvocationAction.run(ServletStubImpl.java:945)rn at weblogic.servlet.internal.ServletStubImpl.invokeServlet(ServletStubImpl.java:332)rn at weblogic.servlet.internal.ServletStubImpl.invokeServlet(ServletStubImpl.java:242)rn at weblogic.servlet.internal.WebAppServletContext$ServletInvocationAction.run(WebAppServletContext.java:5363)rn at weblogic.security.service.SecurityServiceManager.runAs(SecurityServiceManager.java:721)rn at weblogic.servlet.internal.WebAppServletContext.invokeServlet(WebAppServletContext.java:3043)rn at weblogic.servlet.internal.ServletRequestImpl.execute(ServletRequestImpl.java:2466)rn at weblogic.kernel.ExecuteThread.execute(ExecuteThread.java:152)rn at weblogic.kernel.ExecuteThread.run(ExecuteThread.java:133)rnrn rnCurrent DaternMon Apr 07 14:34:14 CST 2003rnrnConsole Release BuildrnnullrnrnConsole BuildrnnullrnrnServer Release Buildrn7.0.0.0rnrnServer BuildrnWebLogic Server 7.0 Thu Apr 25 17:16:22 PDT 2002 180709 rnrnAll Server Product VersionsrnWebLogic Server 7.0 Thu Apr 25 17:16:22 PDT 2002 180709 rnWebLogic XMLX Module 7.0 Thu Apr 25 17:26:07 PDT 2002 180709 rnrn
配置appserv出现问题
安装完了以后,进入http://localhost还没<em>问题</em>,rn然后点击 [color=#FF0000]phpMyAdmin Database Manager Version 2.10.3[/color]就会<em>出现</em>需要输入用户名、密码的对话框,叫连接到127.0.0.1rn内容是rn[color=#FF0000]rn位于 0 的服务器 127.0.0.1 要求用户名和密码。rnrn警告: 此服务器要求以不安全的方式发送您的用户名和密码(没有安全连接的基本认证)。[/color]rnrn输入root不行,administration不行,其他的可以,但是进去后在“[color=#FF0000]创建一个新的数据库: [/color]”下面一行是rn“[color=#FF0000]无权限[/color]” 所以书上讲的后面的权限设置就都弄不了了rnrn这是怎么回事呢rnrn帮帮忙吧~~谢谢大家了rn
配置OpenCV出现问题
主要解决在<em>配置</em>OpenCV时遇到<em>问题</em>的解决办法,删除<em>配置</em>的变量。
配置单点登录出现问题
1.[color=red]org.apache.catalina.util.DefaultAnnotationProcessor cannot be cast to org.apache.AnnotationProcessor[/color] 解决办法: 1.修改了tomcat里的context.xml文件,在context 元素下添加 2.[color=...
配置maven出现问题
当在你电脑上<em>配置</em>maven的环境变量时<em>出现</em>了这个: Error: JAVA_HOME not found in your Please set the JAVA_HOME variable ilocation of your Java installation. 他的意思是说:                            错误:JAVA_HOME没有找到你        
SSH2配置出现问题
[color=#800080]action:[/color]rnpublic class DefaultAction extends ActionSupport rn /*rn * Generated Methodsrn */rn private static final long serialVersionUID = 1L;rn private Mainmoduledao mainmoduledao;rn private SubModuledao submoduledao;rn private java.util.List mainModules;rn private java.util.List subModules;rn private String currentDate;rn rn /** rn * Method executern * @param mappingrn * @param formrn * @param requestrn * @param responsern * @return ActionForwardrn */rn public String execute() rn System.out.println("iidddddddddddddddddaaaaaaaaaaaaaaaaaaa");rn [color=#FF0000]mainModules= mainmoduledao.findAll();[/color]rn Submodule subModule=new Submodule();rn subModule.setIsxianshi("2");rn subModules= submoduledao.findAll(subModule);rn currentDate=new SimpleDateFormat("yyyy年MM月dd日").format(new Date());rn return SUCCESS;rn rn rn public Mainmoduledao getMainmoduledao() rn return mainmoduledao;rn rnrn public void setMainmoduledao(Mainmoduledao mainmoduledao) rn this.mainmoduledao = mainmoduledao;rn rnrn public SubModuledao getSubmoduledao() rn return submoduledao;rn rnrn public void setSubmoduledao(SubModuledao submoduledao) rn this.submoduledao = submoduledao;rn rnrn public java.util.List getMainModules() rn return mainModules;rn rn public void setMainModules(java.util.List mainModules) rn this.mainModules = mainModules;rn rn public java.util.List getSubModules() rn return subModules;rn rn public void setSubModules(java.util.List subModules) rn this.subModules = subModules;rn rn rn public String getCurrentDate() rn return currentDate;rn rn public void setCurrentDate(String currentDate) rn this.currentDate = currentDate;rn rnrn[color=#800080]dao:[/color]rnpublic List findAll()rn System.out.println("iiiiiiiiiiiiidddddddddddddddddd");rn List list = new ArrayList();rn Session session = this.getHibernateTemplate().getSessionFactory().openSession();rn rn try rn String hql = "from Mainmodule as a order by a.ordertge";rn list = session.createQuery(hql).list();rn rn catch (HibernateException e) rn // TODO Auto-generated catch blockrn e.printStackTrace();rn rn return list;rn rn[color=#800080]web.xml:[/color]rnrnrn Fileupload rn rn Set Character Encodingrn rn com.common.filters.SetCharacterEncodingFilterrn rn rn encodingrn BIG5rn rn rn rn Set Character Encodingrn /*rn rn rn 180rn rn rn struts-cleanup rn rn org.apache.struts2.dispatcher.ActionContextCleanUprn rn rn rn struts2rn org.apache.struts2.dispatcher.FilterDispatcherrn rn rn struts-cleanup rn /* rn rn rn struts2rn /*rn rn rn rn contextConfigLocationrn classpath:*applicationContext.xml rn rn rn org.springframework.web.context.ContextLoaderListenerrn rn rn rn Defaultfirst.htmlrn rnrn[color=#800080]applicationContext.xml:[/color]rnrnrnrn rn rn rn rn rn rn $hibernate.dialectrn rn $hibernate.show_sqlrn true 1, false 0rn truern org.hibernate.cache.EhCacheProviderrn rn rn rnrnrn rn rn rn rn rn rn rn rn rn rn rn true rn rn rn PROPAGATION_REQUIREDrn PROPAGATION_REQUIREDrn PROPAGATION_REQUIREDrn PROPAGATION_REQUIRED,readOnlyrn rn rn rnrn rn rn rn rn rn rn rn rn rn rn rn rn rn rn rn rn rn rn rn rn rn rn rn rn rn為啥在紅色部分他就是不進去dao方法里面去,項目也不會報錯.....
windows+Apache+php配置出现问题
[img=https://img-bbs.csdn.net/upload/201505/29/1432893888_218655.jpg][/img]rn请看,求解答。rn系统:windows7专业版 64位rnPHP与Apache都是目前最新版本。
配置连接池出现问题
<em>配置</em>连接池<em>出现</em>的<em>问题</em>:rnrnjava.lang.NullPointerExceptionrn at weblogic.management.console.utils.MBeans.getMBeanClassNameFor(MBeans.java:1153)rn at weblogic.management.console.actions.mbean.EditMBeanAction.getMBeanClass(EditMBeanAction.java:210)rn at weblogic.management.console.actions.mbean.EditMBeanAction.getDialogTypeKey(EditMBeanAction.java:188)rn at weblogic.management.console.actions.internal.InternalActionContext.setAction(InternalActionContext.java:158)rn at weblogic.management.console.actions.internal.ActionServlet.doAction(ActionServlet.java:170)rn at weblogic.management.console.actions.internal.ActionServlet.doPost(ActionServlet.java:85)rn at javax.servlet.http.HttpServlet.service(HttpServlet.java:760)rn at javax.servlet.http.HttpServlet.service(HttpServlet.java:853)rn at weblogic.servlet.internal.ServletStubImpl$ServletInvocationAction.run(ServletStubImpl.java:945)rn at weblogic.servlet.internal.ServletStubImpl.invokeServlet(ServletStubImpl.java:332)rn at weblogic.servlet.internal.ServletStubImpl.invokeServlet(ServletStubImpl.java:242)rn at weblogic.servlet.internal.WebAppServletContext$ServletInvocationAction.run(WebAppServletContext.java:5363)rn at weblogic.security.service.SecurityServiceManager.runAs(SecurityServiceManager.java:721)rn at weblogic.servlet.internal.WebAppServletContext.invokeServlet(WebAppServletContext.java:3043)rn at weblogic.servlet.internal.ServletRequestImpl.execute(ServletRequestImpl.java:2466)rn at weblogic.kernel.ExecuteThread.execute(ExecuteThread.java:152)rn at weblogic.kernel.ExecuteThread.run(ExecuteThread.java:133)rn
struts-config.xml配置出现问题
如下:rn rn rn rn rn<em>出现</em>的错误如下:rnCannot find message resources under key org.apache.struts.action.MESSAGE rnrnjavax.servlet.jsp.JspException: Cannot find message resources under key org.apache.struts.action.MESSAGErn at org.apache.struts.util.RequestUtils.retrieveMessageResources(RequestUtils.java:1103)rn at org.apache.struts.util.RequestUtils.message(RequestUtils.java:1043)rn at org.apache.struts.taglib.bean.MessageTag.doStartTag(MessageTag.java:294)rn at org.apache.jsp.login_jsp._jspx_meth_bean_message_0(org.apache.jsp.login_jsp:274)rn at org.apache.jsp.login_jsp._jspService(org.apache.jsp.login_jsp:100)rn at org.apache.jasper.runtime.HttpJspBase.service(HttpJspBase.java:99)rn at javax.servlet.http.HttpServlet.service(HttpServlet.java:802)rn at org.apache.jasper.servlet.JspServletWrapper.service(JspServletWrapper.java:325)rnrn如果rnpath只接一个参数就不会有<em>问题</em>,如下:rnrn得出的结论:rn中的path参数只能接一个,这种说发对吗?rn很明显不对,请各位哥们指点一下!rn
struts配置出现问题
一个最简单的jsp页面,,,可是出错,不何故rntype Exception reportrnrnmessage rnrndescription The server encountered an internal error () that prevented it from fulfilling this request.rnrnexception rnrnjavax.servlet.ServletException: Cannot retrieve mapping for action /loginrn org.apache.jasper.runtime.PageContextImpl.doHandlePageException(PageContextImpl.java:867)rn org.apache.jasper.runtime.PageContextImpl.handlePageException(PageContextImpl.java:800)rn org.apache.jsp.form.login_jsp._jspService(login_jsp.java:93)rn org.apache.jasper.runtime.HttpJspBase.service(HttpJspBase.java:133)rn javax.servlet.http.HttpServlet.service(HttpServlet.java:856)rn org.apache.jasper.servlet.JspServletWrapper.service(JspServletWrapper.java:311)rn org.apache.jasper.servlet.JspServlet.serviceJspFile(JspServlet.java:301)rn org.apache.jasper.servlet.JspServlet.service(JspServlet.java:248)rn javax.servlet.http.HttpServlet.service(HttpServlet.java:856)rnrnrnroot cause rnrnjavax.servlet.jsp.JspException: Cannot retrieve mapping for action /loginrn org.apache.struts.taglib.html.FormTag.lookup(FormTag.java:810)rn org.apache.struts.taglib.html.FormTag.doStartTag(FormTag.java:506)rn org.apache.jsp.form.login_jsp._jspx_meth_html_form_0(login_jsp.java:108)rn org.apache.jsp.form.login_jsp._jspService(login_jsp.java:83)rn org.apache.jasper.runtime.HttpJspBase.service(HttpJspBase.java:133)rn javax.servlet.http.HttpServlet.service(HttpServlet.java:856)rn org.apache.jasper.servlet.JspServletWrapper.service(JspServletWrapper.java:311)rn org.apache.jasper.servlet.JspServlet.serviceJspFile(JspServlet.java:301)rn org.apache.jasper.servlet.JspServlet.service(JspServlet.java:248)rn javax.servlet.http.HttpServlet.service(HttpServlet.java:856)rnrn
配置Bean出现问题
(在Tomcat下JSP、Servlet和JavaBean环境的<em>配置</em>rnrn 经常看到jsp的初学者问tomcat下如何<em>配置</em>jsp、servlet和bean的<em>问题</em>,于是总结了一下如何tomcat下<em>配置</em>jsp、servlet和ben,希望对那些初学者有所帮助。rnrn第一步:下载j2sdk和tomcat:到sun官方站点([url]http://java.sun.com/j2se/1.4.2/download.html[/url])下载j2sdk,注意下载版本为Windows Offline Installation的SDK,同时最好下载J2SE 1.4.2 Documentation,然后到tomcat官方站点([url]http://www.apache.org/dist/jakarta/tomcat-4/[/url])下载tomcat(下载最新4.1.x版本的tomcat);rnrn第二步:安装和<em>配置</em>你的j2sdk和tomcat:执行j2sdk和tomcat的安装程序,然后按默认设置进行安装即可。rn1.安装j2sdk以后,需要<em>配置</em>一下环境变量,在我的电脑->属性->高级->环境变量->系统变量中添加以下环境变量(假定你的j2sdk安装在c:\j2sdk1.4.2):rnJAVA_HOME=c:\j2sdk1.4.2rnclasspath=.;%JAVA_HOME%\lib\dt.jar;%JAVA_HOME%\lib\tools.jar;.;(.;一定不能少,因为它代表当前路径)rnpath=%JAVA_HOME%\binrn接着可以写一个简单的java程序来测试J2SDK是否已安装成功:rnpublic class Testrnpublic static void main(String args[])rnSystem.out.println("This is a test program.");rnrnrn将上面的这段程序保存为文件名为Test.java的文件。rn然后打开命令提示符窗口,cd到你的Test.java所在目录,然后键入下面的命令 rnjavac Test.javarnjava Test rn此时如果看到打印出来This is a test program.的话说明安装成功了,如果没有打印出这句话,你需要仔细检查一下你的<em>配置</em>情况。rnrn2.安装Tomcat后,在我的电脑->属性->高级->环境变量->系统变量中添加以下环境变量(假定你的tomcat安装在c:\tomcat):rnCATALINA_HOME=C:\Tomcat 5.0rnCATALINA_BASE=C:\Tomcat 5.0;rn然后修改环境变量中的classpath,把tomat安装目录下的common\lib下的servlet.jar追加到classpath中去,修改后的classpath如下:rnclasspath=.;%JAVA_HOME%\lib\dt.jar;%JAVA_HOME%\lib\tools.jar;.;%CATALINA_HOME%\common\lib\servlet-api.jar;rn接着可以启动tomcat,在IE中访问[url]http://localhost:8080[/url],如果看到tomcat的欢迎页面的话说明安装成功了。rnrn第三步:建立自己的jsp app目录rn1.到Tomcat的安装目录的webapps目录,可以看到ROOT,examples, tomcat-docs之类Tomcat自带的的目录;rn2.在webapps目录下新建一个目录,起名叫myapp;rn3.myapp下新建一个目录WEB-INF,注意,目录名称是区分大小写的;rn4.WEB-INF下新建一个文件web.xml,内容如下:rnrnrnrnrnrnMy Web ApplicationrnrnA application for test.rnrnrn5.在myapp下新建一个测试的jsp页面,文件名为index.jsp,文件内容如下:rnrnNow time is: rnrn6.重启Tomcatrn7.打开浏览器,输入[url]http://localhost:8080/myapp/index.jsp[/url] 看到当前时间的话说明就成功了。rnrn第四步:建立自己的Servlet:rn1.用你最熟悉的编辑器(建议使用有语法检查的java ide)新建一个servlet程序,文件名为Test.java,文件内容如下:rnpackage test;rnimport java.io.IOException;rnimport java.io.PrintWriter;rnimport javax.servlet.ServletException;rnimport javax.servlet.http.HttpServlet;rnimport javax.servlet.http.HttpServletRequest;rnimport javax.servlet.http.HttpServletResponse;rnpublic class Test extends HttpServlet rnprotected void doGet(HttpServletRequest request, HttpServletResponse response)rnthrows ServletException, IOException rnPrintWriter out=response.getWriter();rnout.println(" This is a servlet test.");rnout.flush();rnrnrn2 .编译rn将Test.java放在c:\test下,使用如下命令编译:rnC:\Test>javac Test.javarn然后在c:\Test下会产生一个编译后的servlet文件:Test.classrn3 .将结构test\Test.class剪切到%CATALINA_HOME%\webapps\myapp\WEB-INF\classes下,也就是剪切那个test目录到classes目录下,如果classes目录不存在,就新建一个。 现在webapps\myapp\WEB-INF\classes下有test\Test.class的文件目录结构rn4 .修改webapps\myapp\WEB-INF\web.xml,添加servlet和servlet-mappingrn编辑后的web.xml如下所示,红色为添加的内容:rnrnrnrnrnMy Web ApplicationrnrnA application for test.rnrnrnTestrnTestrnA test Servletrntest.TestrnrnrnTestrn/Testrnrnrn这段话中的servlet这一段声明了你要调用的Servlet,而servlet-mapping则是将声明的servlet“映射”到地址/Test上rn5 .好了,启动Tomcat,启动浏览器,输入[url]http://localhost:8080/myapp/Test[/url] 如果看到输出This is a servlet test.就说明编写的servlet成功了。rn注意:修改了web.xml以及新加了class,都要重启Tomcatrnrn第四步:建立自己的Bean:rn1.用你最熟悉的编辑器(建议使用有语法检查的java ide)新建一个java程序,文件名为TestBean.java,文件内容如下:rnpackage test;rnpublic class TestBeanrnprivate String name = null;rnpublic TestBean(String strName_p)rnthis.name=strName_p;rn rnpublic void setName(String strName_p)rnthis.name=strName_p;rnrnpublic String getName()rnreturn this.name;rn rnrn2 .编译rn将TestBean.java放在c:\test下,使用如下命令编译:rnC:\Test>javac TestBean.javarn然后在c:\Test下会产生一个编译后的bean文件:TestBean.classrn3 .将TestBean.class文件剪切到 %CATALINA_HOME%\webapps\myapp\WEB-INF\classes\test下,rn4 .新建一个TestBean.jsp文件,文件内容为:rn rnrnrnJava bean name is: rn rn5 .好了,重启Tomcat,启动浏览器,输入[url]http://localhost:8080/myapp/TestBean.jsp[/url] 如果看到输出Java bean name is: This is a test java bean.就说明编写的Bean成功了。rnrn) rnrn我都做了,其它的都没有<em>问题</em>。就是<em>配置</em>Bean(第四步)没有成功,显示如下:rnrn(HTTP Status 500 - rnrn--------------------------------------------------------------------------------rnrntype Exception reportrnrnmessage rnrndescription The server encountered an internal error () that prevented it from fulfilling this request.rnrnexception rnrnorg.apache.jasper.JasperException: Unable to compile class for JSPAn error occurred at line: 4 in the jsp file: /TestBean.jspGenerated servlet error:C:\Tomcat 5.0\work\Catalina\localhost\myapp\org\apache\jsp\TestBean_jsp.java:46: illegal character: \92\par^An error occurred at line: 4 in the jsp file: /TestBean.jspGenerated servlet error:C:\Tomcat 5.0\work\Catalina\localhost\myapp\org\apache\jsp\TestBean_jsp.java:47: illegal character: \92TestBean testBean=new TestBean("This is a test java bean.");\par ^2 errors org.apache.jasper.compiler.DefaultErrorHandler.javacError(DefaultErrorHandler.java:84) org.apache.jasper.compiler.ErrorDispatcher.javacError(ErrorDispatcher.java:332) org.apache.jasper.compiler.Compiler.generateClass(Compiler.java:412) org.apache.jasper.compiler.Compiler.compile(Compiler.java:472) org.apache.jasper.compiler.Compiler.compile(Compiler.java:451) org.apache.jasper.compiler.Compiler.compile(Compiler.java:439) org.apache.jasper.JspCompilationContext.compile(JspCompilationContext.java:511) org.apache.jasper.servlet.JspServletWrapper.service(JspServletWrapper.java:295) org.apache.jasper.servlet.JspServlet.serviceJspFile(JspServlet.java:292) org.apache.jasper.servlet.JspServlet.service(JspServlet.java:236) javax.servlet.http.HttpServlet.service(HttpServlet.java:802)rn rnrnnote The full stack trace of the root cause is available in the Apache Tomcat/5.0.28 logs.rnrnrn--------------------------------------------------------------------------------rnrnApache Tomcat/5.0.28)rn请问原因出在那里?rnrn
配置EclipseME出现问题
我先从HELP里面添加了EclipseME,rn重起软件后WindowPreferences里面已经有了J2MErn但是在J2ME中没有platform components这可怎么办啊~?
CakePHP配置出现问题
<em>配置</em>后进入缺省页面,<em>出现</em>这样的<em>问题</em>,怎么解决rn[img=C:\Documents and Settings\Administrator\桌面\360安全浏览器截图30276437.jpg][/img]
配置nginx出现问题
nginx<em>配置</em>时使用CMD打开启动(nginx.exe -s reload)时<em>出现</em>(nginx: [emerg] unknown directive “聽聽聽” in D:\nginx-1.14.2\nginx-1.14.2/conf/nginx.conf:37)或者(nginx: [emerg] unknown directive “ssi_silent_errors?on” in D:\ngi...
配置tomcat出现问题
[color=#0000FF]信息: Starting Servlet Engine: Apache Tomcat/6.0.30rnlog4j:ERROR setFile(null,true) call failed.rnjava.io.FileNotFoundException: E:\workspace\cwbbs2\WebRoot\log\community.log (系rn统找不到指定的路径。)[/color]rnrnE:\workspace\cwbbs2已经删除rnserver.xml没有<em>配置</em>cwbbs2
安装pcl1.9.1 需要——最新CMake安装及使用
安装<em>pcl1.9.1</em>时需要安装cmake,所以查了下安装方法,顺便写了下
【VS2017】VS2017离线安装教程
参考文章: 命令行参数说明:https://www.cnblogs.com/danzhang/p/6534341.html 定制安装(不需要下载全部):https://www.cnblogs.com/smallprogram/p/6414799.html (中文参数见第一个链接) 步骤: 先到http://visualstudio.com/free,点击Download 下载安装程序,改...
vs2017
有谁可以解答一个<em>vs2017</em>社区版没有web.config怎么回事!rn
配置IIS6出现 出现验证码无法显示问题
1 最近在做vs2012的程序发布到IIs上之后<em>出现</em>验证码无法显示<em>问题</em>    在不同机子上部署时(win7)候依然<em>出现</em><em>问题</em>,后来原来是IIs<em>配置</em>的<em>问题</em> 首先打开控制面板->程序与功能->打开或关闭Windows功能 然后选中Internet信息服务 按下图   在win8的情况下要把脚本与工具下得 ASP.NET3.5 ,4.5都选上。 2然后在计算机 ->右击管理->服务与应用程序->in
VS2017搜索问题
VS2017,使用搜索功能的“在整个解决方案中搜索”,搜不到正确的结果,我理解是因为2017打开的时候不加载解决方案下所有的项目,但是在项目中搜索也搜不到内容。VS2017中搜索到底怎么用的?
VS2017 发布MVC的问题
如下边的图所示,点击发布后一直卡在正在准备<em>配置</em>文件的界面,rn有那位大佬知道怎么解决不rn[img=https://img-bbs.csdn.net/upload/201711/16/1510812830_314829.png][/img][img=https://img-bbs.csdn.net/upload/201711/16/1510812839_713788.png][/img]
VS2017 共享节问题
VS2017 共享节<em>问题</em> 需要dll间共享数据,看了http://www.cnblogs.com/CBDoctor/archive/2013/01/26/2878201.html,尝试了下,使用def文件添加共享节 SECTION myseg READ WRITE SHARED 发现VS2017编译出来没有共享节,查看编译警告: 1&amp;gt;Source.def(3): warning LNK40...
VS2017的相关问题
1.解决闪退:#include&amp;lt;stdlib.h&amp;gt; system(&quot;pause&quot;); (参考链接:https://blog.csdn.net/Homewm/article/details/78858424) 2.scanf出错:在程序最前面加:#define_CRT_SECURE_NO_DEPRECATE 或 #pragma warning(disable:4996) ...
vs2017生成dll的问题
我有一个头文件init_data.h用于声明全局变量和一些类如下:rn[code=c]#pragma oncern#ifndef init_data_Hrn#define init_data_Hrn#includern#includern#includern#includern#include rn#include rn#include rn#include rn#include rn#include rnrntypedef pcl::PointXYZ PointT;rntypedef pcl::PointCloud PointCloudT;rntypedef struct txtPoint_XYZRGB rn double x;rn double y;rn double z;rn double r;rn double g;rn double b;rntxtPoint_XYZRGB;rntypedef struct txtPoint_XYZ rn double x;rn double y;rn double z;rntxtPoint_XYZ;rn//键盘鼠标事件实例化rnclass enent :public osgGA::GUIEventHandlerrnrnpublic:rn enent() ;rn ~enent() ;rn virtual bool handle(const osgGA::GUIEventAdapter &ea, osgGA::GUIActionAdapter &us);rnprotected:rnprivate:rn osg::ref_ptr node_;rn;rnrnclass VisitorNode : public osg::NodeVisitorrnrnpublic:rn VisitorNode() : osg::NodeVisitor(TRAVERSE_ALL_CHILDREN), _indent(0) ;rn osg::Vec3f getFirst();rn void apply(osg::Geode &node);rnprivate:rn int _indent;rn osg::Vec3f AAA;rn;rnrn//遍历标绘点rnclass DelVisitorNode : public osg::NodeVisitorrnrnpublic:rn DelVisitorNode(int x, int y) : osg::NodeVisitor(TRAVERSE_ALL_CHILDREN), _indent(0) rn XX = x;rn YY = y;rn ;rn osg::Vec3f dgetFirst();rn void apply(osg::Geode &node);rnprivate:rn int _indent;rn osg::Vec3f AAA;rn int XX;rn int YY;rn;rnrn//截取恢复遍历rnclass RestoreVisitorNode : public osg::NodeVisitorrnrnpublic:rn RestoreVisitorNode() :osg::NodeVisitor(TRAVERSE_ALL_CHILDREN), _indent(0) ;rn void apply(osg::Geode &node);rnprivate:rn int _indent;rn;rnrn//三维转2D遍历,去掉上顶板rnclass ScreenShotVisitorNodeup : public osg::NodeVisitorrnrnpublic:rn ScreenShotVisitorNodeup() : osg::NodeVisitor(TRAVERSE_ALL_CHILDREN), _indent(0)rn ;rn void apply(osg::Geode &node);rnprivate:rn int _indent;rn osg::Vec3f AAA;rn int XX;rn int YY;rn int ZZ;rn;rnrn//三维转2D遍历rnclass ScreenShotVisitorNodedown : public osg::NodeVisitorrnrnpublic:rn ScreenShotVisitorNodedown() : osg::NodeVisitor(TRAVERSE_ALL_CHILDREN), _indent(0)rn rn ;rn void apply(osg::Geode &node);rnprivate:rn int _indent;rn osg::Vec3f AAA;rn int XX;rn int YY;rn int ZZ;rn;rnrn//遍历更改点云颜色rnclass sketchVisitorNode : public osg::NodeVisitorrnrnpublic:rn sketchVisitorNode() :osg::NodeVisitor(TRAVERSE_ALL_CHILDREN), _indent(0)rn ;rn void apply(osg::Geode &node);rnprivate:rn int _indent;rn;rnrn//三维转2D遍历rnclass ScreenShotBVisitorNode : public osg::NodeVisitorrnrnpublic:rn ScreenShotBVisitorNode() : osg::NodeVisitor(TRAVERSE_ALL_CHILDREN), _indent(0)rn ;rn void apply(osg::Geode &node);rnprivate:rn int _indent;rn osg::Vec3f AAA;rn int XX;rn int YY;rn int ZZ;rn;rnrn#endifrnrn#ifdef init_data_EXPORTSrn#define init_data __declspec(dllexport)rn#elsern#define init_data __declspec(dllimport)rn#endifrnrnrnrnextern "C" txtPoint_XYZRGB txtPoint;rnextern "C" std::vector txtPoints;rnrnextern "C" osg::ref_ptr viewer;rnextern "C" osg::ref_ptr camera;rnrnextern "C" float sketchS;rnextern "C" float sketchR;rnextern "C" float sketchG;rnextern "C" float sketchB;rnextern "C" float sketchA;rnextern "C" int sketh_num;//标绘点数rnrnextern "C" float dataR;rnextern "C" float dataG;rnextern "C" float dataB;rnextern "C" float dataA;rnrnextern "C" int VisitorNode_X;rnextern "C" int VisitorNode_Y;rnextern "C" int flag2;rnextern "C" std::string DistoricalData_path;rnextern "C" int GEODE_points_num;rnextern "C" int COL_I;//文件列数rnextern "C" long int sizeofnow_N;rnextern "C" TCHAR chpath[MAX_PATH];rnextern "C" int flag_filter;//加载完数据才能滤波,值大于0rnextern "C" float max_rgb;rnextern "C" float POINT_X_min;rnextern "C" float POINT_X_max;rnextern "C" float POINT_Y_min;rnextern "C" float POINT_Y_max;rnextern "C" float POINT_Z_min;rnextern "C" float POINT_Z_max;rnextern "C" int DN;//采样率rnextern "C" long int sizeofnow;//读取进度rnextern "C" float ReadProgress;rnextern "C" long int sizeoffile;rnextern "C" float AY, BY, CenterY, MidDeltY;rnextern "C" float MT[3];rnextern "C" float YY_up, YY_down;[/code]rninit_data定义全局变量和一些类方法如下:rn[img=https://img-bbs.csdn.net/upload/201905/08/1557322891_510478.png][/img]rnrn有很多cpp调用这个头文件,然后我想能让c#调用这个dll,所以用了clr模式rnrn[img=https://img-bbs.csdn.net/upload/201905/08/1557322959_62747.png][/img]rnrn然后<em>出现</em>如下错误rnrn1>Axis_clear.cpprn1>c:\pcl 1.8.1\3rdparty\boost\include\boost-1_64\boost\filesystem\path.hpp(579): error C2059: 语法错误:“generic”rn1>c:\pcl 1.8.1\3rdparty\boost\include\boost-1_64\boost\filesystem\path.hpp(579): error C2334: “”的前面有意外标记;跳过明显的函数体rnrn在无公共语言支持下是没有错误的,怎么解决,难道我用错了吗rnrn
vs2017关于chart的问题
[img=https://img-bbs.csdn.net/upload/201907/22/1563760112_59340.png][/img]rnrn当数据增长到超过Y轴最大值时,Y轴不会动态更新,重新运行程序才能正常显示。rn请问一下如何解决这种情况?
VS2017 WIN SDK问题
在VS2017里, 默认SDK是10.0.15063.0 ,但是运行起来却是10.0.14393.1198,导致无法显示视图,最低版本调高了也没法编译。我电脑里没有装10.0.14393.1198,但有一个VS2015。在打开文件的时候,解析的包也都是10.0.15063.0的。 rn为什么 VS自动给SDK降级呢?rn[img=https://img-bbs.csdn.net/upload/201706/19/1497885433_829915.jpg][/img]rnrn1>------ 已启动部署: 项目: App7, <em>配置</em>: Debug Win32 ------rn1>DEP3321: 要部署此应用程序,你的部署目标应运行 Windows Universal Runtime 版本 10.0.15063.0 或更高版本。你当前运行的版本为 10.0.14393.1198。请更新你的 OS 或将部署目标更改为具有合适版本的设备。rn========== 部署: 成功 0 个,失败 1 个,跳过 0 个 ==========rn[img=https://img-bbs.csdn.net/upload/201706/19/1497885098_919854.jpg][/img][img=https://img-bbs.csdn.net/upload/201706/19/1497885198_743032.jpg][/img]
vs2017试用期结束问题
Visual Studio 2017 企业版 Enterprise 更新码:NJVYC-BMHX2-G77MM-4XJMR-6Q8QF
vs2017使用的问题!!
请问各位大神,小弟初次使用VS2017,发布网站<em>出现</em><em>问题</em>?请问为什么会有这些文件?rn关键的VIEWS文件下的视图文件都没有呢?rnrn是还需要怎么设置吗?rnrn[img=https://img-bbs.csdn.net/upload/201710/12/1507803727_818317.png][/img]
关于vs2017使用析构函数 出现的错误
注:本文非标准教程,仅是总结个人学习过程,可能存在纰漏,如有错误之处欢迎留言告知,非常感谢 废话不多说,直接贴代码和图片 (代码是《C++程序设计基础》里面的。) #include&amp;lt;iostream&amp;gt; using namespace std; class Date { public: Date(int, int, int); ~Date(); void SetDate(int y...
关于使用vs2017出现的奇怪错误
严重性    代码    说明    项目    文件    行    禁止显示状态 错误        Couldn't process file GTS.resx due to its being in the Internet or Restricted zone or having the mark of the web on the file. Remove the mark of th...
vs2017安装失败,总是出现一个黑框
一点开<em>vs2017</em>安装包就<em>出现</em>一个黑框,等好久都没有反应。安装包也是从官网上下载的啊。
装了VS2017后突然出现的异常
以前2010的时候的代码没有错误提示(我把调试异常全部都点了)rn前天装了2017后,依然在vs2010里运行以前代码,提示在 System.EntryPointNotFoundException 中第一次偶然<em>出现</em>的“mscorlib.dll”类型的异常rn错误语句是task.start()这一句,在异常里把system里的EntryPointNotFoundException 异常取消打勾后不再提示,也可以跑下去,但是总觉得不舒服,请问这到底是什么原因导致的?代码非常简单,没有调用任何第3方模块
vs2017和MATLAB2016b混编出现初始化异常
<em>vs2017</em> 调用MATLAB2016b中动态链接库dll,<em>vs2017</em><em>出现</em>“异常:0xC0000005: 读取位置 0x0000000000000008 时发生访问冲突” 本人win7,<em>vs2017</em>,matlab2016都是64位;异常如下: 针对如上异常处理方法:Ctrl+Alt+E取消Win32 Exceptions 或者在<em>vs2017</em>界面--&gt;调试--&gt;异常设置--&...
VS2017使用Boost库中出现的小问题
前言首先说下原先使用Boost的<em>配置</em>:sublime3,Boost1.64.0和g++4.9.2在之前学习Boost过程中<em>出现</em>了类似以下的<em>问题</em>// undefined reference to boost::system::system_category() when compilingundefined reference to boost::system::system_category()幸好
VS2017 安装 R 组件后出现警告
VS2017 安装 R 组件后<em>出现</em>警告
vs2017 下编译 fortran 出现 rc.exe not found
安装完intel visual studio 2017后,在<em>vs2017</em>里编译fortran文件时<em>出现</em> rc.exe not found ,请问一下这是什么原因?
Oracle错误一览表下载
Oracle错误一览表,文档共分四册,详细记录每一条错误信息 相关下载链接:[url=//download.csdn.net/download/handaoyaosi/7231689?utm_source=bbsseo]//download.csdn.net/download/handaoyaosi/7231689?utm_source=bbsseo[/url]
语法分析程序下载
用LL(1)文法的语法分析程序 相关下载链接:[url=//download.csdn.net/download/lzydwd/3836108?utm_source=bbsseo]//download.csdn.net/download/lzydwd/3836108?utm_source=bbsseo[/url]
微博AIR.exe下载
( 微博AIR.exe ) sina微薄。 相关下载链接:[url=//download.csdn.net/download/joegzx/5102802?utm_source=bbsseo]//download.csdn.net/download/joegzx/5102802?utm_source=bbsseo[/url]
相关热词 c# gdi 占用内存 c#中遍历字典 c#控制台模拟dos c# 斜率 最小二乘法 c#进程延迟 c# mysql完整项目 c# grid 总行数 c# web浏览器插件 c# xml 生成xsd c# 操作sql视图
我们是很有底线的