docker-compose 运行镜像文件时报错 [问题点数:50分]

Bbs1
本版专家分:0
结帖率 0%
Bbs2
本版专家分:320
Blank
红花 2018年7月 Linux/Unix社区大版内专家分月排行榜第一
2018年6月 Linux/Unix社区大版内专家分月排行榜第一
Bbs1
本版专家分:2
Blank
红花 2011年5月 Java大版内专家分月排行榜第一
2011年4月 Java大版内专家分月排行榜第一
docker-compose.yml编排LNMP,php找不到文件,注意nginx配置文件
2019独角兽企业重金招聘Python工程师标准>>> ...
docker-compose 安装及异常处理
针对docker的部署是比较复杂的,一系列的命令足以让实施新手研究与学习个把月了,掺杂了业务的docker容器化部署更是复杂。面对问题我们需要引入<em>docker-compose</em> 工具来帮我们完成系列复杂指令。 手工安装 可以通过https://github.com/docker/compose/releases 官方地址下载最新的<em>docker-compose</em>(如:sudo curl -L htt...
运行web.config时报错
<em>运行</em>web.config时<em>报错</em>,错误列表中显示某个文件不存在。请问我该怎么改正。
运行springboot时报错
之前省略rnError starting ApplicationContext. To display the auto-configuration report re-run your application with 'debug' enabled.rn2018-02-05 14:02:16.424 ERROR 4304 --- [ restartedMain] o.s.boot.SpringApplication : Application startup failedrnrnjava.lang.IllegalStateException: Failed to execute CommandLineRunnerrn at org.springframework.boot.SpringApplication.callRunner(SpringApplication.java:779)rn at org.springframework.boot.SpringApplication.callRunners(SpringApplication.java:760)rn at org.springframework.boot.SpringApplication.afterRefresh(SpringApplication.java:747)rn at org.springframework.boot.SpringApplication.run(SpringApplication.java:315)rn at org.springframework.boot.SpringApplication.run(SpringApplication.java:1162)rn at org.springframework.boot.SpringApplication.run(SpringApplication.java:1151)rn at com.ustcinfo.sms.SMSApplication.main(SMSApplication.java:13)rn at sun.reflect.NativeMethodAccessorImpl.invoke0(Native Method)rn at sun.reflect.NativeMethodAccessorImpl.invoke(NativeMethodAccessorImpl.java:57)rn at sun.reflect.DelegatingMethodAccessorImpl.invoke(DelegatingMethodAccessorImpl.java:43)rn at java.lang.reflect.Method.invoke(Method.java:606)rn at org.springframework.boot.devtools.restart.RestartLauncher.run(RestartLauncher.java:49)rnCaused by: org.springframework.data.redis.RedisConnectionFailureException: No reachable node in cluster; nested exception is redis.clients.jedis.exceptions.JedisNoReachableClusterNodeException: No reachable node in clusterrn at org.springframework.data.redis.connection.jedis.JedisExceptionConverter.convert(JedisExceptionConverter.java:67)rn at org.springframework.data.redis.connection.jedis.JedisExceptionConverter.convert(JedisExceptionConverter.java:41)rn at org.springframework.data.redis.PassThroughExceptionTranslationStrategy.translate(PassThroughExceptionTranslationStrategy.java:37)rn at org.springframework.data.redis.connection.jedis.JedisClusterConnection.convertJedisAccessException(JedisClusterConnection.java:3992)rn at org.springframework.data.redis.connection.jedis.JedisClusterConnection.exists(JedisClusterConnection.java:3637)rn at org.springframework.data.redis.connection.DefaultStringRedisConnection.exists(DefaultStringRedisConnection.java:264)rn at org.springframework.data.redis.core.RedisTemplate$6.doInRedis(RedisTemplate.java:661)rn at org.springframework.data.redis.core.RedisTemplate$6.doInRedis(RedisTemplate.java:658)rn at org.springframework.data.redis.core.RedisTemplate.execute(RedisTemplate.java:207)rn at org.springframework.data.redis.core.RedisTemplate.execute(RedisTemplate.java:169)rn at org.springframework.data.redis.core.RedisTemplate.hasKey(RedisTemplate.java:658)rn at com.ustcinfo.sms.external.itf.init.InitRedisCache.initOrgDayFlow(InitRedisCache.java:51)rn at com.ustcinfo.sms.external.itf.StartupRunner.run(StartupRunner.java:35)rn at org.springframework.boot.SpringApplication.callRunner(SpringApplication.java:776)rn ... 11 common frames omittedrnCaused by: redis.clients.jedis.exceptions.JedisNoReachableClusterNodeException: No reachable node in clusterrn at redis.clients.jedis.JedisSlotBasedConnectionHandler.getConnection(JedisSlotBasedConnectionHandler.java:57)rn at redis.clients.jedis.JedisSlotBasedConnectionHandler.getConnectionFromSlot(JedisSlotBasedConnectionHandler.java:74)rn at redis.clients.jedis.JedisClusterCommand.runWithRetries(JedisClusterCommand.java:116)rn at redis.clients.jedis.JedisClusterCommand.runBinary(JedisClusterCommand.java:60)rn at redis.clients.jedis.BinaryJedisCluster.exists(BinaryJedisCluster.java:108)rn at org.springframework.data.redis.connection.jedis.JedisClusterConnection.exists(JedisClusterConnection.java:3635)rn ... 20 common frames omittedrnrn2018-02-05 14:02:16.428 INFO 4304 --- [ restartedMain] ationConfigEmbeddedWebApplicationContext : Closing org.springframework.boot.context.embedded.AnnotationConfigEmbeddedWebApplicationContext@301487f9: startup date [Mon Feb 05 14:01:13 CST 2018]; root of context hierarchyrn2018-02-05 14:02:19.095 INFO 4304 --- [ restartedMain] o.s.j.e.a.AnnotationMBeanExporter : Unregistering JMX-exposed beans on shutdownrn2018-02-05 14:02:19.140 INFO 4304 --- [ restartedMain] o.s.s.concurrent.ThreadPoolTaskExecutor : Shutting down ExecutorServicern2018-02-05 14:02:19.141 INFO 4304 --- [ restartedMain] j.LocalContainerEntityManagerFactoryBean : Closing JPA EntityManagerFactory for persistence unit 'default'rn
运行CLASS文件时报错
F:\>java zhishu.classrnError opening registry key 'Software\JavaSoft\Java RrnError: could not find java.dllrnError: could not find Java 2 Runtime Environment.
运行代码时报错
Default.aspx.cs文件 rnusing System; rnusing System.Data; rnusing System.Web; rnusing System.Web.Security; rnusing System.Web.UI; rnusing System.Web.UI.WebControls; rnusing System.Web.UI.WebControls.WebParts; rnusing System.Web.UI.HtmlControls; rnusing System.Data.SqlClient; rnusing System.Configuration; rnrnpublic partial class _Default : System.Web.UI.Page rn rn protected void Page_Load(object sender, EventArgs e) rn rnrn rn protected void TextBox1_TextChanged(object sender, EventArgs e) rn rnrn rn protected void Button1_Click(object sender, EventArgs e) rn rn string connectionString = System.Configuration.ConfigurationSettings.AppSettings["MyConnectionString"]; rnrn SqlConnection con = new SqlConnection(connectionString); rn try rn rn con.Open(); rn Label2.Text = " Server Version: " + con.ServerVersion; rn Label2.Text = " Connection Is: " + con.State.ToString(); rn rn rn catch (Exception err) rn rn Label2.Text = "Error reading the database. " + err.Message; rn rn finally rn rn con.Close(); rn Label2.Text +=" Now Connection Is: " + rn con.State.ToString(); rn rn rn rnrnWeb.config文件 rn rnrn rn rn rnrn rnrn rnrn rn rn rn rn rnrn上面 string connectionString = System.Configuration.ConfigurationSettings.AppSettings["MyConnectionString"]; 这一段改成下面这一段的话rnstring connectionString = rn WebConfigurationManager.ConnectionStrings["MyConnectionString "].ConnectionString; rnrn就会提示1.当前上下文中不存在名称"WebConfigurationManager" rn但using System.Configuration; 这不是已经引用了命名空间了么? 为什么还提示1.当前上下文中不存在名称"WebConfigurationManager" rnrn还有当我<em>运行</em>上面这些代码的时候提示Error reading the database. ConnectionString 属性尚未初始化。 rn在 string connectionString = System.Configuration.ConfigurationSettings.AppSettings["MyConnectionString"]; 这个上面填写string connectionString; 的话 显示 已在此范围定义了名为"connectionString"的局部变量rn
运行Activiti时报错
用eclipse<em>运行</em>Activiti时报如下错: Exception in thread "main" java.lang.UnsupportedClassVersionError: org/activiti/engine/ProcessEngines : Unsupported major.minor version 51.0 at java.lang.ClassLoader.defi...
docker-compose启动报错
<em>报错</em>消息如下: [root@localhost mychaincode]# <em>docker-compose</em> down ERROR: Couldn't connect to Docker daemon at http+docker://localunixsocket - is it running? If it's at a non-standard location, specify the U...
运行myeclipse6.5时报错
Problems occurred restoring workbench.rn Unable to restore perspective: Workspace - MyEclipse Java Enterprise.rn Internal error activating an Editor.rn An error occurred while automatically activating bundle org.eclipse.debug.ui (121).rn
运行项目时报错
Execution failed for task ':app:dexDebug'. > com.android.ide.common.process.ProcessException: org.gradle.process.internal.ExecException: Process 'command 'D:\develop\Java\jdk1.8.0_60\bin\java.exe'' f
docker-compose
Compose is a tool for defining and running multi-container Docker applications. To learn more about Compose refer to the following documentation
apache-james-2.3.2 运行build.bat时报错
compile-main:rnCompiling James Java sourcesrnCompiling 317 source files to C:\apache-james-2.3.2\build\classesrnC:\apache-james-2.3.2\src\java\org\apache\james\James.java:407: 警告:[deprecatirnon] org.apache.james.services.MailServer 中的 sendMail(javax.mail.internet.MimeMrnessage) 已过时rn public void sendMail(MimeMessage message) throws MessagingException rn ^rnC:\apache-james-2.3.2\src\java\org\apache\james\James.java:470: 警告:[deprecatirnon] org.apache.james.services.MailServer 中的 sendMail(org.apache.mailet.MailAddrnress,java.util.Collection,java.io.InputStream) 已过时rn public void sendMail(MailAddress sender, Collection recipients, InputStreamrnmsg)rn ^rnC:\apache-james-2.3.2\src\java\org\apache\james\James.java:433: 警告:[deprecatirnon] org.apache.james.services.MailServer 中的 sendMail(org.apache.mailet.MailAddrnress,java.util.Collection,javax.mail.internet.MimeMessage) 已过时rn public void sendMail(MailAddress sender, Collection recipients, MimeMessagernmessage)rn ^rnC:\apache-james-2.3.2\src\java\org\apache\james\util\mordred\PoolConnEntry.java:rn37: org.apache.james.util.mordred.PoolConnEntry 不是抽象的,并且未覆盖 java.sql.rnConnection 中的抽象方法 createStruct(java.lang.String,java.lang.Object[])rnpublic class PoolConnEntry implements java.sql.Connectionrn ^rn1 错误rn3 警告rnrnBUILD FAILEDrnfile:C:/apache-james-2.3.2/build.xml:291: Compile failed; see the compiler errorrn output for details.
crontab 运行python 时报错
<em>运行</em>crontab时会报python 某个 module 不存在, 解决方法:/usr/local/bin/python 要<em>运行</em>的脚本.py 其实就是把python的完整路径给出就行
运行TensorFlow代码时报错
<em>运行</em>TensorFlow代码时<em>报错</em> <em>运行</em>TensorFlow代码时<em>报错</em> 错误信息ImportError: libcublas.so.10.0: cannot open shared object file 原因:TensorFlow版本与CUDA版本不匹配 可使用pip3 install tensorflow-gpu==[version]将Tens...
hibernate 运行hbm2java时报错
<em>运行</em>hbm2java时<em>报错</em>:rn出现“Exception in thread "main" java.lang.NoClassDefFoundError:Files\java\jdk1/5/0_0rn5\lib;D:\Program”rnlib在环境变量中已配好,jdk的位置也没错。错误信息的“D:\Program”又是什么意思?rnrn请高手指点
oozie运行shell时报错
Log Type: stderrrnLog Upload Time: 星期三 十月 12 09:53:02 +0800 2016rnLog Length: 2065rnFailing Oozie Launcher, Main class [org.apache.oozie.action.hadoop.ShellMain], main() threw exception, Cannot run program "billanalyse.sh" (in directory "/data/yarn/nm/usercache/root/appcache/application_1475922151418_0476/container_1475922151418_0476_02_000002"): error=2, 没有那个文件或目录rnjava.io.IOException: Cannot run program "billanalyse.sh" (in directory "/data/yarn/nm/usercache/root/appcache/application_1475922151418_0476/container_1475922151418_0476_02_000002"): error=2, 没有那个文件或目录rn at java.lang.ProcessBuilder.start(ProcessBuilder.java:1047)rn at org.apache.oozie.action.hadoop.ShellMain.execute(ShellMain.java:110)rn at org.apache.oozie.action.hadoop.ShellMain.run(ShellMain.java:69)rn at org.apache.oozie.action.hadoop.LauncherMain.run(LauncherMain.java:49)rn at org.apache.oozie.action.hadoop.ShellMain.main(ShellMain.java:61)rn at sun.reflect.NativeMethodAccessorImpl.invoke0(Native Method)rn at sun.reflect.NativeMethodAccessorImpl.invoke(NativeMethodAccessorImpl.java:57)rn at sun.reflect.DelegatingMethodAccessorImpl.invoke(DelegatingMethodAccessorImpl.java:43)rn at java.lang.reflect.Method.invoke(Method.java:606)rn at org.apache.oozie.action.hadoop.LauncherMapper.map(LauncherMapper.java:236)rn at org.apache.hadoop.mapred.MapRunner.run(MapRunner.java:54)rn at org.apache.hadoop.mapred.MapTask.runOldMapper(MapTask.java:453)rn at org.apache.hadoop.mapred.MapTask.run(MapTask.java:343)rn at org.apache.hadoop.mapred.YarnChild$2.run(YarnChild.java:164)rn at java.security.AccessController.doPrivileged(Native Method)rn at javax.security.auth.Subject.doAs(Subject.java:415)rn at org.apache.hadoop.security.UserGroupInformation.doAs(UserGroupInformation.java:1693)rn at org.apache.hadoop.mapred.YarnChild.main(YarnChild.java:158)rnCaused by: java.io.IOException: error=2, 没有那个文件或目录rn at java.lang.UNIXProcess.forkAndExec(Native Method)rn at java.lang.UNIXProcess.(UNIXProcess.java:186)rn at java.lang.ProcessImpl.start(ProcessImpl.java:130)rn at java.lang.ProcessBuilder.start(ProcessBuilder.java:1028)rn ... 17 morernrnLog Type: stdoutrnLog Upload Time: 星期三 十月 12 09:53:02 +0800 2016rnLog Length: 82829rnShowing 4096 bytes of 82829 total. Click here for the full log.rn1475922151418_0476/container_1475922151418_0476_02_000002:/etc/hadoop/conf.cloudera.yarn:/var/run/cloudera-scm-agent/process/1942-yarn-NODEMANAGER:/opt/cloudera/parcels/CDH-5.7.2-1.cdh5.7.2.p0.18/lib/hadoop/*:/opt/cloudera/parcels/CDH-5.7.2-1.cdh5.7.2.p0.18/lib/hadoop/lib/*:/opt/cloudera/parcels/CDH-5.7.2-1.cdh5.7.2.p0.18/lib/hadoop-hdfs/*:/opt/cloudera/parcels/CDH-5.7.2-1.cdh5.7.2.p0.18/lib/hadoop-hdfs/lib/*:/opt/cloudera/parcels/CDH-5.7.2-1.cdh5.7.2.p0.18/lib/hadoop-yarn/*:/opt/cloudera/parcels/CDH-5.7.2-1.cdh5.7.2.p0.18/lib/hadoop-yarn/lib/*:/opt/cloudera/parcels/CDH-5.7.2-1.cdh5.7.2.p0.18/lib/hadoop-mapreduce/*:/opt/cloudera/parcels/CDH-5.7.2-1.cdh5.7.2.p0.18/lib/hadoop-mapreduce/lib/*::job.jar/job.jar:job.jar/classes/:job.jar/lib/*:/data/yarn/nm/usercache/root/appcache/application_1475922151418_0476/container_1475922151418_0476_02_000002/*:rnSTDOUT_LOGFILE_ENV=/data/yarn/container-logs/application_1475922151418_0476/container_1475922151418_0476_02_000002/stdout:rnCM_STATUS_CODES=STATUS_NONE HDFS_DFS_DIR_NOT_EMPTY HBASE_TABLE_DISABLED HBASE_TABLE_ENABLED JOBTRACKER_IN_STANDBY_MODE YARN_RM_IN_STANDBY_MODE:rnSUPERVISOR_ENABLED=1:rnHADOOP_CLIENT_OPTS=:rnHOME=/home/:rnCDH_CRUNCH_HOME=/usr/lib/crunch:rnKEYTRUSTEE_SERVER_HOME=/usr/lib/keytrustee-server:rnYARN_RESOURCEMANAGER_OPTS=:rnHIVE_DEFAULT_XML=/etc/hive/conf.dist/hive-default.xml:rnCDH_KMS_HOME=/opt/cloudera/parcels/CDH-5.7.2-1.cdh5.7.2.p0.18/lib/hadoop-kms:rnWEBHCAT_DEFAULT_XML=/opt/cloudera/parcels/CDH-5.7.2-1.cdh5.7.2.p0.18/etc/hive-webhcat/conf.dist/webhcat-default.xml:rnHADOOP_JOB_HISTORYSERVER_OPTS=:rnCGROUP_ROOT_BLKIO=/cgroup/blkio:rn=================================================================rnrn>>> Invoking Shell command line now >>rnrnrn<<< Invocation of Main class completed <<(UNIXProcess.java:186)rn at java.lang.ProcessImpl.start(ProcessImpl.java:130)rn at java.lang.ProcessBuilder.start(ProcessBuilder.java:1028)rn ... 17 morernrnOozie Launcher failed, finishing Hadoop job gracefullyrnrnOozie Launcher, uploading action data to HDFS sequence file: hdfs://flowbigdata01-master:8020/user/root/oozie-oozi/0000108-161008182255664-oozie-oozi-W/shell-check-hour--shell/action-data.seqrnrnOozie Launcher ends
yii运行phpunit时报错
问题 在Yii中执行测试用例时<em>报错</em>,内容如下: PHP Warning: require_once(PHPUnit/Runner/Version.php): failed to open stream: No such file or directory in /home/work/software/yii/framework/te...
Docker 运行容器时报错
iptables failed:       iptables -t nat -A DOCKER -p tcp -d 0/0 --dport 9300 -j DNAT --to-        destination 172.17.0.2:9300 ! -i docker0: iptables: No chain/target/match by that name. 解决方案:    ...
在Python下运行boilerpipe 时报错
<em>运行</em>boilerpipe 时报以下错误: Traceback (most recent call last): File "/Users/Adrian/anaconda3/lib/python3.6/site-packages/boilerpipe/extract/__init__.py", line 45, in __init__ self.data = unicode(self...
Linux运行Tomcat时报错
<em>报错</em>提示:Neither the JAVA_HOME nor the JRE_HOME environment variable is defined At least one of these environment variable is needed to run this program 以上<em>报错</em>解释: java_home和jre_home环境变量均未定义 <em>运行</em>此程序至少需要这些环境变量中...
运行react-native项目时报错
<em>运行</em>react-native项目时<em>报错</em>。 Application MyTest has not been registered. This is either due to a require() error during initialization or failure to call AppRegistry.registerComponent. 第一:检查项目名是
运行vue项目时报错
一直在提示找不到模块,一直下载安装这些依赖也不行解决方法:先删除模块的目录,然后<em>运行</em>cnpm cache clear,然后再<em>运行</em>cnpm install
jcreator运行jsp文件时报错
[code=Java]rnjavac: 无效的标志: D:\tomcat6.0\Tomcat 6.0\webapps\MyJspSite\myCal.jsprn用法: javac rn-help 用于列出可能的选项rn[/code]rn以前写servlet的时候是好的啊?为什么写jsp时报这个错误?
BCB运行工程时报错
自己写的一个工程,以前都能编译过的。现在突然不能编过了也不能修改了!专家包搜索匹配时也会<em>报错</em>。具体错误为“Access violation at address 00C90CAB in module 'COMP32P.DLL'.Read of address 00000000”,求大侠帮忙指教。
docker-compose运行python web服务相关资源
<em>docker-compose</em><em>运行</em>python web服务相关资源;包括如下: root@ubuntu:~/docker/dockerfile# ls Django-1.8.3.tar.gz <em>docker-compose</em>.yml Dockerfile Dockerfile.bak ops ops.tar.gz root@ubuntu:~/docker/dockerfile# cd ops root@ubuntu:~/docker/dockerfile/ops# ls db.sqlite3 manage.py ops run.sh
(六)docker=>docker-compose (快速定义和运行容器)
6.Docker compose docker compose的特点; 本质:docker 工具 对象:应用服务 配置:YAML 格式配置文件 命令:简单 执行:定义和<em>运行</em>容器 安装: #安装依赖工具 sudo apt-get install python-pip -y #安装编排工具 sudo pip install <em>docker-compose</em> #查看编排工具版本 sudo docker-co...
使用Docker-Compose运行多个服务的app
课程实验环境:rn系统环境:CentOS 7.5rnDocker版本:18.06rnDocker-Compose版本:1.22.0rn通过对Docker 18.06的架构剖析、Docker相关的8个方面对Docker原理及实验能够让学员对Docker架构、网络、镜像、卷、容器知识的掌握。
镜像文件
所谓<em>镜像文件</em>其实和rar ZIP压缩包类似,它将特定的一系列文件按照一定的格式制作成单一的文件,以方便用户下载和使用,例如一个操作系统、游戏等。它最重要的特点是可以被特定的软件识别并可直接刻录到光盘上。其实通常意义上的<em>镜像文件</em>可以再扩展一下,在<em>镜像文件</em>中可以包含更多的信息。比如说系统文件、引导文件、分区表信息等,这样<em>镜像文件</em>就可以包含一个分区甚至是一块硬盘的所有信息。而通常意义上的刻录软件都可以直...
制作光盘镜像文件制作光盘镜像文件
制作光盘<em>镜像文件</em>制作光盘<em>镜像文件</em>制作光盘<em>镜像文件</em>制作光盘<em>镜像文件</em>
docker-compose 文件
<em>docker-compose</em> 文件。 docker 技术,使用dockercomposer 一键安装 lnmp环境
docker-compose介绍
本课程主要讲解docker应用,k8s集群部署,集群监控套件,集群DNS,企业级容器仓库集群部署,ingress部署,K8S对接Glusterfs分布式存储等
docker-compose 1.20
<em>docker-compose</em> v 1.20, 下载自github, 方便下载, .....................................................................................................................................................................................
Docker-compose安装
NULL 博文链接:https://crabdave.iteye.com/blog/2359617
开发环境的docker-compose
  在我们开发的时候经常会引入很多新的中间件,但是有时候我们就很疲惫推动开发环境的安装。因为所有开发都需要安装本地环境,但是每一次启动的时候都需要点击很多个bin的start命令。虽然编写一个脚本来解决这个问题,但是管理还是比较麻烦,环境隔离性很差,卸载一个中间件也不方便。   虽然之前anli过一次<em>docker-compose</em>,但是后续没有跟进,现在做了一个<em>docker-compose</em>的例子 ...
运行QTP时,点击“Blank Test”报错
<em>运行</em>QTP时,点击“Blank Test”<em>报错</em>:库没有注册rnrn大家帮帮忙啊,急用啊!谢谢了啊!rn
运行 jar 包时,使用 File 报错
在<em>运行</em>jar包时,通过 getClass().getClassLoader.getResource(&quot;filename&quot;).getFile() 获得的文件路径采用的是:jar:&amp;lt;url&amp;gt;!/{entry},不能被 File 找到,所以需要采用数据流的形式getClass().getClassLoader.getResource(&quot;filename&quot;).openStream()即可。 以...
运行jsp时报错(sturs+tomcat),求救啊!
javax.servlet.ServletException: javax.servlet.jsp.tagext.TagAttributeInfo.(Ljava/lang/String;ZLjava/lang/String;ZZ)Vrn org.apache.jasper.servlet.JspServlet.service(JspServlet.java:244)rn javax.servlet.http.HttpServlet.service(HttpServlet.java:853)rnrnrnroot cause rnrnjava.lang.NoSuchMethodError: javax.servlet.jsp.tagext.TagAttributeInfo.(Ljava/lang/String;ZLjava/lang/String;ZZ)Vrn org.apache.jasper.compiler.TagLibraryInfoImpl.createAttribute(TagLibraryInfoImpl.java:568)rn org.apache.jasper.compiler.TagLibraryInfoImpl.createTagInfo(TagLibraryInfoImpl.java:401)rn org.apache.jasper.compiler.TagLibraryInfoImpl.parseTLD(TagLibraryInfoImpl.java:248)rn org.apache.jasper.compiler.TagLibraryInfoImpl.(TagLibraryInfoImpl.java:179)rn org.apache.jasper.compiler.Parser.parseTaglibDirective(Parser.java:418)rn org.apache.jasper.compiler.Parser.parseDirective(Parser.java:483)rn org.apache.jasper.compiler.Parser.parseElements(Parser.java:1539)rn org.apache.jasper.compiler.Parser.parse(Parser.java:126)rn org.apache.jasper.compiler.ParserController.doParse(ParserController.java:220)rn org.apache.jasper.compiler.ParserController.parse(ParserController.java:101)rn org.apache.jasper.compiler.Compiler.generateJava(Compiler.java:203)rn org.apache.jasper.compiler.Compiler.compile(Compiler.java:470)rn org.apache.jasper.compiler.Compiler.compile(Compiler.java:451)rn org.apache.jasper.compiler.Compiler.compile(Compiler.java:439)rn org.apache.jasper.JspCompilationContext.compile(JspCompilationContext.java:511)rn org.apache.jasper.servlet.JspServletWrapper.service(JspServletWrapper.java:295)rn org.apache.jasper.servlet.JspServlet.serviceJspFile(JspServlet.java:292)rn org.apache.jasper.servlet.JspServlet.service(JspServlet.java:236)rn javax.servlet.http.HttpServlet.service(HttpServlet.java:853)rnrn
rac安装GI时运行root.sh报错
<em>运行</em>root.sh脚本时,装跟踪文件解析时,<em>报错</em>解决办法: ln -s /lib64/libcap.so.2.16 /lib64/libcap.so.1
关于数据库的DTS:运行扩展存储时报错
在查询分析器中<em>运行</em>:exec master..xp_cmdshell 'dtsrun /Z~................................rn报以下错:rnoutputrn---------------------------------------------------------------------rnnullrnc:\winnt\system32>dtsrun /~Z....................................rn'dtsrun'不是内部或外部命令,也不是可<em>运行</em>的程序或批处理文件rnnullrnrnrn服务器是主域控制器,用系统帐号不能<em>运行</em>作业,因此不得已用SA<em>运行</em>外部存储过程。rn应该排除文件路径的问题。rn谢谢各位啦
myeclipse中导入项目时报错 不影响运行
<em>报错</em>信息: Multiple annotations found at this line: - schema_reference.4: Failed to read schema document 'http://www.osoa.org/xmlns/sca/1.0/spring-sca.xsd', because 1) could not find the documen...
spring boot 运行单元测试时,websocket报错
spring boot <em>运行</em>单元测试时,websocket<em>报错</em> SpringBootTest增加webEnvironment 参数: package com.hengyun.admin; import org.junit.Test; import org.junit.runner.RunWith; import org.springframework.boot.test.context.Sp...
tensorflow运行MINST手写数字识别时报错
<em>报错</em>:IOError: [Errno socket error] [Errno 8] _ssl.c:510: EOF occurred in violatio 解决办法:数据集链接下载失效,自己去下载数据集放在MINST_DATA就行
安装omnibus时 运行INSTALL文件报错
我在虚拟机安装了Linux系统,在Linux系统中安装omnibus,rn<em>运行</em>INSTALL文件时<em>报错</em>,缺少很多文件例如libstdc++.so.5,libnsSQLite等rnrn请问是什么原因 怎样解决
在android开发中,运行java文件时报错
Error:Gradle: Execution failed for task ':app:preDexDebug'.rn> com.android.ide.common.process.ProcessException: org.gradle.process.internal.ExecException: Process 'command 'C:\Program Files\Java\jdk1.8.0_25\bin\java.exe'' finished with non-zero exit value 1rnrnrnrn在线等rnpublic class socketusers rn public static void main(String args[]) rn try rn Socket s = new Socket("192.168.25.3", 2007);rn InputStream is = s.getInputStream();rn OutputStream os = s.getOutputStream();rn PrintStream ps = new PrintStream(os);rn ps.println("hey boy");rn DataInputStream dis = new DataInputStream(is);rn byte[] request=new byte[10];rn dis.read(request);rn System.out.println(request);rn catch (ConnectException e) rn System.out.println("异常" + e);rn catch (IOException eee) rn System.out.println("异常" + eee);rn catch (Exception ee) rn System.out.println("异常" + ee);rn rn rn
myeclipse10运行maven项目(maven build)时报错
![图片说明](https://img-ask.csdn.net/upload/201706/08/1496924569_684405.png)这就是我<em>运行</em>后控制台出现的内容" YangHui[Java Application ] D:\Program Files\Java\jdk1.6.0_35\bin\javaw. exe.其中jdk,tomcat,myeclipse10都是32位,但是电脑是64位;用myeclipse10启动web project完好,怎么破
运行java Web应用程序时 虚拟机报错
在调试web程序时,出现如下错误:rn[color=#800000]# An unexpected error has been detected by Java Runtime Environment:rn#rn# EXCEPTION_ACCESS_VIOLATION (0xc0000005) at pc=0x6d8cbbe0, pid=2592, tid=1200rn#rn# Java VM: Java HotSpot(TM) Client VM (10.0-b19 mixed mode windows-x86)rn# Problematic frame:rn# V [jvm.dll+0x5bbe0]rn#rn# An error report file with more information is saved as:rn# E:\java\apache-tomcat-6.0.14\bin\hs_err_pid2592.logrn#rn# If you would like to submit a bug report, please visit:rn# http://java.sun.com/webapps/bugreport/crash.jsp[/color]rnrnrntomcat下的日志内容如下:rnrn--------------- T H R E A D ---------------rnrnCurrent thread (0x46e82400): VMThread [stack: 0x46f10000,0x46f60000] [id=1200]rnrnsiginfo: ExceptionCode=0xc0000005, reading address 0x00000050rnrnRegisters:rnEAX=0x00000000, EBX=0x003fbdc4, ECX=0x00020009, EDX=0x00000000rnESP=0x46f5f7e8, EBP=0x003fbd38, ESI=0x448d9fe0, EDI=0x448d9fe0rnEIP=0x6d8cbbe0, EFLAGS=0x00010246rnrnTop of Stack: (sp=0x46f5f7e8)rn0x46f5f7e8: 448d9fe0 448d9fe0 00000000 6d9f05f0rn0x46f5f7f8: 6d88cbab 448d9fe0 46f5f844 46f5f844rnrnrnInstructions: (pc=0x6d8cbbe0)rn0x6d8cbbd0: 08 07 c1 e8 02 25 fe ff ff 3f 5e 59 c3 8b 11 56rn0x6d8cbbe0: ff 52 50 5e 59 c3 cc cc cc cc cc cc cc cc cc cc rnrnrnStack: [0x46f10000,0x46f60000], sp=0x46f5f7e8, free space=317krnNative frames: (J=compiled Java code, j=interpreted, Vv=VM code, C=native code)rnV [jvm.dll+0x5bbe0]rnrnVM_Operation (0x48bad9e4): GenCollectFull, mode: safepoint, requested by thread 0x47ad6800rnrnrn--------------- P R O C E S S ---------------rnrnJava Threads: ( => current thread )rn 0x47507400 JavaThread "Unknown thread" [_thread_blocked, id=416, stack(0x48c00000,0x48c50000)]rn 0x47334000 JavaThread "Unknown thread" daemon [_thread_blocked, id=616, stack(0x48bb0000,0x48c00000)]rn 0x47ad6800 JavaThread "http-8080-5" daemon [_thread_blocked, id=2240, stack(0x48b60000,0x48bb0000)]rn 0x47415800 JavaThread "Java2D Disposer" daemon [_thread_blocked, id=980, stack(0x48650000,0x486a0000)]rn 0x477f5400 JavaThread "http-8080-4" daemon [_thread_blocked, id=3332, stack(0x485f0000,0x48640000)]rn 0x47475c00 JavaThread "http-8080-3" daemon [_thread_blocked, id=1912, stack(0x485a0000,0x485f0000)]rn 0x4740f400 JavaThread "http-8080-2" daemon [_thread_blocked, id=4060, stack(0x48550000,0x485a0000)]rn rn 0x4781b400 JavaThread "http-8080-Acceptor-0" daemon [_thread_in_native, id=3752, stack(0x48320000,0x48370000)]rn 0x47746400 JavaThread "ContainerBackgroundProcessor[StandardEngine[Catalina]]" daemon [_thread_blocked, id=3964, stack(0x482d0000,0x48320000)]rn 0x47543000 JavaThread "com.mchange.v2.async.ThreadPoolAsynchronousRunner$PoolThread-#2" daemon [_thread_blocked, id=3216, stack(0x47a80000,0x47ad0000)]rn 0x47542000 JavaThread "com.mchange.v2.async.ThreadPoolAsynchronousRunner$PoolThread-#1" daemon [_thread_blocked, id=1136, stack(0x47a30000,0x47a80000)]rn 0x47541c00 JavaThread "com.mchange.v2.async.ThreadPoolAsynchronousRunner$PoolThread-#0" daemon [_thread_blocked, id=180, stack(0x479e0000,0x47a30000)]rn 0x4753e800 JavaThread "Timer-0" daemon [_thread_blocked, id=668, stack(0x47990000,0x479e0000)]rn 0x476df800 JavaThread "Thread-1" [_thread_in_native, id=2444, stack(0x47940000,0x47990000)]rn 0x46ec7400 JavaThread "Low Memory Detector" daemon [_thread_blocked, id=1152, stack(0x47280000,0x472d0000)]rn 0x46ebc400 JavaThread "CompilerThread0" daemon [_thread_blocked, id=2756, stack(0x47230000,0x47280000)]rn 0x46eae400 JavaThread "JDWP Command Reader" daemon [_thread_in_native, id=3764, stack(0x471e0000,0x47230000)]rn 0x46ead000 JavaThread "JDWP Event Helper Thread" daemon [_thread_blocked, id=3700, stack(0x47190000,0x471e0000)]rn 0x46eab000 JavaThread "JDWP Transport Listener: dt_socket" daemon [_thread_blocked, id=1388, stack(0x47140000,0x47190000)]rn 0x46e9a800 JavaThread "Attach Listener" daemon [_thread_blocked, id=2552, stack(0x47050000,0x470a0000)]rn 0x46eb1c00 JavaThread "Signal Dispatcher" daemon [_thread_blocked, id=1700, stack(0x47000000,0x47050000)]rn 0x46e89800 JavaThread "Finalizer" daemon [_thread_blocked, id=956, stack(0x46fb0000,0x47000000)]rn 0x46e85400 JavaThread "Reference Handler" daemon [_thread_blocked, id=2016, stack(0x46f60000,0x46fb0000)]rn 0x003f6400 JavaThread "main" [_thread_in_native, id=1108, stack(0x008d0000,0x00920000)]rnrnOther Threads:rn=>0x46e82400 VMThread [stack: 0x46f10000,0x46f60000] [id=1200]rn 0x46ec8c00 WatcherThread [stack: 0x472d0000,0x47320000] [id=3240]rnrnVM state:at safepoint (normal execution)rnrnVM Mutex/Monitor currently owned by a thread: ([mutex/lock_event])rn[0x003f5c80/0x0000ff10] Threads_lock - owner thread: 0x46e82400rn[0x003f5e20/0x0000fed0] Heap_lock - owner thread: 0x47ad6800rnrnHeaprn def new generation total 36352K, used 3343K [0x029d0000, 0x05140000, 0x07890000)rn eden space 32320K, 10% used [0x029d0000, 0x02d13c98, 0x04960000)rn from space 4032K, 0% used [0x04960000, 0x04960000, 0x04d50000)rn to space 4032K, 0% used [0x04d50000, 0x04d50000, 0x05140000)rn tenured generation total 483968K, used 27896K [0x07890000, 0x25130000, 0x429d0000)rn the space 483968K, 5% used [0x07890000, 0x093ce2c8, 0x08683400, 0x25130000)rn compacting perm gen total 34304K, used 34267K [0x429d0000, 0x44b50000, 0x469d0000)rn the space 34304K, 99% used [0x429d0000, 0x44b46df8, 0x44b29800, 0x44b50000)rnNo shared spaces configured.rnrnDynamic libraries:rn0x00400000 - 0x00423000 C:\Program Files\Java\jdk1.6.0_04\bin\javaw.exern0x7c920000 - 0x7c9b6000 C:\WINDOWS\system32\ntdll.dllrn0x7c800000 - 0x7c91e000 C:\WINDOWS\system32\kernel32.dllrn0x77da0000 - 0x77e49000 C:\WINDOWS\system32\ADVAPI32.dllrn0x77e50000 - 0x77ee2000 C:\WINDOWS\system32\RPCRT4.dllrn0x77fc0000 - 0x77fd1000 C:\WINDOWS\system32\Secur32.dllrn0x77d10000 - 0x77da0000 C:\WINDOWS\system32\USER32.dllrn0x77ef0000 - 0x77f39000 C:\WINDOWS\system32\GDI32.dllrn0x76300000 - 0x7631d000 C:\WINDOWS\system32\IMM32.DLLrn0x62c20000 - 0x62c29000 C:\WINDOWS\system32\LPK.DLLrn0x73fa0000 - 0x7400b000 C:\WINDOWS\system32\USP10.dllrn0x7c340000 - 0x7c396000 C:\Program Files\Java\jdk1.6.0_04\jre\bin\msvcr71.dllrn0x6d870000 - 0x6dac0000 C:\Program Files\Java\jdk1.6.0_04\jre\bin\client\jvm.dllrn0x76b10000 - 0x76b3a000 C:\WINDOWS\system32\WINMM.dllrn0x6d320000 - 0x6d328000 C:\Program Files\Java\jdk1.6.0_04\jre\bin\hpi.dllrn0x76bc0000 - 0x76bcb000 C:\WINDOWS\system32\PSAPI.DLLrn0x6d410000 - 0x6d439000 C:\Program Files\Java\jdk1.6.0_04\jre\bin\jdwp.dllrn0x6d770000 - 0x6d776000 C:\Program Files\Java\jdk1.6.0_04\jre\bin\npt.dllrn0x6d820000 - 0x6d82c000 C:\Program Files\Java\jdk1.6.0_04\jre\bin\verify.dllrn0x6d3c0000 - 0x6d3df000 C:\Program Files\Java\jdk1.6.0_04\jre\bin\java.dllrn0x6d860000 - 0x6d86f000 C:\Program Files\Java\jdk1.6.0_04\jre\bin\zip.dllrn0x6d290000 - 0x6d297000 C:\Program Files\Java\jdk1.6.0_04\jre\bin\dt_socket.dllrn0x71a20000 - 0x71a37000 C:\WINDOWS\system32\WS2_32.dllrn0x77be0000 - 0x77c38000 C:\WINDOWS\system32\msvcrt.dllrn0x71a10000 - 0x71a18000 C:\WINDOWS\system32\WS2HELP.dllrn0x719c0000 - 0x719fe000 C:\WINDOWS\System32\mswsock.dllrn0x76ef0000 - 0x76f17000 C:\WINDOWS\system32\DNSAPI.dllrn0x76f80000 - 0x76f88000 C:\WINDOWS\System32\winrnr.dllrn0x76f30000 - 0x76f5c000 C:\WINDOWS\system32\WLDAP32.dllrn0x76f90000 - 0x76f96000 C:\WINDOWS\system32\rasadhlp.dllrn0x60fd0000 - 0x61025000 C:\WINDOWS\system32\hnetcfg.dllrn0x71a00000 - 0x71a08000 C:\WINDOWS\System32\wshtcpip.dllrn0x6d620000 - 0x6d633000 C:\Program Files\Java\jdk1.6.0_04\jre\bin\net.dllrn0x68000000 - 0x68036000 C:\WINDOWS\system32\rsaenh.dllrn0x759d0000 - 0x75a7f000 C:\WINDOWS\system32\USERENV.dllrn0x5fdd0000 - 0x5fe25000 C:\WINDOWS\system32\netapi32.dllrn0x6d570000 - 0x6d579000 C:\Program Files\Java\jdk1.6.0_04\jre\bin\management.dllrn0x6d0b0000 - 0x6d1de000 C:\Program Files\Java\jdk1.6.0_04\jre\bin\awt.dllrn0x72f70000 - 0x72f96000 C:\WINDOWS\system32\WINSPOOL.DRVrn0x76990000 - 0x76acd000 C:\WINDOWS\system32\ole32.dllrn0x736d0000 - 0x7371b000 C:\WINDOWS\system32\ddraw.dllrn0x73b30000 - 0x73b36000 C:\WINDOWS\system32\DCIMAN32.dllrn0x6d2c0000 - 0x6d313000 C:\Program Files\Java\jdk1.6.0_04\jre\bin\fontmanager.dllrn0x6d640000 - 0x6d649000 C:\Program Files\Java\jdk1.6.0_04\jre\bin\nio.dllrn0x6d200000 - 0x6d22f000 C:\Program Files\Java\jdk1.6.0_04\jre\bin\cmm.dllrn0x6d460000 - 0x6d484000 C:\Program Files\Java\jdk1.6.0_04\jre\bin\jpeg.dllrnrnVM Arguments:rnjvm_args: -Dcatalina.home=E:\java\apache-tomcat-6.0.14 -Dcatalina.base=E:\java\apache-tomcat-6.0.14 -Djava.endorsed.dirs=E:\java\apache-tomcat-6.0.14/common/endorsed -Djava.io.tmpdir=E:\java\apache-tomcat-6.0.14\temp -Djava.library.path=C:\Program Files\Java\jdk1.6.0_04\bin;E:\java\apache-tomcat-6.0.14\bin -Dsun.io.useCanonCaches=false -Xms512M -Xmx1024M -agentlib:jdwp=transport=dt_socket,suspend=y,address=localhost:1695 rnjava_command: org.apache.catalina.startup.Bootstrap startrnLauncher Type: SUN_STANDARDrnrnEnvironment Variables:rnJAVA_HOME=C:\Program Files\Java\jdk1.6.0_04\binrnCLASSPATH=.;C:\Program Files\Java\jdk1.6.0_04\lib\dt.jar;C:\Program Files\Java\jdk1.6.0_04\lib\tools.jarrnPATH=C:\Program Files\Java\jdk1.6.0_04\jre\bin;E:\java\apache-tomcat-6.0.14\bin;C:\Program Files\Java\jdk1.6.0_04\bin\bin;F:\oracle\product\10.2.0\db_1\bin;F:\oracle\product\10.2.0\db_2\bin;C:\Program Files\Java\jdk1.6.0_04\bin;C:\WINDOWS\system32;C:\WINDOWS;C:\WINDOWS\System32\Wbem;C:\Program Files\TortoiseSVN\bin;C:\Program Files\Common Files\Thunder Network\KanKan\Codecs;d:\Program Files\Rational\common;C:\Program Files\MySQL\MySQL Server 5.0\bin;C:\Program Files\CVSNT\;d:\Program Files\StormII\Codec;d:\Program Files\StormIIrnUSERNAME=AdministratorrnOS=Windows_NTrnPROCESSOR_IDENTIFIER=x86 Family 6 Model 15 Stepping 13, GenuineIntelrnrnrnrnrnrn
运行.java文件时老是报错,急
"wellcomeFrame1.java": Error #: 475 : class Frame1 is public; must be declared in a file named Frame1.java at line 7, column 8rnrn从提示可以看出时因为class frame1 is public,但是我调不好。请高手帮忙
运行.Net时的一个报错问题
当我<em>运行</em>WebApplication的时候,报我一个错:rnrn 试图<em>运行</em>项目时出错:无法在Web服务器上启动调试,调试失败,因为没有启用集成Windows身份认证. rnrn我的IIS<em>运行</em>ASP是好的,怎么<em>运行</em>.NET就出问题拉....rn急啊..... 高手帮忙啊....
mono运行winform窗体时报错
在Linux上安装了mono<em>运行</em>环境,在终端输入命令执行exe程序时报一下错误rnUnhandled Exception:rnSystem.TypeInitializationException: An exception was thrown by the type initializer for System.Windows.Forms.XplatUI - System.Net.Sockets.SocketException: Access deniedrn at System.Net.Sockets.Socket.Connect (System.Net.EndPoint remoteEP) [0x00000] in :0 rn at System.Windows.Forms.XplatUIX11.SetDisplay (IntPtr display_handle) [0x00000] in :0 rn at System.Windows.Forms.XplatUIX11..ctor () [0x00000] in :0 rn at System.Windows.Forms.XplatUIX11.GetInstance () [0x00000] in :0 rn at System.Windows.Forms.XplatUI..cctor () [0x00000] in :0 rn --- End of inner exception stack trace ---rn at System.Windows.Forms.Application.EnableVisualStyles () [0x00000] in :0 rn at WindowsApplication1.Program.Main () [0x00000] in :0 rn[ERROR] FATAL UNHANDLED EXCEPTION: System.TypeInitializationException: An exception was thrown by the type initializer for System.Windows.Forms.XplatUI - System.Net.Sockets.SocketException: Access deniedrn at System.Net.Sockets.Socket.Connect (System.Net.EndPoint remoteEP) [0x00000] in :0 rn at System.Windows.Forms.XplatUIX11.SetDisplay (IntPtr display_handle) [0x00000] in :0 rn at System.Windows.Forms.XplatUIX11..ctor () [0x00000] in :0 rn at System.Windows.Forms.XplatUIX11.GetInstance () [0x00000] in :0 rn at System.Windows.Forms.XplatUI..cctor () [0x00000] in :0 rn --- End of inner exception stack trace ---rn at System.Windows.Forms.Application.EnableVisualStyles () [0x00000] in :0 rn at WindowsApplication1.Program.Main () [0x00000] in :0rnrn有人遇到过吗?不知道是mono<em>运行</em>winform窗体所需要的依赖环境没装好,还是Linux系统设置问题
运行程序,访问数据库时,报错
出错信息: rn<em>运行</em>时错误'2147467259(80004005)' rnCould not update;currently locked.rn
ecilipse运行Android项目时报错
上次360安全卫士报有病毒文件,文件名有点像这个ecilpsevr.exe删除后,<em>运行</em>java程序正常,<em>运行</em>android程序就<em>报错</em>。重装ecilpse依旧如此,检查环境配置都没问题,avd,sdk manager加载也都正常。请问高人怎么解决?电脑配置有点低又装不了androidstudio![图片说明](https://img-ask.csdn.net/upload/201801/15/1516028811_776344.png)
CENTOS6.5安装Oracle时运行runInstaller报错
求助大能如何解决,libXp包已经装了。n错误提示如下:n[oracle@localhost database]$ ./runInstaller nStarting Oracle Universal Installer...nnChecking installer requirements...nnChecking operating system version: must be redhat-3, SuSE-9, redhat-4, UnitedLinux-1.0, asianux-1 or asianux-2n PassednnnAll installer requirements met.nnPreparing to launch Oracle Universal Installer from /tmp/OraInstall2014-12-16_12-24-41AM. Please wait ...[oracle@localhost database]$ Exception in thread "main" java.lang.UnsatisfiedLinkError: /tmp/OraInstall2014-12-16_12-24-41AM/jre/1.4.2/lib/i386/libawt.so: /usr/lib/libXp.so.6: undefined symbol: _XEatDataWordsn at java.lang.ClassLoader$NativeLibrary.load(Native Method)n at java.lang.ClassLoader.loadLibrary0(Unknown Source)n at java.lang.ClassLoader.loadLibrary(Unknown Source)n at java.lang.Runtime.loadLibrary0(Unknown Source)n at java.lang.System.loadLibrary(Unknown Source)n at sun.security.action.LoadLibraryAction.run(Unknown Source)n at java.security.AccessController.doPrivileged(Native Method)n at sun.awt.NativeLibLoader.loadLibraries(Unknown Source)n at sun.awt.DebugHelper.(Unknown Source)n at java.awt.Component.(Unknown Source)
Loadrunner运行大于5000vuser时报错
<em>运行</em>场景时,报如下错误: The load generator is currently running the maximum number of Vusers of this type解决方法:
Android studio运行java程序时一直报错
android studio<em>运行</em>java程序时一直<em>报错</em>
运行Python时中文注释报错的解决办法
比如csdn.py,输入中文注释,<em>运行</em>时<em>报错</em>。   在开头加上: #!/usr/bin/python # -*- coding:utf8 -*- 再<em>运行</em>就不<em>报错</em>了。
delphi 运行报错File not found: 'MSHTML_TLB.dcu'
File not found: 'MSHTML_TLB.dcu'这个 错误 怎么解决 急求
运行程序时,运行到Application.Initialize;时报错
<em>报错</em>信息如下:rnException EAccessViolation in module xxxx.exe at 32392200rnAccess violation at address 32393200. Read of address 32393200rnrn这是别人的程序,让我来修改。在他的电脑编译<em>运行</em>正常,在我这里就不行了。rn这会哪些原因造成的?rn编译环境:delphi 6,第三方的控件也都已经安装好了。rnrn谢谢。
MyEclipse中运行web项目时报错
用Tomcat部署一个MyEclipse的web项目(关于 Spring S),<em>运行</em>启动服务器后出现rnrnrn2010-7-15 14:49:30 org.apache.catalina.core.AprLifecycleListener initrn信息: The APR based Apache Tomcat Native library which allows optimal performance in production environments was not found on the java.library.path: C:\Program Files\Java\jre1.6.0_02\bin;D:\tomcat-6.0.16\binrn2010-7-15 14:49:31 org.apache.coyote.http11.Http11Protocol initrn信息: Initializing Coyote HTTP/1.1 on http-8080rn2010-7-15 14:49:31 org.apache.catalina.startup.Catalina loadrn信息: Initialization processed in 1636 msrn2010-7-15 14:49:31 org.apache.catalina.core.StandardService startrn信息: Starting service Catalinarn2010-7-15 14:49:31 org.apache.catalina.core.StandardEngine startrn信息: Starting Servlet Engine: Apache Tomcat/6.0.16rn2010-7-15 14:49:35 org.apache.catalina.core.ApplicationContext logrn信息: Initializing WebApplicationContext for Struts ActionServlet 'action', module ''rn#rn# An unexpected error has been detected by Java Runtime Environment:rn#rn# EXCEPTION_ACCESS_VIOLATION (0xc0000005) at pc=0x6d89630d, pid=2780, tid=3668rn#rn# Java VM: Java HotSpot(TM) Client VM (1.6.0_02-b06 mixed mode, sharing)rn# Problematic frame:rn# V [jvm.dll+0xd630d]rn#rn# An error report file with more information is saved as hs_err_pid2780.logrn#rn# If you would like to submit a bug report, please visit:rn# http://java.sun.com/webapps/bugreport/crash.jsprn#rnrnrn服务器就自动停止启动了~~rn请问这是为什么.......?
citrix XenApp 运行discovery时,报错(转载)
转载出处:http://whitecastle.blog.51cto.com/414644/236861   当使用控制台discovery时,报告如下问题 the rpc server cannot be contacted on server 10.132.1.75 解决办法:结束“任务管理器”中的进程ConfigMgrSvr.exe, 再discovery. Locate Conf...
运行hadoop fs -put 命令时报错
[root@hadoop1 桌面]# hadoop dfs -put /home/hadoop/word.txt /tmp/wordcount/word5.txt出现的错误  3/05/02 18:11:26 WARN hdfs.DFSClient: DataStreamer Exception: org.apache.hadoop.ipc.RemoteException: java.io.IO
【ng2】运行 ng serve --open 时报错
问题:<em>运行</em> ng serve –open 时<em>报错</em>解决方法: 删除node_modules,再重新安装 1、rm -r node_modules 2、npm install 淘宝cnpm安装 npm install -g cnpm –registry=https://registry.npm.taobao.org
运行npm-run-dev时报错,应该是import和export
如何。看的教学视频,视频里的老师这样写就没事,我一写就<em>报错</em>。在app.vue中引入components/header/header.vue这个组件。系统<em>报错</em>,怎么都搞不好。。。。
字符转换数字时,运行程序,系统报错
rnpublic class Test rn public static void main(String[] args) rn // TODO Auto-generated method stubrn byte[] buf=new byte[10];rn tryrn System.in.read(buf); rn catch(Exception e)rn e.printStackTrace();rn rn String str=new String(buf); rn System.out.println(str);rn int num=Integer.parseInt(str);rn System.out.println(num);rn rnrn该程序执行后报java.lang.NumberFormatException:For input string:"3" rn这是为什么啊,如果我把str=“123”,这个时候是正确的,难道是我的输入不对吗?rn rn
Tomcat运行servlet时报错404
这是我的目录结构d:/Program files/Apache Software Foundation/Tomcat 6.0/webapps/[color=#FF0000]myapp/[/color]rnmyapp是我自己创建的文件夹 里面有WEB-INF文件夹 WEB-INF里有web-xml和一个classes文件夹 rnclasses文件夹里放的servlet: Test.java和Test.class 编译没问题rn以上从myapp开始都是自己创建的rnrnweb-xml是这样:rnrnrnrnrnrn rn My Web Application rnrnA application for test.rnrnrn Test rn Test rn A test Servlet rn Test rnrnrn Test rn /Test rnrn rnrn从浏览器输入http://localhost:8080/myapp/Test rn一直<em>报错</em>404 我知道多半是路径的问题找不到TEST <em>运行</em>TOMCAT的例子都是正常rn但实在看不出来哪里写错了 谢谢!
运行项目时报错,求指导
严重: A child container failed during startrnjava.util.concurrent.ExecutionException: org.apache.catalina.LifecycleException: Failed to start component [StandardEngine[Catalina].StandardHost[localhost].StandardContext[/test]]rn at java.util.concurrent.FutureTask.report(Unknown Source)rn at java.util.concurrent.FutureTask.get(Unknown Source)rn at org.apache.catalina.core.ContainerBase.startInternal(ContainerBase.java:1119)rn at org.apache.catalina.core.StandardHost.startInternal(StandardHost.java:819)rn at org.apache.catalina.util.LifecycleBase.start(LifecycleBase.java:147)rn at org.apache.catalina.core.ContainerBase$StartChild.call(ContainerBase.java:1571)rn at org.apache.catalina.core.ContainerBase$StartChild.call(ContainerBase.java:1561)rn at java.util.concurrent.FutureTask.run(Unknown Source)rn at java.util.concurrent.ThreadPoolExecutor.runWorker(Unknown Source)rn at java.util.concurrent.ThreadPoolExecutor$Worker.run(Unknown Source)rn at java.lang.Thread.run(Unknown Source)rnCaused by: org.apache.catalina.LifecycleException: Failed to start component [StandardEngine[Catalina].StandardHost[localhost].StandardContext[/test]]rn at org.apache.catalina.util.LifecycleBase.start(LifecycleBase.java:153)rn ... 6 morernCaused by: java.lang.IllegalArgumentException: The servlets named [com.tst.a] and [com.tst.t.A] are both mapped to the url-pattern [/a] which is not permittedrn at org.apache.catalina.deploy.WebXml.addServletMapping(WebXml.java:293)rn at org.apache.catalina.startup.ContextConfig.processAnnotationWebServlet(ContextConfig.java:2460)rn at org.apache.catalina.startup.ContextConfig.processAnnotationsStream(ContextConfig.java:2135)rn at org.apache.catalina.startup.ContextConfig.processAnnotationsFile(ContextConfig.java:2096)rn at org.apache.catalina.startup.ContextConfig.processAnnotationsFile(ContextConfig.java:2088)rn at org.apache.catalina.startup.ContextConfig.processAnnotationsFile(ContextConfig.java:2088)rn at org.apache.catalina.startup.ContextConfig.processAnnotationsFile(ContextConfig.java:2088)rn at org.apache.catalina.startup.ContextConfig.webConfig(ContextConfig.java:1302)rn at org.apache.catalina.startup.ContextConfig.configureStart(ContextConfig.java:887)rn at org.apache.catalina.startup.ContextConfig.lifecycleEvent(ContextConfig.java:387)rn at org.apache.catalina.util.LifecycleSupport.fireLifecycleEvent(LifecycleSupport.java:117)rn at org.apache.catalina.util.LifecycleBase.fireLifecycleEvent(LifecycleBase.java:90)rn at org.apache.catalina.core.StandardContext.startInternal(StandardContext.java:5503)rn at org.apache.catalina.util.LifecycleBase.start(LifecycleBase.java:147)rn ... 6 morernrn十月 09, 2016 10:37:44 下午 org.apache.catalina.core.ContainerBase startInternalrn严重: A child container failed during startrnjava.util.concurrent.ExecutionException: org.apache.catalina.LifecycleException: Failed to start component [StandardEngine[Catalina].StandardHost[localhost]]rn at java.util.concurrent.FutureTask.report(Unknown Source)rn at java.util.concurrent.FutureTask.get(Unknown Source)rn at org.apache.catalina.core.ContainerBase.startInternal(ContainerBase.java:1119)rn at org.apache.catalina.core.StandardEngine.startInternal(StandardEngine.java:300)rn at org.apache.catalina.util.LifecycleBase.start(LifecycleBase.java:147)rn at org.apache.catalina.core.StandardService.startInternal(StandardService.java:444)rn at org.apache.catalina.util.LifecycleBase.start(LifecycleBase.java:147)rn at org.apache.catalina.core.StandardServer.startInternal(StandardServer.java:756)rn at org.apache.catalina.util.LifecycleBase.start(LifecycleBase.java:147)rn at org.apache.catalina.startup.Catalina.start(Catalina.java:693)rn at sun.reflect.NativeMethodAccessorImpl.invoke0(Native Method)rn at sun.reflect.NativeMethodAccessorImpl.invoke(Unknown Source)rn at sun.reflect.DelegatingMethodAccessorImpl.invoke(Unknown Source)rn at java.lang.reflect.Method.invoke(Unknown Source)rn at org.apache.catalina.startup.Bootstrap.start(Bootstrap.java:294)rn at org.apache.catalina.startup.Bootstrap.main(Bootstrap.java:428)rnCaused by: org.apache.catalina.LifecycleException: Failed to start component [StandardEngine[Catalina].StandardHost[localhost]]rn at org.apache.catalina.util.LifecycleBase.start(LifecycleBase.java:153)rn at org.apache.catalina.core.ContainerBase$StartChild.call(ContainerBase.java:1571)rn at org.apache.catalina.core.ContainerBase$StartChild.call(ContainerBase.java:1561)rn at java.util.concurrent.FutureTask.run(Unknown Source)rn at java.util.concurrent.ThreadPoolExecutor.runWorker(Unknown Source)rn at java.util.concurrent.ThreadPoolExecutor$Worker.run(Unknown Source)rn at java.lang.Thread.run(Unknown Source)rnCaused by: org.apache.catalina.LifecycleException: A child container failed during startrn at org.apache.catalina.core.ContainerBase.startInternal(ContainerBase.java:1127)rn at org.apache.catalina.core.StandardHost.startInternal(StandardHost.java:819)rn at org.apache.catalina.util.LifecycleBase.start(LifecycleBase.java:147)rn ... 6 morernrn十月 09, 2016 10:37:44 下午 org.apache.catalina.startup.Catalina startrn严重: The required Server component failed to start so Tomcat is unable to start.rnorg.apache.catalina.LifecycleException: Failed to start component [StandardServer[8005]]rn at org.apache.catalina.util.LifecycleBase.start(LifecycleBase.java:153)rn at org.apache.catalina.startup.Catalina.start(Catalina.java:693)rn at sun.reflect.NativeMethodAccessorImpl.invoke0(Native Method)rn at sun.reflect.NativeMethodAccessorImpl.invoke(Unknown Source)rn at sun.reflect.DelegatingMethodAccessorImpl.invoke(Unknown Source)rn at java.lang.reflect.Method.invoke(Unknown Source)rn at org.apache.catalina.startup.Bootstrap.start(Bootstrap.java:294)rn at org.apache.catalina.startup.Bootstrap.main(Bootstrap.java:428)rnCaused by: org.apache.catalina.LifecycleException: Failed to start component [StandardService[Catalina]]rn at org.apache.catalina.util.LifecycleBase.start(LifecycleBase.java:153)rn at org.apache.catalina.core.StandardServer.startInternal(StandardServer.java:756)rn at org.apache.catalina.util.LifecycleBase.start(LifecycleBase.java:147)rn ... 7 morernCaused by: org.apache.catalina.LifecycleException: Failed to start component [StandardEngine[Catalina]]rn at org.apache.catalina.util.LifecycleBase.start(LifecycleBase.java:153)rn at org.apache.catalina.core.StandardService.startInternal(StandardService.java:444)rn at org.apache.catalina.util.LifecycleBase.start(LifecycleBase.java:147)rn ... 9 morernCaused by: org.apache.catalina.LifecycleException: A child container failed during startrn at org.apache.catalina.core.ContainerBase.startInternal(ContainerBase.java:1127)rn at org.apache.catalina.core.StandardEngine.startInternal(StandardEngine.java:300)rn at org.apache.catalina.util.LifecycleBase.start(LifecycleBase.java:147)rn ... 11 morernrn十月 09, 2016 10:37:44 下午 org.apache.coyote.AbstractProtocol pausern信息: Pausing ProtocolHandler ["http-bio-8080"]rn十月 09, 2016 10:37:44 下午 org.apache.coyote.AbstractProtocol pausern信息: Pausing ProtocolHandler ["ajp-bio-8009"]rn十月 09, 2016 10:37:44 下午 org.apache.catalina.core.StandardService stopInternalrn信息: Stopping service Catalinarn十月 09, 2016 10:37:44 下午 org.apache.coyote.AbstractProtocol destroyrn信息: Destroying ProtocolHandler ["http-bio-8080"]rn十月 09, 2016 10:37:44 下午 org.apache.coyote.AbstractProtocol destroyrn信息: Destroying ProtocolHandler ["ajp-bio-8009"]rn[img=https://img-bbs.csdn.net/upload/201610/09/1476023549_156946.jpg][/img]
railsinstaller-3.0.0安装 运行rails server时报错
[img=https://img-bbs.csdn.net/upload/201308/06/1375757548_195149.jpg][/img]rnrn[img=https://img-bbs.csdn.net/upload/201308/06/1375757558_536291.jpg][/img]rnrn[img=https://img-bbs.csdn.net/upload/201308/06/1375757713_546308.jpg][/img]rnrn[img=https://img-bbs.csdn.net/upload/201308/06/1375757756_612260.jpg][/img]rnrn情况就是这样了,我该怎么做?rn谢谢大家了。
tomcat运行web项目时报错,求大神
HTTP Status 500 - java.lang.IllegalStateException: No Java compiler availablernrn--------------------------------------------------------------------------------rnrntype Exception reportrnrnmessage java.lang.IllegalStateException: No Java compiler availablernrndescription The server encountered an internal error that prevented it from fulfilling this request.rnrnexception rnrnorg.apache.jasper.JasperException: java.lang.IllegalStateException: No Java compiler availablern org.apache.jasper.servlet.JspServletWrapper.handleJspException(JspServletWrapper.java:538)rn org.apache.jasper.servlet.JspServletWrapper.service(JspServletWrapper.java:364)rn org.apache.jasper.servlet.JspServlet.serviceJspFile(JspServlet.java:313)rn org.apache.jasper.servlet.JspServlet.service(JspServlet.java:260)rn javax.servlet.http.HttpServlet.service(HttpServlet.java:717)rnrn
报错运行 parcel 时,出现 No entries found 报错怎么办?
把./node_modules/.bin/parcel 改成./node_modules/.bin/parcel index.html 即可
MVC5+EF6创建控制器时报错运行所选代码生成器时出错.....
我们老师最近让我们用MVC5写个网页,这其中涉及到了数据库的链接,我是在vs2013上创建的本地数据源,但是我在为模型类创建控制器时试了好多次都不成功,在这方面我也是个新手,看了好多帖子都不行,具体<em>报错</em>如下图rn[img=https://img-bbs.csdn.net/upload/201611/21/1479730120_553752.png][/img]
asp.netMVC 创建控制器时报错运行所选代码生成器时出错
新手上路,在自学一个微软官方教程:MvcMusicStore.rn问题描述:在创建一个MVC控制器(带读写,使用EF)[img=https://img-bbs.csdn.net/upload/201605/18/1463541163_174925.png][/img]rn[img=https://img-bbs.csdn.net/upload/201605/18/1463541334_446223.png][/img]rn请问要如何解决或者问题出在哪里。我审查了album,MusicStoreEntities这两个类,都没写错。rn挺急的,卡在这两天了。。。。。
原型设计的快速方法docker-compose
导读 在这篇文章中,我们将考察一个 Node.js 开发原型,该原型用于从英国三个主要折扣网店查找“Raspberry PI Zero”的库存。我写好了代码,然后经过一晚的鼓捣把它部署在 Aure 上的 Ubuntu 虚拟机上。Docker 和 <em>docker-compose</em> 工具使得部署和更新过程非常快。 还记得链接指令(link)吗? 如果你已经阅读过 Hands-on D
docker-compose实现EFK日志监控
注:filebeat没有分析功能,由于没有logstash的字段分析和解析功能,所有的日志最好都是json格式。 EFK是elastic三个组件的简称,分别是 elasticsearch、filebeat和 kibana。三个组件都非常强大,这里作为练习和小项目的分析只运用一些简单功能。【elastic官网地址】 <em>docker-compose</em> 是一个用户定义和<em>运行</em>多个容器的 Docker 应用...
十、docker三剑客(docker-compose
<em>docker-compose</em>简介 Compose项目来源于之前的fig项目,使用python语言编写,与docker/swarm配合度很高。 Compose 是 Docker 容器进行编排的工具,定义和<em>运行</em>多容器的应用,可以一条命令启动多个容器,使用Docker Compose不再需要使用shell脚本来启动容器。 <em>docker-compose</em>安装 方法一: #下载 sudo cur...
docker-compose mysql源码
可以直接打包出mysql镜像包,能够作为基础镜像包使用,
09_docker的docker-compose安装
fabric 是区块链技术的一种实现,比特币是可以在fabric上构建的一种简单应用。它通过模块化的架构来允许组件的“插入-<em>运行</em>”来实现这份协议规范。它具有强大的容器技术来支持任何主流的语言来开发智能合约。利用熟悉的和被证明的技术是fabric的座右铭。
安装docker-ce及docker-compose 的脚本
一步安装 docker-ce 及 <em>docker-compose</em> 的脚本,功能如下: 1、卸载旧版本 2、安装需要的依赖软件包 3、设置 yum 源,使用清华镜像仓库,速度很快 4、安装 docker-ce 5、安装<em>docker-compose</em>,从国内镜像 get.daocloud.io 快速下载 6、添加 docker 国内镜像站点并重启docker 由于采用了国内镜像进行docker-ce、<em>docker-compose</em>的安装,所以下载速度和国外站点比,速度飞快。
Docker-compose一键安装脚本
适合于CentOS和RHEL,下载后给其权限,<em>运行</em>就可以一键自动安装Docker-compose
记录,docker-compose基础配置
version: '3' services:     nginx:             image: nginx             ports:                 - '80:80'                 - '443:443'             volumes:                 - /data/nginx/conf/nginx.conf:/...
docker-compose常用命令及配置文件详解
1 -f: 标识用于指定Compose的配置文件,可以指定多个,当没有使用-f标识时,默认在项目跟目录及其子目录下寻找<em>docker-compose</em>.yml和<em>docker-compose</em>.override.yml文件,至少需要存在<em>docker-compose</em>.yml文件 2 <em>docker-compose</em> build命令用来创建或重新创建服务使用的镜像,后面指定的是服务的名称,创建之后的镜像名为pr...
docker-compose的一些理解
开始不是很理解 <em>docker-compose</em> up 这个命令在干嘛,以为每次<em>运行</em>这条命令的额时候,都会生成新的container,如果启动多次,岂不是有很多镜像的全新实例跑在宿主机中?其实不是这样的<em>docker-compose</em>官方文档中有这么一段话 Preserve volume data when containers are cre...
非常规的方法安装docker-compose
场景:当你利用官方文档中的命令在你的宿主机上苦苦的等待乌龟一样的速度的时候,你是不是有种想砸电脑的冲动呢?GG呀,只有几M的东东,竟然要30分钟或者以上。如何能忍受呢?怎么破? 解决之道: 1、查看<em>docker-compose</em>官网最新的安装包,地址: <em>docker-compose</em>官方网站 。我看到是如图版本: 2、注意看上图红框中的两条命令,如果你自认为自己的网速很牛逼的,直
安装docker-compose的两种方式
这里简单介绍下两种安装<em>docker-compose</em>的方式,第一种方式相对简单,但是由于网络问题,常常安装不上,并且经常会断开,第二种方式略微麻烦,但是安装过程比较稳定
docker-compose 文件配置选项
Docker compose 文件可用来配置 Docker 服务,它的默认路径是 ./<em>docker-compose</em>.yml(也可使用 .yaml 后缀)。正如 docker run 一样,在 Dockerfile 中指定的指令(如 CMD、EXPOSE 等),也就没必要在 <em>docker-compose</em>.yml 中再指定一遍。另外,也可以在配置值中使用 ${varname} 这样的语法来使用...
docker-compose demo1【网页计数器】
感觉只有自己写个demo一行行看才明白啊 Compose 项目是 Docker 官方的开源项目,负责实现对 Docker 容器集群的快速编排。 Compose 项目由 Python 编写,实现上调用了 Docker 服务提供的 API 来对容器进行管理。因此,只要所操作的平台支持 Docker API,就可以在其上利用 Compose 来进行编排管理。 服务 (service):一个应用...
官网docker-compose实例验证
靠,已经月底了,本打算整理一下,都TM的“舍弃”没了,啊啊啊啊啊啊啊啊啊啊啊啊啊啊啊啊啊啊啊啊啊啊啊啊啊啊啊啊 我的笔记,我的笔记,我的笔记,心好痛阿!!!! 好想扇我自己 10月31日 <em>docker-compose</em>  官网是重点 参考官网:https://docs.docker.com/compose/install/#prerequisites linux系统里安装
Docker-compose的安装与卸载
安装 sudo curl -L https://github.com/docker/compose/releases/download/1.13.0/<em>docker-compose</em>-`uname -s`-`uname -m` -o /usr/local/bin/<em>docker-compose</em>授权 sudo chmod +x /usr/local/bin/<em>docker-compose</em>查看安装后的版本
docker-compose理解与操作2
零基础实战docker技术,包括docker基础概念的理解、<em>镜像文件</em>制作、<em>docker-compose</em>容器编排、<em>镜像文件</em>管理等。课程案例来自linux基金会顶级开源项目edgexfoundry,属于docker技术应用实践。
镜像文件制作
<em>镜像文件</em>制作,分步奏,不同方法,讲解详细,容易学习。
msdos71镜像文件
这是一个MSDOS的镜像安装文件,里面有两个文件
Linux镜像文件
想要使用Linux系统的人,可以在这里找到各种系统
macOS.Mojave.10.14.4.x5.iso的镜像文件
这个资源很稀少,起码20个C币!!这里是黑苹果macOS.Mojave.10.14.4.x5.iso的<em>镜像文件</em>,可以直接用于VMware Workstation。
linux镜像文件
次为我分享的linux<em>镜像文件</em>百度云盘提取码,永久有效,欢迎下载
x86_ext2镜像文件
x86-ext2文件系统镜像(busybox版),可用于qemu或者kvm,etc,.
镜像文件问题
各位大虾,普通的文件能不能制作成<em>镜像文件</em>,若能:用什么工具?谢谢各位大虾!
创建镜像文件
  制作一般数据光盘<em>镜像文件</em>         光盘的格式一般称为 iso9660 ,这种格式一般仅支持旧版的 DOS 文件 名,亦即文件名只能以 8.3 (文件名8个字符,扩展名3个字符) 的方式存在。如果加上 -r 的选项之后,那么文件信息能够被记录的比较完整,可包括UID/GID与权限等等。        此外,一般默认的情况下,所有要被加到<em>镜像文件</em>中的文件都会被放置到<em>镜像文件</em>中的...
EXT3.0 JSP上传下载
EXT3.0实现文件上传EXT3.0实现文件上传EXT3.0实现文件上传EXT3.0实现文件上传EXT3.0实现文件上传EXT3.0实现文件上传 相关下载链接:[url=//download.csdn.net/download/jf886611/2220320?utm_source=bbsseo]//download.csdn.net/download/jf886611/2220320?utm_source=bbsseo[/url]
FoxitReader3.1下载
FoxitReader3.1 pdf 阅读器,小巧,好用,启动快, 比Adobe Reader好用 相关下载链接:[url=//download.csdn.net/download/yangjiegreat/2420571?utm_source=bbsseo]//download.csdn.net/download/yangjiegreat/2420571?utm_source=bbsseo[/url]
c语言程序设计课件下载
这是一个有关c语言的基础课件,非常适合自学者使用,喜欢就赶紧下载吧!心动不如行动哦! 相关下载链接:[url=//download.csdn.net/download/qq_16391777/7478099?utm_source=bbsseo]//download.csdn.net/download/qq_16391777/7478099?utm_source=bbsseo[/url]
相关热词 c# 去空格去转义符 c#用户登录窗体代码 c# 流 c# linux 可视化 c# mvc 返回图片 c# 像素空间 c# 日期 最后一天 c#字典序排序 c# 截屏取色 c#中的哪些属于托管机制
我们是很有底线的