VS2013+ GitHub 拉取数据是提示 An error was raised by libgit2. Category = Net (Error) [问题点数:50分,结帖人weisai]

Bbs4
本版专家分:1824
结帖率 95.02%
Bbs5
本版专家分:2617
Blank
GitHub 绑定GitHub第三方账户获取
Bbs5
本版专家分:2617
Blank
GitHub 绑定GitHub第三方账户获取
Bbs4
本版专家分:1824
Bbs4
本版专家分:1824
Bbs4
本版专家分:1824
C++应用之libgit2
通过我们在命令行终端中操作git库,进行版本控制。目前令人惊喜的是git居然有api可供外部开发人员使用,使用libgit2进行开发自定义的git功能了,牛!官网:https://<em>libgit2.</em><em>github</em>.com/,C、C#、Python、Qt等开发语言都支持;环境配置,编译和连接:https://<em>libgit2.</em><em>github</em>.com/docs/guides/build-and-link/可供...
python3.7.2使用web.py报错:generator raised StopIteration
运行出现 Traceback (most recent call last): File "D:\Program Files\Python\Python37\lib\site-packages\web\utils.py", line 526, in take yield next(seq) StopIteration The above exception was the direc...
vs2013报错error MSB8011
C:\Program Files (x86)\MSBuild\Microsoft.Cpp\v4.0\V120\Microsoft.CppCommon.targets(1620,5): <em>error</em> MSB8011: Failed to register output. Please try enabling Per-user Redirection or register the component from a command prompt with elevated permissions.
提示ERROR
test<em>提示</em>ERROR
数据窗口提示select error
在预览和运行时出现:rnselect <em>error</em>: data-conversion resulted is overflow。rn不知是表还是查询语句的问题。
Wince下的异常情况Alignment Error,Raised Exception
如题,在把程序下载到板子上运行完之后,关闭程序时打印如下出错信息rn263341 PID:3d40052 TID:2f0005a Exception 'Alignment Error' (4): Thread-Id=02f0005a(pth=882d8678), Proc-Id=03d40052(pprc=882d8418) 'Y=??ê;-???.exe', VM-active=03d40052(pprc=882d8418) 'Y=??ê;-???.exe'rn 263341 PID:3d40052 TID:2f0005a PC=00022184(Y=??ê;-???.exe+0x00012184) RA=0002216c(Y=??ê;-???.exe+0x0001216c) SP=0011e6a0, BVA=9e3d8539rn 263343 PID:400002 TID:2f0005a Exception 'Raised Exception' (-1): Thread-Id=02f0005a(pth=882d8678), Proc-Id=00400002(pprc=871b230c) 'NK.EXE', VM-active=03d40052(pprc=882d8418) 'Y=??ê;-???.exe'rn 263343 PID:400002 TID:2f0005a PC=c003ff70(k.coredll.dll+0x0001ff70) RA=8413d3b4(kernel.dll+0x000063b4) SP=dbfdee30, BVA=ffffffffrnrn哪位路过的好心人帮忙分析分析rn
error was raised by libgit2.dll. ..."">TFS + Git - 同步代码时遇到异常 "an error was raised by libgit2.dll. ..."
问题:使用TFS + Git 遇到,在同步代码时遇到如题错误原因:项目使用了NuGet引用,在.gitingore文件中没有忽略"packages"文件夹,导致git客户端无法正常同步。解决方法:取消如下注释.gitignore文件中已经有此注释:# NuGet Packages Directory## TODO: If you have NuGet Package Restore enabled
VS2017 发布到远程存储库时遇到错误:Git failed with a fatal error.
VS2017发布到远程存储库时遇到错误:Git failed with a fatal <em>error</em> 一、引言最近在配置新笔记本的工作环境的时候,下载安装了 VS2017 之后,在本地 Clone 了我挂靠在 GitHub 上面的 LeetCode 仓库。我在这个工作区中编辑了一些内容,然后想要提交(git push)的时候,弹出了一个 Git for Window 窗口要求我输入 GitHub 的账号和密码
log4j:ERROR Category option " 1 " not a decimal integer.错误解决
log4j.properties 的配置文件中: log4j.appender.stdout.layout.ConversionPattern = %d{ABSOLUTE} %5p %c{ 1 }:%L - %m%n 把{1}中的空格去掉。
Git checkout出现:The following untracked working tree files would be overwritten by checkout
当使用命令git checkout -b [MYBRANCH] [REMOTE_BRANCH] 用于创建一个新的本地分支并从远程分支拉取代码时出现:The following untracked working tree files would be overwritten by checkout 这是因为之前被删除的分支引起的工作树还有缓存的文件 解决办法: git clean -d -fx...
报错:log4j:ERROR Category option " 1 " not a decimal integer.
代码: package com.zml; import org.apache.log4j.Logger; public class Day01 { private static Logger logger = Logger.getLogger(Day01.class); public static void main(String[] args) { logg...
JS&Java 交互 报错 JavaException was raised during method Invocation
如上图所示当JS调用本地方法时报错,原因让人很容易忽略。在与JS交互的方法中不能直接操作View,需要放在主线程操作才能生效。如下代码所示: @JavascriptInterface public void setTitle(final String title) { HandlerUtil.runOnUiThread(new Runnable() { ...
Github 文件拉取 和 提交
前提,我已经配置好了 SSH key。 1、桌面新建 <em>github</em>-test\(拉取项目存放的目录),在此文件夹 右键 打开 Git Bash。 2、Git Bash 输入: $ git init 3、添加远程仓库: $ git remote add origin git@<em>github</em>.com:your-Name/project-name.git 4、测试 SSH Ke...
从 GitHub拉取项目
从GitHub下载项目时需要git 工具,所以先安装git工具 1. 安装git 1.1 从官网下载: https://git-scm.com/ 点击后会自动下载。 1.2 安装 双击下载下来的.exe文件,按默认点击Next进行安装 安装完成后在桌面的空百处,右击鼠标多了git gui 和Git bash 点击Git Bash,进入git 2. 从GitHub拉取项目 2.1 找到项目的...
vs2013编译qt程序 error MSB8020
错误 1 <em>error</em> MSB8020: The build tools for Visual Studio 2012 (Platform Toolset = 'v110') cannot be found. To build using the v110 build tools, please install Visual Studio 2012 build tools. Alternatively, you may upgrade to the current Visual Studio tools by selecting the Project menu or right-click the solution, and then selecting "Upgrade Solution...". C:\Program Files (x86)\MSBuild\Microsoft.Cpp\v4.0\V120\Microsoft.Cpp.Platform.targets 64 5 Projecttest002rn
求助!VS2013 fatal error RC1015
新手入门,刚装完<em>vs2013</em>,新建一个MFC,完成之后它立即就<em>提示</em>说 fatal <em>error</em> RC1015 找不到"afxres.h",我的系统是win7,rn百度了一下有的说是属性里面没弄清楚可是我弄完了还是不行的 <em>vs2013</em>重装过了没用rn项目的VC++目录分别为rn可执行文件目录 C:\Program Files %28x86%29\Microsoft SDKs\Windows\v7.1A\Bin;$(ExecutablePath)rn包含目录 C:\Program Files %28x86%29\Microsoft SDKs\Windows\v7.1A\Include;$(IncludePath)rn库目录 C:\Program Files %28x86%29\Microsoft SDKs\Windows\v7.1A\Lib;$(LibraryPath)rnrnrn[img=https://forum.csdn.<em>net</em>/PointForum/ui/scripts/csdn/Plugin/003/monkey/11.gif][/img]求助各位!!!!!!!
取oracle的error code
博文链接:https://clarancepeng.iteye.com/blog/118394
取@@ERROR永远都是0????
rnCREATE PROCEDURE dbo.ChkbuyersTimern rnASrn rndeclare @i int,@RA_User int,@RA_HighPrice int,@AL_Rate float,@str nvarchar(1000),@price int,@RA_Domain int,@RA_DomainUser int,@maxid intrnBEGIN TRANSACTION GetDataSetrnrn CREATE TABLE #TemporaryTable (rn Row int IDENTITY(1,1) PRIMARY KEY,rn RA_User int,RA_HighPrice int,RA_domain int,RA_DomainUser intrn )rn IF @@ERROR <> 0rn GOTO ErrorHandlerrnrn SET @str = ' INSERT INTO #TemporaryTable1 'rn rn SET @str = @str + ' SELECT [RA_User],[RA_HighPrice],[RA_Domain],[RA_DomainUser] FROM RivalAct join domains on (d_id = RA_Domain and D_user = RA_DomainUser) join domainsell on d_id = ds_domain where D_SellState =1 and DS_TradeType = 3 and RA_State = 1 and DATEDIFF (s,DATEADD(d,5,RA_Time),getdate())>=0 ' rn rn EXEC(@str)rn IF @@ERROR <> 0rn GOTO ErrorHandlerrnrn DROP TABLE #TemporaryTablern COMMIT TRANSACTION GetDataSetrn INSERT INTO Operate_Info (Operate_Name,Operate_State,Operate_Time) VALUES ('ChkbuyersTime','成功',getdate())rn RETURN 0rnrnErrorHandler:rnROLLBACK TRANSACTION GetDataSetrnINSERT INTO Operate_Info (Operate_Name,Operate_State,Operate_Time,Operate_Error) VALUES ('ChkbuyersTime','失败',getdate(),@@ERROR)rnRETURN @@ERRORrnGOrnrnrnrn为什么在失败时@@ERROR取出来还是0呢???
怎么取'msg':'error'?
js好像没有字典类型?
提示错误 error C2059: syntax error : ';'
n=0;rn pBrhOld = (CBrush *)pDC->SelectStockObject(NULL_BRUSH);//使画刷透明rn pDC->SelectObject(&pen_FenGeXian);rn if(!FYZBZHFLG)rn rn x = m_LevelClient.Height() / 30;rn y = m_LevelClient.Width() / 30;rn fRadius1 = _hypot(250, 250);//确定弧长rn fRadius2 = fRadius1 - 5.0;rn for(fAngl=0.0;fAnglrnError executing cl.exe.
提示Automation object error
Dim wordApplication As Variant rnSet wordApplication = GetObject("C:\Lotus\Document\开发说明书.doc","Word.Document.8")rnwordApplication.Visible = Truernrn请问改如何启动指定硬盘上的OFFICE文档,谢谢!
提示:debug error
vb中调试程序,弹出<em>提示</em>:rndebug <em>error</em>rnvb6.exerndamage:after normal block (#44) at 0x051f0040rnrn这是会是哪里出错啊rn我在程序中调用了自己写的dll
【VS2013】error C2059: 语法错误:“::” error C2589: “(”:“::”右边的非法标记
【VS2013】<em>error</em> C2059: 语法错误:“::” <em>error</em> C2589: “(”:“::”右边的非法标记
PHP $_FILES错误说明error 0,1,2,3,4,5,6,7
$_FILES['file']['<em>error</em>'] 其值为 0,没有错误发生,文件上传成功。  其值为 1,上传的文件超过了 php.ini 中 upload_max_filesize 选项限制的值。  其值为 2,上传文件的大小超过了 HTML 表单中 MAX_FILE_SIZE 选项指定的值。  其值为 3,文件只有部分被上传。  其值为 4,没有文件被上传。 
求助啊,VS2013运行 Error LNK2001 Error LNK2019
求助啊,小菜鸡一个见谅,对环境配置不太熟悉,百度了半天找了也找不出问题。有一段时间没用VS了,以前用着没问题,现在用C和C++写个最简单helloworld都运行不起来,cocos2d-x-2.2.3引擎却可以正常运行。。好像是后来安装了qt-opensource-windows-x86-msvc2013_64-5.7.0之后才出现的问题,不知道是不是QT改了什么设置。浪费了一天时间在这问题上了。。。rnrn[code=c]#include rnrnint main()rnrn printf("hello world");rn return 0;rn[/code]rnrn1>MSVCRTD.lib(crtexe.obj) : <em>error</em> LNK2019: 无法解析的外部符号 __imp__EncodePointer@4,该符号在函数 _pre_c_init 中被引用rn1>MSVCRTD.lib(atonexit.obj) : <em>error</em> LNK2001: 无法解析的外部符号 __imp__EncodePointer@4rn1>MSVCRTD.lib(<em>error</em>.obj) : <em>error</em> LNK2019: 无法解析的外部符号 __imp__IsDebuggerPresent@0,该符号在函数 "void __cdecl failwithmessage(void *,int,int,char const *)" (?failwithmessage@@YAXPAXHHPBD@Z) 中被引用rn1>MSVCRTD.lib(gs_report.obj) : <em>error</em> LNK2001: 无法解析的外部符号 __imp__IsDebuggerPresent@0rn1>MSVCRTD.lib(<em>error</em>.obj) : <em>error</em> LNK2019: 无法解析的外部符号 __imp__RaiseException@16,该符号在函数 "int __cdecl DebuggerProbe(unsigned long)" (?DebuggerProbe@@YAHK@Z) 中被引用rn1>MSVCRTD.lib(<em>error</em>.obj) : <em>error</em> LNK2019: 无法解析的外部符号 __imp__GetLastError@0,该符号在函数 "void __cdecl _RTC_AllocaFailure(void *,struct _RTC_ALLOCA_NODE *,int)" (?_RTC_AllocaFailure@@YAXPAXPAU_RTC_ALLOCA_NODE@@H@Z) 中被引用rn1>MSVCRTD.lib(pdblkup.obj) : <em>error</em> LNK2001: 无法解析的外部符号 __imp__GetLastError@0rn1>MSVCRTD.lib(<em>error</em>.obj) : <em>error</em> LNK2019: 无法解析的外部符号 __imp__GetProcAddress@8,该符号在函数 "void __cdecl _RTC_AllocaFailure(void *,struct _RTC_ALLOCA_NODE *,int)" (?_RTC_AllocaFailure@@YAXPAXPAU_RTC_ALLOCA_NODE@@H@Z) 中被引用rn1>MSVCRTD.lib(pdblkup.obj) : <em>error</em> LNK2001: 无法解析的外部符号 __imp__GetProcAddress@8rn1>MSVCRTD.lib(<em>error</em>.obj) : <em>error</em> LNK2019: 无法解析的外部符号 __imp__LoadLibraryExW@12,该符号在函数 "void __cdecl _RTC_AllocaFailure(void *,struct _RTC_ALLOCA_NODE *,int)" (?_RTC_AllocaFailure@@YAXPAXPAU_RTC_ALLOCA_NODE@@H@Z) 中被引用rn1>MSVCRTD.lib(pdblkup.obj) : <em>error</em> LNK2001: 无法解析的外部符号 __imp__LoadLibraryExW@12rn1>MSVCRTD.lib(<em>error</em>.obj) : <em>error</em> LNK2019: 无法解析的外部符号 __imp__MultiByteToWideChar@24,该符号在函数 "void __cdecl failwithmessage(void *,int,int,char const *)" (?failwithmessage@@YAXPAXHHPBD@Z) 中被引用rn1>MSVCRTD.lib(<em>error</em>.obj) : <em>error</em> LNK2019: 无法解析的外部符号 __imp__WideCharToMultiByte@32,该符号在函数 "void __cdecl failwithmessage(void *,int,int,char const *)" (?failwithmessage@@YAXPAXHHPBD@Z) 中被引用rn1>MSVCRTD.lib(gs_support.obj) : <em>error</em> LNK2019: 无法解析的外部符号 __imp__QueryPerformanceCounter@4,该符号在函数 ___security_init_cookie 中被引用rn1>MSVCRTD.lib(gs_support.obj) : <em>error</em> LNK2019: 无法解析的外部符号 __imp__GetCurrentProcessId@0,该符号在函数 ___security_init_cookie 中被引用rn1>MSVCRTD.lib(gs_support.obj) : <em>error</em> LNK2019: 无法解析的外部符号 __imp__GetCurrentThreadId@0,该符号在函数 ___security_init_cookie 中被引用rn1>MSVCRTD.lib(gs_support.obj) : <em>error</em> LNK2019: 无法解析的外部符号 __imp__GetSystemTimeAsFileTime@4,该符号在函数 ___security_init_cookie 中被引用rn1>MSVCRTD.lib(atonexit.obj) : <em>error</em> LNK2019: 无法解析的外部符号 __imp__DecodePointer@4,该符号在函数 __onexit 中被引用rn1>MSVCRTD.lib(pdblkup.obj) : <em>error</em> LNK2019: 无法解析的外部符号 __imp__HeapAlloc@12,该符号在函数 "int __cdecl _RTC_GetSrcLine(unsigned char *,wchar_t *,unsigned long,int *,wchar_t *,unsigned long)" (?_RTC_GetSrcLine@@YAHPAEPA_WKPAH1K@Z) 中被引用rn1>MSVCRTD.lib(pdblkup.obj) : <em>error</em> LNK2019: 无法解析的外部符号 __imp__HeapFree@12,该符号在函数 "int __cdecl _RTC_GetSrcLine(unsigned char *,wchar_t *,unsigned long,int *,wchar_t *,unsigned long)" (?_RTC_GetSrcLine@@YAHPAEPA_WKPAH1K@Z) 中被引用rn1>MSVCRTD.lib(pdblkup.obj) : <em>error</em> LNK2019: 无法解析的外部符号 __imp__GetProcessHeap@0,该符号在函数 "int __cdecl _RTC_GetSrcLine(unsigned char *,wchar_t *,unsigned long,int *,wchar_t *,unsigned long)" (?_RTC_GetSrcLine@@YAHPAEPA_WKPAH1K@Z) 中被引用rn1>MSVCRTD.lib(pdblkup.obj) : <em>error</em> LNK2019: 无法解析的外部符号 __imp__VirtualQuery@12,该符号在函数 "int __cdecl _RTC_GetSrcLine(unsigned char *,wchar_t *,unsigned long,int *,wchar_t *,unsigned long)" (?_RTC_GetSrcLine@@YAHPAEPA_WKPAH1K@Z) 中被引用rn1>MSVCRTD.lib(pdblkup.obj) : <em>error</em> LNK2019: 无法解析的外部符号 __imp__FreeLibrary@4,该符号在函数 "struct HINSTANCE__ * __cdecl GetPdbDllFromInstallPath(void)" (?GetPdbDllFromInstallPath@@YAPAUHINSTANCE__@@XZ) 中被引用rn1>MSVCRTD.lib(pdblkup.obj) : <em>error</em> LNK2019: 无法解析的外部符号 __imp__GetModuleFileNameW@12,该符号在函数 "struct HINSTANCE__ * __cdecl GetPdbDll(void)" (?GetPdbDll@@YAPAUHINSTANCE__@@XZ) 中被引用rn1>MSVCRTD.lib(pdblkup.obj) : <em>error</em> LNK2019: 无法解析的外部符号 __imp__GetModuleHandleW@4,该符号在函数 "struct HINSTANCE__ * __cdecl GetPdbDll(void)" (?GetPdbDll@@YAPAUHINSTANCE__@@XZ) 中被引用rn1>MSVCRTD.lib(gs_report.obj) : <em>error</em> LNK2019: 无法解析的外部符号 _IsProcessorFeaturePresent@4,该符号在函数 ___report_gsfailure 中被引用
HBase拉取数据和Spark拉取数据的区别
HBase架构图如下所示: HMaster:一个集群中有多个HMaster,但是只有一个处于Active状态。HMaster通过连接Zookeeper感知集群上哪些HRegionServer是活着的及它们所在的位置,然后管理RegionServer。 HRegionServer:就是一台服务器,一个RS会管理多个HRegion,每个HRegion有多个Store,每个Store对应一个列簇...
.Net runtime 2.0 Error
有一个程序,最近总是运行一两天就直接挂掉。rn看系统错误日志, 出现 faulting module kernel32.dll 的错误。(如图)rn[img=https://img-bbs.csdn.<em>net</em>/upload/201611/09/1478699435_736864.jpg][/img]rn然后我就用系统性能检测了我程序的private bytes 和 working set,下面是出现崩溃前后的使用情况。rn哪位帮分析下,这是什么情况。rnrn"11/09/2016 14:54:43.323","212262912","119775232"rn"11/09/2016 14:54:58.323","212852736","120365056"rn"11/09/2016 14:55:13.339","214102016","121094144"rn"11/09/2016 14:55:28.339","214700032","121630720"rn"11/09/2016 14:55:43.339","214175744","122490880"rn[color=#FF0000]"11/09/2016 14:55:58.340","215302144","247578624"rn"11/09/2016 14:56:13.340","215302144","256040960"rn"11/09/2016 14:56:28.340","215302144","264228864"rn"11/09/2016 14:56:43.341","215302144","267710464"rn"11/09/2016 14:56:58.341","215302144","276398080"rn"11/09/2016 14:57:13.341","215302144","288493568"rn"11/09/2016 14:57:28.341","215302144","292204544"rn"11/09/2016 14:57:43.342","215302144","296148992"rn"11/09/2016 14:57:58.342","215302144","300625920"rn"11/09/2016 14:58:13.342","215302144","310906880"rn"11/09/2016 14:58:28.343","215302144","313217024"[/color]rn"11/09/2016 14:58:43.343"," "," "rn"11/09/2016 14:58:58.343","46915584","39084032"rn"11/09/2016 14:59:13.343","60649472","41320448"rn"11/09/2016 14:59:28.344","80875520","43347968"rn"11/09/2016 14:59:43.344","140210176","72716288"rn"11/09/2016 14:59:58.344","147353600","77713408"rn"11/09/2016 15:00:13.345","172277760","82481152"rn"11/09/2016 15:00:28.345","189558784","88387584"rn"11/09/2016 15:00:43.345","192761856","90189824"rn"11/09/2016 15:00:58.345","193548288","91607040"rn"11/09/2016 15:01:13.346","193376256","92332032"rnrn
.NET Runtime 2.0 Error
IIS出现这个错误。rn怎么解决
.net 遇到权限Error
System.Security.SecurityException was unhandled Message="Request for the permission of type 'System.Security.Permissions.SecurityPermission, mscorlib, Version=2.0.0.0, Culture=neutral, PublicKeyToken=b77a5c561934e089' failed.”rnrn下面是引起错误的代码:rn Dim PDFFile As PDFFile = O2S.Components.PDFRender4NET.PDFFile.Open(filePath )rnrn是否是Server读取PDF文件权限不够,应该如何设置呀?
.net中的Compilation Error
在程序執行時會出現以下的錯誤:rnCompiler Error Message: CS0234: The type or namespace name 'Shared' does not exist in the class or namespace 'abc.WebUI' (are you missing an assembly reference?)rnabc是一個控件組的名稱rn請問上面錯誤 的原因是什麼rn該如何改正?rn在references中已有此控件的信息。rn
.net framework initialization error
我在win7下安装了VS2008、2010,但是运行devexpress7.2破解,<em>提示</em>unable to find a versionrnrnof the runtime to run this application.不知道为什么。 这个破解在XP下运行一点问题都没有。rnrn希望大家能帮我解决一下。
Parse error: parse error, unexpected $ 是怎么回事?
<em>提示</em>Parse <em>error</em>: parse <em>error</em>, unexpected $ in /usr/server/www/vhost/w18/zairwolf/bbs/nhbbsmanagers.php on line 106rn而这个106行就是我的最后一行。那里没有什么参数,只是定义结束呀。rnrnfunction showline2($name,$fname) rn global $tdtime;rn $useri=readuser($name,"bym,nowtime,money,amount");rn $bym=floor($useri[bym]/10);rn $disappear=floor(($tdtime-$useri[nowtime])/86400)+1;rn if($disappear>15) $pj="我超过半个月没来了";rn else $pj="我十五天之内有登陆";rn if($disappear<<$fname:$namern $useri[amount]rn $bymrn $useri[money]rn $lastloginrn $disappearrn $pjrn EOT;rn
vs2013下配置opencv2.4.9&openNI2提示错误:error LNK2019: 无法解析的外部符号
在使用RTM封装kinect代码时,编译遇到如下错误: 错误 11 <em>error</em> LNK2019: 无法解析的外部符号 __imp__oniInitialize,该符号在函数 “public: static enum openni::Status __cdecl openni::OpenNI::initialize(void)” (?initialize@OpenNI@openni@@SA?AW
vs2013 提示错误 34 error C2065: “VideoCapture”: 未声明的标识符
查看配置都是好的没问题,就是调用不了VideoCapture很是奇怪,怪粗心的忘加using namespace cv;这一句了,记录下。
on error goto 取存储过程的错误
在VB中写了on <em>error</em> go H<em>error</em>rnrn 但是在中间调用存储过程test,中间报错的时候(SQL里面用了RAISERROR可以看到返回的错误信息):下面的HERROR捕不到错误信息,请大合作帮忙!
Sourcetree如何从Github拉取项目
1.SourceTree是什么 拥有可视化界面的项目版本控制软件,适用于git项目管理 window、mac可用 2.获取项目代码(这里以GitHub为例) 添加账户 登陆你的GitHub账户 进度条变为绿色即为成功 拉取代码成功! ...
05.idea中拉取github项目到本地
徐培成通过通俗易懂得方式让你快速入门Github,全程大白话讲解,节省学习时间和成本。n购买课程后加入qq群 831186576 (备注订单号后四位)
拉取github的代码,上传到coding.net
在不FQ的情况下想到的是使用git fetch替代git clone,避免git clone失败后没有记录保存。 在git fetch完成后发现实际上可以先git remote add https://xxx.git 这样可以用快捷方式来操作。但是git fetch 在中断后也需要重新去fetch,采用下面的shell脚本去拖代码(还需要优化,如果成功后再去执行会重新fetch全部,还是慢慢等比较...
GitHub拉取非master分支代码
Git默认拉取master分支上的代码,如果我们需要拉取其他分支上的代码的话需要明确指出拉取的分支,我们想拉取daily/1.4.1分支的代码。 查看远端git上的所有分支 git branch -r 或者 git branch -a 创建并拉取想要的远端分支代码 git checkout -b dev origin/daily/1.4.1
eclipse 如何拉取github上的项目
1,在eclipse中按如下顺序进行操作: File->import->Git,如图所示,选择Projects from Git 2,第一步之后,在弹窗中选择Clone URI,其中URI的获取方式方式如图: 选择不算<em>github</em>相应项目的克隆/下载按钮-》HTTPS-》复制 3, 将上面获取的URI粘贴到eclipse的输入框中,然后输入相应账户的用户名和密码,
github上传文件/项目-拉取项目
一,文件夹上传到GitHub的库 1,在自己新建的GitHub上的仓库中获取URL 2,通过Git Bash克隆下Github上建立的新仓库url git clone https://<em>github</em>.com/##########/springboot.git 3,将要提交的文件夹放入新克隆下的仓库文件夹下 4,在Git Bash里进入仓库文件夹 cd springboot(springbo...
android studio 拉取github代码失败
[img=https://img-bbs.csdn.<em>net</em>/upload/201610/28/1477633793_950605.png][/img]rnrn我在拉取<em>github</em>上的私有代码库的代码时出现这种问题,搜了好久没看到解决办法,都是些push失败的解决办法,求问有大神知道怎么解决吗?
gitHub拉取的nodejs博客项目环境搭建
1.安装mongodb http://www.runoob.com/mongodb/mongodb-linux-install.html 2.创建一个存放<em>数据</em>的文件夹,自己玩就众多项目共享存放点;也可以在每个项目单独创建路径然后--depath单独启动每一个的<em>数据</em>库连接(mongod --dbpath C:\mongoDB\data 和 mongo ) 3.拉代码 npm install 4...
idea工具拉取GitHub远程代码
rr
拉取github指定分支上的代码
打开git bash,进入工作路径,比如E:/workspace/demo git init     #初始化当前目录为git仓库,该目录下会生成.git文件,一般情况不修改这个文件 git remote add origin git@xxx    #连接<em>github</em> git fetch    #fetch 后可看见远程相关分支信息 (此时,git branch  看不到任何本地分支信息,...
jenkins从github拉取项目部署到远程服务器
此次使用的版本为  2.148  其他版本大同小异 环境:mac+jdk1.8 下载链接:https://jenkins.io/download/ 官方文档链接:https://jenkins.io/doc/ 第一步:直接下载jenkins.war 第二步:使用命令 java -jar jenkins.war --httpPort=8080 启动 第三步:浏览器直接访问 http://...
error是关键字吗?
俺书上有一段c++程序,用到了<em>error</em>,但编译时出错,rnC:\Microsoft Visual Studio\MyProjects\p192.cpp(12) : <em>error</em> C2065: '<em>error</em>' : undeclared identifierrn俺是新手,请问怎么解决!!
mysql_query为什么是error
#!/usr/bin/php -qrnrnrn输出:rn#!/usr/bin/php -q mysql connect testconnect <em>error</em>overrn为什么$money是<em>error</em>rnrnselect money from money where callno='2135'这条SQL查询语句运行了没问题rnrn本人初学,请高手指教,谢谢!rn
#error是干什么的
今天考到这个了,rn结果一点都不知道
Abstract Error是何意?
在MDI窗体中,有一子窗体form2是inherited的form1的,但用form2.show时却报错:rnAbstract Error,请高手指教!
error"是怎么回事?">"debug error"是怎么回事?
This application has requested the Runtime to terminate it in an unusual way.rnPlease contact the application's support team for more information.rn
Link Error是为什么?
我有加这个函数为什么运行时就出现这样的错误?rn[linker <em>error</em>] Unresolved external'AddLeaf(_TREEITEM*,...)'referenced from d:\文件\Second.obj
Parsing error是怎么回事?
打开classWizard的时候,出现:rnParsing <em>error</em>:Expected "=".rnInput Line:"testCtrl.testTime=CTime::GetCurrentTime();"rnrn程序编译没问题,运行也没问题,就是打开classWizard的时候出现,并且classWizard里的内容都没了。
WinIo Error 是怎么回事
[img=http://hi.csdn.<em>net</em>/attachment/201106/15/1313422_1308123691a19a.jpg][/img]rn我要调用打印机提供的dll,这个dll调用一个.sys文件,一个.vxd文件rn调用的时候,弹出一个错误<em>提示</em>WinIo Error。请问这是怎么回事?rn调用的函数其实就是往串口里写<em>数据</em>,这个错误<em>提示</em>应该是dll弹出来的。rn请问这个<em>提示</em>是什么意思?是系统用户的权限不够吗?必须要用管理员身份登陆吗?rn可能是什么原因造成的?应该怎么解决呢?
VS2013 error C2001: 常量中有换行符
原因:代码中有中文的标点符号或中文或西藏文等任何不是英文的字符利用全局查找和替换,替换为英文字符,如下图,换为...即可中文双引号“”换为英文单引号‘’...
Linker error是怎么回事?
编译过程中有两个Linker <em>error</em>,是什么原因呢?
vs2013 error lnk 报错问题求助
新手一枚rn跟着一个教程在编写 程序内容跟原版检查过了一模一样 但是就是不能运行 总是报这种错误请问怎么解决rnrn错误 3 <em>error</em> LNK1120: 2 个无法解析的外部命令 F:\jiyu vs 2013jiaoyu xuangmu\defenseGame\Debug\defenseGame.exe 1 1 defenseGamernrnrn错误 1 <em>error</em> LNK2019: 无法解析的外部符号 "public: __thiscall cMyTimer::cMyTimer(void)" (??0cMyTimer@@QAE@XZ),该符号在函数 "public: __thiscall cDefense::cDefense(void)" (??0cDefense@@QAE@XZ) 中被引用 F:\jiyu vs 2013jiaoyu xuangmu\defenseGame\defenseGame\cDefense.obj defenseGamernrnrnrn错误 2 <em>error</em> LNK2019: 无法解析的外部符号 "public: virtual __thiscall cMyTimer::~cMyTimer(void)" (??1cMyTimer@@UAE@XZ),该符号在函数 "public: virtual __thiscall cDefense::~cDefense(void)" (??1cDefense@@UAE@XZ) 中被引用 F:\jiyu vs 2013jiaoyu xuangmu\defenseGame\defenseGame\cDefense.obj defenseGamern
vs2013中使用#error不能正常编译
刚学到这里,但是在VS2013中 使用#<em>error</em>的时候直接就出现红色波浪线,直接报错。后缀名是.c,改成.cpp也不行。直接复制网上的代码也是一样红色的波浪线.rn#line 这个指令到是很正常。
vs2013 error LNK2001: 无法解析的外部符号
<em>error</em> LNK2001第一种情况:构建动态库的时候,报错:<em>error</em> LNK2001: 无法解析的外部符号  **.def错误    178    <em>error</em> LNK2001: 无法解析的外部符号 input_Control    *** vlc-2.2.4.32-2013-master-record\vlc-2.2.4.32-2013-master\libvlccore\libvlccore
error LNK1120和error lnk2001
对于编程人员在编译程序的时候经常会遇到<em>error</em> LNK1120和<em>error</em> lnk2001这问题,跟大家分享一下自己找到的资料,以及自己遇到的问题,希望对大家有帮助。
Error 1 error LNK2001:
Error 1 <em>error</em> LNK2001: unresolved external symbol "public: void __thiscall DgmPrompt::setMessage 老是有这个错误,有兄弟说是DgmPrompt没被包含,可是我检查了一下,那个已经被包含了啊。不知道是不是我的代码有问题。高手来指点一下。我用的是VS2005,呵呵别建议我换编译器,不单我一个人做的项目,其他人都用这个。
python error:[Error 10061]
刚刚开始学用Python写爬虫,按照教程写了第一个程序:rnrn # -*- coding: UTF-8 -*-rnimport urllibrnrndef demo():rn s = urllib.urlopen('http://www.baidu.com')#返回一个类文件rn print(s.read(100))#读取100个字节并输出rnrnif __name__ == '__main__':rn demo()rnrn输出以下错误,上网搜索了Traceback (most recent call last)和<em>error</em>10061的解决办法,但是依然没有解决,希望大家能帮帮忙。rnC:\Python27\python.exe C:/pythonProjects/urllib_demo.pyrnTraceback (most recent call last):rn File "C:/pythonProjects/urllib_demo.py", line 10, in rn demo()rn File "C:/pythonProjects/urllib_demo.py", line 6, in demorn s = urllib.urlopen('http://www.baidu.com')#返回一个类文件rn File "C:\Python27\lib\urllib.py", line 87, in urlopenrn return opener.open(url)rn File "C:\Python27\lib\urllib.py", line 213, in openrn return getattr(self, name)(url)rn File "C:\Python27\lib\urllib.py", line 350, in open_httprn h.endheaders(data)rn File "C:\Python27\lib\httplib.py", line 1038, in endheadersrn self._send_output(message_body)rn File "C:\Python27\lib\httplib.py", line 882, in _send_outputrn self.send(msg)rn File "C:\Python27\lib\httplib.py", line 844, in sendrn self.connect()rn File "C:\Python27\lib\httplib.py", line 821, in connectrn self.timeout, self.source_address)rn File "C:\Python27\lib\socket.py", line 575, in create_connectionrn raise errrnIOError: [Errno socket <em>error</em>] [Errno 10061] rnrnProcess finished with exit code 1rnrn
Error 500--Internal Server Error
java.io.IOException: javax.servlet.jsp.JspException: The taglib validator rejected the page: "java.io.UTFDataFormatException: Invalid byte 1 of 1-byte UTF-8 sequence., "rn
error LNK2019 error LNK1120
<em>error</em> LNK2019: unresolved external symbol __imp_RegisterToDB referenced in function "protected: long __cdecl CMapShowView::OnTrafficEventUpdate(unsigned int,long)" rn<em>error</em> LNK1120: 1 unresolved externals
error C2059: syntax error : ''
#include "stdio.h"rntypedef unsigned short uint16;rnrn#define W_Regval_H(address,regVal) (((((address | 0X80)<> 16)rnrnvoid main()rn int i;rn uint16 W_RESVAL[2]=0, ;rn W_RESVAL[2]=W_Regval_H(0x05,0x88),W_Regval_H(0x05,0x88);rn for (i=0;ie:\\test\test\test1.c(9) : <em>error</em> C2059: syntax <em>error</em> : '' 请教下rn
Error C2894、Error C2733
[img=https://img-bbs.csdn.<em>net</em>/upload/201711/18/1510991131_991273.png][/img]rnrn最近用VS2012编译的时候出现 的问题,自己也去百度过没能解决,哪位大神能帮帮忙,感谢!
VS2013出现Error C4430的一种解决方案
这两天写代码总碰到<em>error</em> C4430,<em>提示</em>C++不支持默认int类型,查了很多资料,都无法对应我的问题。 最后终于发现是我的一个自定义函数distance()与系统自带的库函数distance()重载,导致的这个问题,修改函数名即可。 函数和变量命名时要注意不要与库函数命名冲突,自定义的函数内部的变量命名也不可与函数名相同。  ...
VS2013 error LNK2001: 无法解析的外部符号
错误如下,小白查了2天也不知道怎么弄,求大佬告知方法rnrn[img=https://img-bbs.csdn.<em>net</em>/upload/201810/04/1538653943_217516.png][/img]rnrn[img=https://img-bbs.csdn.<em>net</em>/upload/201810/04/1538653950_818425.png][/img]
VS2013 error LNK1120: 1 个无法解析的外部命令
分析问题: 这个问题的原因是有头文件,但是找不到实现。 有两个原因:1.只包含了头文件,只有这个函数的声明,没有包含这个函数的实现(实现一般放在cpp文件中的)。所以只能通过编译,连接不成功。 2.另一个原因是函数的声明和实现都放在头文件中了,一般要把声明放头文件中,实现放在cpp文件中。这样每个#include该头文件的文件都会有一份该函数的实现,连接的时候,连接器不知道连接哪一个实现,于是报错...
error
<em>error</em><em>error</em><em>error</em>
error????
fatal <em>error</em> C1853: 'Debug/ftp.pch' is not rna precompiled header file created with this compilerrn为什么有这种错误?
Error
[img=C:\Users\Administrator\Desktop\<em>error</em>.jpg][/img]rnrn这个错误是怎么回事?
ERROR
为什么在ON_MESSAGE(WM_SEND_MESSAGE,OnSend)上报下面的错误?rnrnError 1 <em>error</em> C2440: 'static_cast' : cannot convert from 'void (__thiscall CTel<em>net</em>ServerDlg::* )(void)' to 'LRESULT (__thiscall CWnd::* )(WPARAM,LPARAM)' c:\Documents and Settings\is208017\My Documents\下载\20070328_Tel<em>net</em>Server\Tel<em>net</em>Server\Tel<em>net</em>ServerDlg.cpp 47 rnrn
On Error
[code=VB]rnOn Error Resume Nextrn[/code]rn当运行时错误发生时,转到紧接着发生错误的语句之后的语句继续执行rn这是书上的有的原话解释,我想请问下,其作用范围是针对整个程序,还是某个过程,还是某个模块.
ERROR!!!
五月 26, 2018 7:53:46 下午 com.mchange.v2.resourcepool.BasicResourcePool$AcquireTask run警告: com.mchange.v2.resourcepool.BasicResourcePool$AcquireTask@162aef9 -- Acquisition Attempt Failed!!! Clearing pend...
error LNK2028 & error LNK2019
WordStatProcessor.hrn[code=C/C++]rn#pragma oncernrn#include rn#include rn#include rnrnnamespace WordStat rn class WordStatProcessor rn rn public:rn void process();rn rn private:rn rn ;rnrn[/code]rnrnrnWordStatProcessor.cpprnrn[code=C/C++]rn#include "stdafx.h"rn#include "WordStatProcessor.h"rnrn#include rn#include rn#include rnrnvoid process()rnrn std::ifstream myfile ("c:/example.txt");rn std::string line;rn if (myfile.is_open())rn while (! myfile.eof() )rn std::getline (myfile,line);rn rn myfile.close();rn rnrn[/code]rnrnForm1.hrnrn[code=C/C++]rn#pragma oncernrn#include "WordStatProcessor.h"rnrnnamespace WordStat rnrn using namespace System;rn using namespace System::ComponentModel;rn using namespace System::Collections;rn using namespace System::Windows::Forms;rn using namespace System::Data;rn using namespace System::Drawing;rnrn public ref class Form1 : public System::Windows::Forms::Formrn rn public:rn Form1(void)rn rn InitializeComponent();rn rnrn protected:rn ~Form1()rn rn if (components)rn rn delete components;rn rn rn private: System::Windows::Forms::GroupBox^ groupBox1;rn protected: rn private: System::Windows::Forms::Label^ label1;rn private: System::Windows::Forms::GroupBox^ groupBox2;rn private: System::Windows::Forms::GroupBox^ groupBox3;rn private: System::Windows::Forms::ComboBox^ folderDir;rn private: System::Windows::Forms::Button^ button2;rn private: System::Windows::Forms::Label^ currentState;rn private: System::Windows::Forms::Label^ label2;rn private: System::Windows::Forms::FolderBrowserDialog^ folderBrowserDialog;rnrnrnrn private:rnrn System::ComponentModel::Container ^components;rnrn#pragma region Windows Form Designer generated codernrn void InitializeComponent(void)rn rn ....rn rn#pragma endregionrnprivate: System::Void button1_Click(System::Object^ sender, System::EventArgs^ e) rn System::Windows::Forms::DialogResult result = this->folderBrowserDialog->ShowDialog();rn if(result == System::Windows::Forms::DialogResult::OK)rn this->folderDir->Text = this->folderBrowserDialog->SelectedPath;rn rn rnprivate: System::Void button2_Click(System::Object^ sender, System::EventArgs^ e) rn WordStat::WordStatProcessor processor;rn processor.process();rn rn;rnrnrnrn[/code]rnrnrn错误rnrn1>------ Build started: Project: WordStat, Configuration: Debug Win32 ------rn1>Compiling...rn1>WordStatProcessor.cpprn1>WordStat.cpprn1>Generating Code...rn1>Linking...rn1>WordStat.obj : <em>error</em> LNK2028: unresolved token (0A000015) "public: void __clrcall WordStat::WordStatProcessor::process(void)" (?process@WordStatProcessor@WordStat@@$$FQAMXXZ) referenced in function "private: void __clrcall WordStat::Form1::button2_Click(class System::Object ^,class System::EventArgs ^)" (?button2_Click@Form1@WordStat@@$$FA$AAMXP$AAVObject@System@@P$AAVEventArgs@4@@Z)rn1>WordStat.obj : <em>error</em> LNK2019: unresolved external symbol "public: void __clrcall WordStat::WordStatProcessor::process(void)" (?process@WordStatProcessor@WordStat@@$$FQAMXXZ) referenced in function "private: void __clrcall WordStat::Form1::button2_Click(class System::Object ^,class System::EventArgs ^)" (?button2_Click@Form1@WordStat@@$$FA$AAMXP$AAVObject@System@@P$AAVEventArgs@4@@Z)rn1>D:\Projects\VisualStudio\WordStat\Debug\WordStat.exe : fatal <em>error</em> LNK1120: 2 unresolved externalsrn1>Build log was saved at "file://d:\Projects\VisualStudio\WordStat\WordStat\Debug\BuildLog.htm"rn1>WordStat - 3 <em>error</em>(s), 0 warning(s)rn========== Build: 0 succeeded, 1 failed, 0 up-to-date, 0 skipped ==========rnrn迷糊~~~rnrn
error LNK2019和error LNK2001
错误信息是<em>error</em> LNK2019: unresolved external symbol "_declspec(dllimport) public: _thiscall QTcpSocket::QTcpSocket(class QObject *)" (__imp_??OQTcpSocket@@QAE@PAVQObject@@@Z) referenced in function "public: __thiscall Device(class QObject *)"()rn<em>error</em> LNK2001: unresolved external symbol "public: birtual struct QMetaObject const * __thiscall QTcpSocket::metaObject(void)const “rn各位大神给看看哪里出错了???
error C2059: syntax error : '.'
我在调用一个类里的函数时出现这个错误:checking.count()rn整个程序就这一个错误,不知道是什么原因引起的.rn有谁知道吗?rn
error error errror errror
sdfagfhfhjndrtdfrgerdgsaertgdf
error C2059: syntax error : ')'
void CExp9_1_3View::OnInitialUpdate()rnrn CListView::OnInitialUpdate();rn // TODO: You may populate your ListView with items by directly accessingrn // its list control through a call to GetListCtrl().rn// CListCtrl m_ListCtrl;rnCListCtrl m_ListCtrl; rnint nColumnCount=m_ListCtrl.GetHeaderCtrl()->GetItemCount();rn for(int i=0;i
fatal error C1189: #error
随手简了一个空的 win32项目 项目名称是ttt 在网上粘贴的代码想看下效果。。结果报错。。求解rnrnrn错误 1 fatal <em>error</em> C1189: #<em>error</em> : This version of cpl_config.h header is dedicated for Windows CE platform! f:\wzx\gdal\include\cpl_config.h 7 tttrnrnrnrnrnrnrnrnrnrn#includern#includernusing namespace std;rnrnvoid main()rnrn GDALDataset *poDataset; //<em>数据</em>集对象指针rn GDALAllRegister();//注册驱动rnrn poDataset = (GDALDataset *) GDALOpen( "c:\\1.jpg", GA_ReadOnly );rnrn if( poDataset != NULL /*检查是否正常打开文件*/)rn rn //do somethingrn rnrn cout<<<<RasterIO( GF_Read, 0, 0, nXSize, 1, pafScanline, nXSize, 1, GDT_UInt16, 0, 0 );rn delete poDataset; //释放资源rnrn CPLFree(pafScanline); //释放缓冲区空间rnrn
fastreport4下载
fastreport4直接安装包,支持delphi7以上版本。 相关下载链接:[url=//download.csdn.net/download/kgq_kong/7308871?utm_source=bbsseo]//download.csdn.net/download/kgq_kong/7308871?utm_source=bbsseo[/url]
针对集成块元件,带状线和波导结环行器的统一方法的感想下载
结环行器理论要么以单端口感应本征网络特性的线性组合的形式给出,要么以一个单端口近似等效电路的形式给出。本文的目的是介绍使用上述任一种方法时,环行器在ABCD矩阵,理想变压器和谐振本征网络方面的统一理论。结果发现,可以用在本文介绍的表示法下方便地描述所有标准环行器。 相关下载链接:[url=//download.csdn.net/download/xiaobo1993/7391769?utm_source=bbsseo]//download.csdn.net/download/xiaobo1993/7391769?utm_source=bbsseo[/url]
org.springframework.context-3.0.7.RELEASE.jar下载
org.springframework.context-3.0.7.RELEASE.jar 相关下载链接:[url=//download.csdn.net/download/u013659801/7522563?utm_source=bbsseo]//download.csdn.net/download/u013659801/7522563?utm_source=bbsseo[/url]
相关热词 c# stream 复制 android c# c#监测窗口句柄 c# md5 引用 c# 判断tabtip 自己写个浏览器程序c# c# 字符串变成整数数组 c#语言编程写出一个方法 c# 转盘抽奖 c#选中treeview
我们是很有底线的