2008数据库安装出错,求助大神了!!! [问题点数:20分]

Bbs1
本版专家分:0
结帖率 0%
Bbs1
本版专家分:0
项目日志 突然停止写入 可能是什么原因造成的呢?
-
数据库安装后续出现的问题及解决
1、ORA-01034: ORACLE not available问题 数据库未启动 执行startup命令   2、ORA-01078 及LRM-00109 问题 ORA-01078: failure in processing system parameters LRM-00109: '/u01/app/oracle/product/11/db_1/dbs/initorcl.o...
Oracle安装过程中出现问题
在oracle安装过程中,在安装oracle net configuration assistant时候停住了,还有一个黑色窗口,运行的是lsnrctl.exe截图如下: 另外,安装的时候,防火墙我已
vb+access数据库安装出错
程序调试通过,在其他机器上安装没出现问题,安装在98上出现“不支持自动化或期望的借口”rn怎么解决!?
数据库安装出错!急!
各位大哥帮帮忙:rn  我想在XP中安装Mssql server 2000 开发版.出现以下错误:rnrn 我下载了一个SQLServer20004in1cn 软件.点击安装开发版.“安装数据库服务器“出现安装程序后,点”下一步“后选择“本地计算机”点下一步总是出现“以前的某个程序安装已在安装计算机上创建挂起的文件操作。运行安装程序之前必须重新启动计算机。”就算重新启动也没有办法安装。
SQL server数据库安装出错
<em>数据库安装</em>的时候<em>出错</em>;rn系统: 2000 serverrn安装版本: sql server开发版/服务器版rn<em>出错</em>提示: 安装程序配置服务器失败。参考服务器错误日志和 C:\WINNT\sqlstp.log 了解更多信息。rnrn采取措施: 1,删除注册表中相应键值后重装-未遂;rn 2,重装系统后安装sql server 问题还是那个问题;rnrn麻烦哪位兄弟给条活路^_^rn
求助:sql 2008 安装出错
sql <em>2008</em> 安装<em>出错</em>,求解决方案,谢谢!rnrn[img=https://img-bbs.csdn.net/upload/201308/28/1377678639_974093.png][/img]rnrnrnrn=== Verbose logging started: 2013-08-28 16:26:26 Build type: SHIP UNICODE 5.00.7601.00 Calling process: H:\Setup Tools\SQLFULL_CHS\x86\setup100.exe ===rnMSI (c) (3C:E4) [16:26:26:413]: Resetting cached policy valuesrnMSI (c) (3C:E4) [16:26:26:413]: Machine policy value 'Debug' is 0rnMSI (c) (3C:E4) [16:26:26:413]: ******* RunEngine:rn ******* Product: H:\Setup Tools\SQLFULL_CHS\x86\redist\watson\dw20shared.msirn ******* Action: rn ******* CommandLine: **********rnMSI (c) (3C:E4) [16:26:26:414]: Client-side and UI is none or basic: Running entire install on the server.rnMSI (c) (3C:E4) [16:26:26:414]: Grabbed execution mutex.rnMSI (c) (3C:E4) [16:26:26:417]: Cloaking enabled.rnMSI (c) (3C:E4) [16:26:26:417]: Attempting to enable all disabled privileges before calling Install on ServerrnMSI (c) (3C:E4) [16:26:26:417]: Incrementing counter to disable shutdown. Counter after increment: 0rnMSI (s) (B0:10) [16:26:26:429]: Running installation inside multi-package transaction H:\Setup Tools\SQLFULL_CHS\x86\redist\watson\dw20shared.msirnMSI (s) (B0:10) [16:26:26:429]: Grabbed execution mutex.rnMSI (s) (B0:D8) [16:26:26:433]: Resetting cached policy valuesrnMSI (s) (B0:D8) [16:26:26:433]: Machine policy value 'Debug' is 0rnMSI (s) (B0:D8) [16:26:26:433]: ******* RunEngine:rn ******* Product: H:\Setup Tools\SQLFULL_CHS\x86\redist\watson\dw20shared.msirn ******* Action: rn ******* CommandLine: **********rnMSI (s) (B0:D8) [16:26:26:434]: Machine policy value 'DisableUserInstalls' is 0rnMSI (s) (B0:D8) [16:26:26:438]: SRSetRestorePoint skipped for this transaction.rnMSI (s) (B0:D8) [16:26:26:440]: MainEngineThread is returning 2rnMSI (s) (B0:10) [16:26:26:440]: No System Restore sequence number for this installation.rnMSI (s) (B0:10) [16:26:26:442]: User policy value 'DisableRollback' is 0rnMSI (s) (B0:10) [16:26:26:442]: Machine policy value 'DisableRollback' is 0rnMSI (s) (B0:10) [16:26:26:442]: Incrementing counter to disable shutdown. Counter after increment: 0rnMSI (s) (B0:10) [16:26:26:442]: Note: 1: 1402 2: HKEY_LOCAL_MACHINE\Software\Microsoft\Windows\CurrentVersion\Installer\Rollback\Scripts 3: 2 rnMSI (s) (B0:10) [16:26:26:442]: Note: 1: 1402 2: HKEY_LOCAL_MACHINE\Software\Microsoft\Windows\CurrentVersion\Installer\Rollback\Scripts 3: 2 rnMSI (s) (B0:10) [16:26:26:443]: Note: 1: 1402 2: HKEY_LOCAL_MACHINE\Software\Microsoft\Windows\CurrentVersion\Installer\InProgress 3: 2 rnMSI (s) (B0:10) [16:26:26:443]: Note: 1: 1402 2: HKEY_LOCAL_MACHINE\Software\Microsoft\Windows\CurrentVersion\Installer\InProgress 3: 2 rnMSI (s) (B0:10) [16:26:26:443]: Decrementing counter to disable shutdown. If counter >= 0, shutdown will be denied. Counter after decrement: -1rnMSI (s) (B0:10) [16:26:26:443]: Restoring environment variablesrnMSI (c) (3C:E4) [16:26:26:447]: Decrementing counter to disable shutdown. If counter >= 0, shutdown will be denied. Counter after decrement: -1rnMSI (c) (3C:E4) [16:26:26:448]: MainEngineThread is returning 2rn=== Verbose logging stopped: 2013-08-28 16:26:26 ===rn
Sql server 2008 R2(数据库安装
版权声明:本文为博主原创文章,欢迎转载。 https://blog.csdn.net/tz2101/article/details/27350977 &amp;amp;lt;/div&amp;amp;gt; &amp;amp;lt;link rel=&amp;quot;stylesheet&amp;quot; href=&amp;quot;h
SqlServer 2008数据库安装详细图解
SqlServer <em>2008</em><em>数据库安装</em>详细步骤描述,以图例的形式说明每一步操作
求助大神 打包混淆出错
[img=https://img-bbs.csdn.net/upload/201804/24/1524520440_260729.png][/img]rnWarning:Exception while processing task java.io.IOException: proguard.ParseException: Unexpected keyword 'com.facebook.imagepipeline.**' in line 36 of file 'D:\Android\app\proguard-rules.pro'rnError:Execution failed for task ':app:transformClassesAndResourcesWithProguardForRelease'.rn> Job failed, see logs for details
opencv出错求助大神啊啊!!
[img=https://img-bbs.csdn.net/upload/201703/04/1488632280_962041.png][/img]rn这个错误要如何才能解决?
【【【【【【【【【【求助】】】】】】】】】】Linux下Informix数据库安装
计划在Linux上安装个Informix数据库,想先在虚拟机装一个test一把!~rnrn不知道如何下手……希望大家帮帮偶!~rnrn安装之后如何启动服务?如何建立自己的数据库?rnrn这些都不太明白……rnrnO(∩_∩)O~哪个GG说说?小女子感激不尽……O(∩_∩)O~rnrn级别太低,只能发100的帖子,有结果了上来加分!~rnrn谢谢各位……谢谢所有up的XSJM们,谢谢所有热心人!~
LINUX下数据库安装求助
请大师们教我怎么在LINUX下安装ORACLE8I,希望能提供安装向导
SQL2008数据库安装升级时出错
我的数据库打开时显示了rn[img=C:\Users\Administrator\Desktop\捕获.PNG][/img]rn我照着网上说的到安装文件里设置安装升级rn但是按下升级后显示rn[img=C:\Users\Administrator\Desktop\捕获2.PNG][/img]rn总之就是数据库好像过期了,我的是试用版
Oracle数据库安装详细手册For Win 2008与Linux系统
Linux环境配置脚本 pdksh安装包Oracle安装手册-RedHat Enterprise Linux 64bitOracle安装手册-Windows Server <em>2008</em> R2 SP1 64bit
Servlet在tomcat8.0.3上老出错求助大神
以下是tomcat-user.xml的配置情况rnrnrn rn rn rn rn rn rnrnrn以下是webapps下的test文件夹中WEB-INF中web.xml的配置情况rnrnrnrn rn HWrn HelloWorldServletrn rn rn HWrn /abcrn rnrnrn接着HelloWorldServlet .class的文件放在WIN-INF下的classes文件夹中,而在tomcat服务器中运行是老是出现下列错误,请大家指教rn[img=https://img-bbs.csdn.net/upload/201403/26/1395814701_310566.jpg][/img]rnrntype Exception reportrnmessage HelloWorldServlet (wrong name: practice/HelloWorldServlet)rndescription The server encountered an internal error that prevented it from fulfilling this request.rnrnexceptionrnrnjava.lang.NoClassDefFoundError: HelloWorldServlet (wrong name: practice/HelloWorldServlet)rn java.lang.ClassLoader.defineClass1(Native Method)rn java.lang.ClassLoader.defineClass(ClassLoader.java:792)rn java.security.SecureClassLoader.defineClass(SecureClassLoader.java:142)rn org.apache.catalina.loader.WebappClassLoader.findClassInternal(WebappClassLoader.java:2401)rn org.apache.catalina.loader.WebappClassLoader.findClass(WebappClassLoader.java:871)rn org.apache.catalina.loader.WebappClassLoader.loadClass(WebappClassLoader.java:1254)rn org.apache.catalina.loader.WebappClassLoader.loadClass(WebappClassLoader.java:1132)rn org.apache.catalina.authenticator.AuthenticatorBase.invoke(AuthenticatorBase.java:491)rn org.apache.catalina.valves.ErrorReportValve.invoke(ErrorReportValve.java:74)rn org.apache.catalina.valves.AbstractAccessLogValve.invoke(AbstractAccessLogValve.java:610)rn org.apache.catalina.connector.CoyoteAdapter.service(CoyoteAdapter.java:516)rn org.apache.coyote.http11.AbstractHttp11Processor.process(AbstractHttp11Processor.java:1015)rn org.apache.coyote.AbstractProtocol$AbstractConnectionHandler.process(AbstractProtocol.java:652)rn org.apache.coyote.http11.Http11AprProtocol$Http11ConnectionHandler.process(Http11AprProtocol.java:277)rn org.apache.tomcat.util.net.AprEndpoint$SocketProcessor.doRun(AprEndpoint.java:2451)rn org.apache.tomcat.util.net.AprEndpoint$SocketProcessor.run(AprEndpoint.java:2440)rn java.util.concurrent.ThreadPoolExecutor.runWorker(ThreadPoolExecutor.java:1145)rn java.util.concurrent.ThreadPoolExecutor$Worker.run(ThreadPoolExecutor.java:615)rn java.lang.Thread.run(Thread.java:724)rnnote The full stack trace of the root cause is available in the Apache Tomcat/8.0.3 logs.rnrnrn--------------------------------------------------------------------------------rn
tomcat mysql javaweb开发出错了,求助大神
rn不太会连接数据库,但是最简单的都<em>出错</em>了,呜呜~~rnrn下面是错误信息,求解!!rnrnrn2012-3-21 20:50:22 org.apache.catalina.core.AprLifecycleListener initrn信息: The APR based Apache Tomcat Native library which allows optimal performance in production environments was not found on the java.library.path: D:\Program Files\MyEclipse-8.6\binary\com.sun.java.jdk.win32.x86_1.6.0.013\bin;D:\Tomcat 6.0\binrn2012-3-21 20:50:23 org.apache.coyote.http11.Http11Protocol initrn严重: Error initializing endpointrnjava.net.SocketException: Unrecognized Windows Sockets error: 0: JVM_Bindrn at java.net.PlainSocketImpl.socketBind(Native Method)rn at java.net.PlainSocketImpl.bind(PlainSocketImpl.java:359)rn at java.net.ServerSocket.bind(ServerSocket.java:319)rn at java.net.ServerSocket.(ServerSocket.java:185)rn at java.net.ServerSocket.(ServerSocket.java:141)rn at org.apache.tomcat.util.net.DefaultServerSocketFactory.createSocket(DefaultServerSocketFactory.java:50)rn at org.apache.tomcat.util.net.JIoEndpoint.init(JIoEndpoint.java:538)rn at org.apache.coyote.http11.Http11Protocol.init(Http11Protocol.java:176)rn at org.apache.catalina.connector.Connector.initialize(Connector.java:1022)rn at org.apache.catalina.core.StandardService.initialize(StandardService.java:703)rn at org.apache.catalina.core.StandardServer.initialize(StandardServer.java:838)rn at org.apache.catalina.startup.Catalina.load(Catalina.java:538)rn at org.apache.catalina.startup.Catalina.load(Catalina.java:562)rn at sun.reflect.NativeMethodAccessorImpl.invoke0(Native Method)rn at sun.reflect.NativeMethodAccessorImpl.invoke(NativeMethodAccessorImpl.java:39)rn at sun.reflect.DelegatingMethodAccessorImpl.invoke(DelegatingMethodAccessorImpl.java:25)rn at java.lang.reflect.Method.invoke(Method.java:597)rn at org.apache.catalina.startup.Bootstrap.load(Bootstrap.java:261)rn at org.apache.catalina.startup.Bootstrap.main(Bootstrap.java:413)rn2012-3-21 20:50:23 org.apache.catalina.core.StandardService initializern严重: Failed to initialize connector [Connector[HTTP/1.1-8080]]rnLifecycleException: Protocol handler initialization failed: java.net.SocketException: Unrecognized Windows Sockets error: 0: JVM_Bindrn at org.apache.catalina.connector.Connector.initialize(Connector.java:1024)rn at org.apache.catalina.core.StandardService.initialize(StandardService.java:703)rn at org.apache.catalina.core.StandardServer.initialize(StandardServer.java:838)rn at org.apache.catalina.startup.Catalina.load(Catalina.java:538)rn at org.apache.catalina.startup.Catalina.load(Catalina.java:562)rn at sun.reflect.NativeMethodAccessorImpl.invoke0(Native Method)rn at sun.reflect.NativeMethodAccessorImpl.invoke(NativeMethodAccessorImpl.java:39)rn at sun.reflect.DelegatingMethodAccessorImpl.invoke(DelegatingMethodAccessorImpl.java:25)rn at java.lang.reflect.Method.invoke(Method.java:597)rn at org.apache.catalina.startup.Bootstrap.load(Bootstrap.java:261)rn at org.apache.catalina.startup.Bootstrap.main(Bootstrap.java:413)rn2012-3-21 20:50:23 org.apache.catalina.startup.Catalina loadrn信息: Initialization processed in 603 msrn2012-3-21 20:50:23 org.apache.catalina.core.StandardService startrn信息: Starting service Catalinarn2012-3-21 20:50:23 org.apache.catalina.core.StandardEngine startrn信息: Starting Servlet Engine: Apache Tomcat/6.0.32rn2012-3-21 20:50:23 org.apache.catalina.startup.HostConfig deployDescriptorrn信息: Deploying configuration descriptor host-manager.xmlrn2012-3-21 20:50:23 org.apache.catalina.startup.HostConfig deployDescriptorrn信息: Deploying configuration descriptor manager.xmlrn2012-3-21 20:50:23 org.apache.catalina.startup.HostConfig deployDirectoryrn信息: Deploying web application directory docsrn2012-3-21 20:50:23 org.apache.catalina.startup.HostConfig deployDirectoryrn信息: Deploying web application directory examplesrn2012-3-21 20:50:23 org.apache.catalina.core.ApplicationContext logrn信息: ContextListener: contextInitialized()rn2012-3-21 20:50:23 org.apache.catalina.core.ApplicationContext logrn信息: SessionListener: contextInitialized()rn2012-3-21 20:50:23 org.apache.catalina.startup.HostConfig deployDirectoryrn信息: Deploying web application directory ROOTrn2012-3-21 20:50:23 org.apache.coyote.http11.Http11Protocol startrn严重: Error starting endpointrnjava.net.SocketException: Unrecognized Windows Sockets error: 0: JVM_Bindrn at java.net.PlainSocketImpl.socketBind(Native Method)rn at java.net.PlainSocketImpl.bind(PlainSocketImpl.java:359)rn at java.net.ServerSocket.bind(ServerSocket.java:319)rn at java.net.ServerSocket.(ServerSocket.java:185)rn at java.net.ServerSocket.(ServerSocket.java:141)rn at org.apache.tomcat.util.net.DefaultServerSocketFactory.createSocket(DefaultServerSocketFactory.java:50)rn at org.apache.tomcat.util.net.JIoEndpoint.init(JIoEndpoint.java:538)rn at org.apache.tomcat.util.net.JIoEndpoint.start(JIoEndpoint.java:565)rn at org.apache.coyote.http11.Http11Protocol.start(Http11Protocol.java:203)rn at org.apache.catalina.connector.Connector.start(Connector.java:1095)rn at org.apache.catalina.core.StandardService.start(StandardService.java:540)rn at org.apache.catalina.core.StandardServer.start(StandardServer.java:754)rn at org.apache.catalina.startup.Catalina.start(Catalina.java:595)rn at sun.reflect.NativeMethodAccessorImpl.invoke0(Native Method)rn at sun.reflect.NativeMethodAccessorImpl.invoke(NativeMethodAccessorImpl.java:39)rn at sun.reflect.DelegatingMethodAccessorImpl.invoke(DelegatingMethodAccessorImpl.java:25)rn at java.lang.reflect.Method.invoke(Method.java:597)rn at org.apache.catalina.startup.Bootstrap.start(Bootstrap.java:289)rn at org.apache.catalina.startup.Bootstrap.main(Bootstrap.java:414)rn2012-3-21 20:50:23 org.apache.catalina.core.StandardService startrn严重: Failed to start connector [Connector[HTTP/1.1-8080]]rnLifecycleException: service.getName(): "Catalina"; Protocol handler start failed: java.net.SocketException: Unrecognized Windows Sockets error: 0: JVM_Bindrn at org.apache.catalina.connector.Connector.start(Connector.java:1102)rn at org.apache.catalina.core.StandardService.start(StandardService.java:540)rn at org.apache.catalina.core.StandardServer.start(StandardServer.java:754)rn at org.apache.catalina.startup.Catalina.start(Catalina.java:595)rn at sun.reflect.NativeMethodAccessorImpl.invoke0(Native Method)rn at sun.reflect.NativeMethodAccessorImpl.invoke(NativeMethodAccessorImpl.java:39)rn at sun.reflect.DelegatingMethodAccessorImpl.invoke(DelegatingMethodAccessorImpl.java:25)rn at java.lang.reflect.Method.invoke(Method.java:597)rn at org.apache.catalina.startup.Bootstrap.start(Bootstrap.java:289)rn at org.apache.catalina.startup.Bootstrap.main(Bootstrap.java:414)rn2012-3-21 20:50:23 org.apache.jk.common.ChannelSocket initrn信息: Port busy 8009 java.net.SocketException: Unrecognized Windows Sockets error: 0: JVM_Bindrn2012-3-21 20:50:23 org.apache.jk.common.ChannelSocket initrn严重: Can't find free port 8009 8009rn2012-3-21 20:50:23 org.apache.jk.server.JkMain startrn信息: Jk running ID=0 time=0/10 config=nullrn2012-3-21 20:50:23 org.apache.catalina.startup.Catalina startrn信息: Server startup in 765 msrn2012-3-21 20:50:23 org.apache.catalina.core.StandardServer awaitrn严重: StandardServer.await: create[8005]: rnjava.net.BindException: Address already in use: JVM_Bindrn at java.net.PlainSocketImpl.socketBind(Native Method)rn at java.net.PlainSocketImpl.bind(PlainSocketImpl.java:359)rn at java.net.ServerSocket.bind(ServerSocket.java:319)rn at java.net.ServerSocket.(ServerSocket.java:185)rn at org.apache.catalina.core.StandardServer.await(StandardServer.java:406)rn at org.apache.catalina.startup.Catalina.await(Catalina.java:676)rn at org.apache.catalina.startup.Catalina.start(Catalina.java:628)rn at sun.reflect.NativeMethodAccessorImpl.invoke0(Native Method)rn at sun.reflect.NativeMethodAccessorImpl.invoke(NativeMethodAccessorImpl.java:39)rn at sun.reflect.DelegatingMethodAccessorImpl.invoke(DelegatingMethodAccessorImpl.java:25)rn at java.lang.reflect.Method.invoke(Method.java:597)rn at org.apache.catalina.startup.Bootstrap.start(Bootstrap.java:289)rn at org.apache.catalina.startup.Bootstrap.main(Bootstrap.java:414)rn2012-3-21 20:50:23 org.apache.coyote.http11.Http11Protocol pausern信息: Pausing Coyote HTTP/1.1 on http-8080rn2012-3-21 20:50:24 org.apache.catalina.core.StandardService stoprn信息: Stopping service Catalinarn2012-3-21 20:50:25 org.apache.catalina.core.ApplicationContext logrn信息: SessionListener: contextDestroyed()rn2012-3-21 20:50:25 org.apache.catalina.core.ApplicationContext logrn信息: ContextListener: contextDestroyed()rn2012-3-21 20:50:25 org.apache.coyote.http11.Http11Protocol destroyrn信息: Stopping Coyote HTTP/1.1 on http-8080rn
spring整合mybatis 注入出错 求助各位大神
![目录结构](https://img-ask.csdn.net/upload/201704/13/1492074562_72832.png)n报错norg.springframework.beans.factory.BeanCreationException: Error creating bean with name 'cn.jscoin.UserTest': Injection of autowired dependencies failed; nested exception is org.springframework.beans.factory.BeanCreationException: Could not autowire field: private cn.jscoin.jslj.mapper.UserMapper cn.jscoin.UserTest.userMapper; nested exception is org.springframework.beans.factory.NoSuchBeanDefinitionException: No qualifying bean of type [cn.jscoin.jslj.mapper.UserMapper] found for dependency: expected at least 1 bean which qualifies as autowire candidate for this dependency. Dependency annotations: @org.springframework.beans.factory.annotation.Autowired(required=true)n at org.springframework.beans.factory.annotation.AutowiredAnnotationBeanPostProcessor.postProcessPropertyValues(AutowiredAnnotationBeanPostProcessor.java:334)n at org.springframework.beans.factory.support.AbstractAutowireCapableBeanFactory.populateBean(AbstractAutowireCapableBeanFactory.java:1202)n at org.springframework.beans.factory.support.AbstractAutowireCapableBeanFactory.autowireBeanProperties(AbstractAutowireCapableBeanFactory.java:385)n at org.springframework.test.context.support.DependencyInjectionTestExecutionListener.injectDependencies(DependencyInjectionTestExecutionListener.java:118)n at org.springframework.test.context.support.DependencyInjectionTestExecutionListener.prepareTestInstance(DependencyInjectionTestExecutionListener.java:83)n at org.springframework.test.context.TestContextManager.prepareTestInstance(TestContextManager.java:212)n at org.springframework.test.context.junit4.SpringJUnit4ClassRunner.createTest(SpringJUnit4ClassRunner.java:200)n at org.springframework.test.context.junit4.SpringJUnit4ClassRunner$1.runReflectiveCall(SpringJUnit4ClassRunner.java:252)n at org.junit.internal.runners.model.ReflectiveCallable.run(ReflectiveCallable.java:12)n at org.springframework.test.context.junit4.SpringJUnit4ClassRunner.methodBlock(SpringJUnit4ClassRunner.java:254)n at org.springframework.test.context.junit4.SpringJUnit4ClassRunner.runChild(SpringJUnit4ClassRunner.java:217)n at org.springframework.test.context.junit4.SpringJUnit4ClassRunner.runChild(SpringJUnit4ClassRunner.java:83)n at org.junit.runners.ParentRunner$3.run(ParentRunner.java:290)n at org.junit.runners.ParentRunner$1.schedule(ParentRunner.java:71)n at org.junit.runners.ParentRunner.runChildren(ParentRunner.java:288)n at org.junit.runners.ParentRunner.access$000(ParentRunner.java:58)n at org.junit.runners.ParentRunner$2.evaluate(ParentRunner.java:268)n at org.springframework.test.context.junit4.statements.RunBeforeTestClassCallbacks.evaluate(RunBeforeTestClassCallbacks.java:61)n at org.springframework.test.context.junit4.statements.RunAfterTestClassCallbacks.evaluate(RunAfterTestClassCallbacks.java:68)n at org.junit.runners.ParentRunner.run(ParentRunner.java:363)n at org.springframework.test.context.junit4.SpringJUnit4ClassRunner.run(SpringJUnit4ClassRunner.java:163)n at org.eclipse.jdt.internal.junit4.runner.JUnit4TestReference.run(JUnit4TestReference.java:86)n at org.eclipse.jdt.internal.junit.runner.TestExecution.run(TestExecution.java:38)n at org.eclipse.jdt.internal.junit.runner.RemoteTestRunner.runTests(RemoteTestRunner.java:459)n at org.eclipse.jdt.internal.junit.runner.RemoteTestRunner.runTests(RemoteTestRunner.java:678)n at org.eclipse.jdt.internal.junit.runner.RemoteTestRunner.run(RemoteTestRunner.java:382)n at org.eclipse.jdt.internal.junit.runner.RemoteTestRunner.main(RemoteTestRunner.java:192)nCaused by: org.springframework.beans.factory.BeanCreationException: Could not autowire field: private cn.jscoin.jslj.mapper.UserMapper cn.jscoin.UserTest.userMapper; nested exception is org.springframework.beans.factory.NoSuchBeanDefinitionException: No qualifying bean of type [cn.jscoin.jslj.mapper.UserMapper] found for dependency: expected at least 1 bean which qualifies as autowire candidate for this dependency. Dependency annotations: @org.springframework.beans.factory.annotation.Autowired(required=true)n at org.springframework.beans.factory.annotation.AutowiredAnnotationBeanPostProcessor$AutowiredFieldElement.inject(AutowiredAnnotationBeanPostProcessor.java:558)n at org.springframework.beans.factory.annotation.InjectionMetadata.inject(InjectionMetadata.java:87)n at org.springframework.beans.factory.annotation.AutowiredAnnotationBeanPostProcessor.postProcessPropertyValues(AutowiredAnnotationBeanPostProcessor.java:331)n ... 26 morenCaused by: org.springframework.beans.factory.NoSuchBeanDefinitionException: No qualifying bean of type [cn.jscoin.jslj.mapper.UserMapper] found for dependency: expected at least 1 bean which qualifies as autowire candidate for this dependency. Dependency annotations: @org.springframework.beans.factory.annotation.Autowired(required=true)n at org.springframework.beans.factory.support.DefaultListableBeanFactory.raiseNoSuchBeanDefinitionException(DefaultListableBeanFactory.java:1308)n at org.springframework.beans.factory.support.DefaultListableBeanFactory.doResolveDependency(DefaultListableBeanFactory.java:1054)n at org.springframework.beans.factory.support.DefaultListableBeanFactory.resolveDependency(DefaultListableBeanFactory.java:949)n at org.springframework.beans.factory.annotation.AutowiredAnnotationBeanPostProcessor$AutowiredFieldElement.inject(AutowiredAnnotationBeanPostProcessor.java:530)n ... 28 moren测试代码n```n @RunWith(SpringJUnit4ClassRunner.class)n@ContextConfiguration(locations="classpath*:applicationContext.xml")npublic class UserTest nn @Autowiredn private UserMapper userMapper;n n @Testn public void testAdd()n User user = new User();n user.setAge(123);n userMapper.add(user);n n nn```n![配置文件位置](https://img-ask.csdn.net/upload/201704/13/1492074774_341390.png)napplicationContext.xmlnn nn n n n n n n n n n n n n classpath:jdbc.propertiesn n n n n n n n n n n nn n n n n n n n n n n
大神求助 python解析json文件出错
url = r'http://pic.sogou.com/pics?query=%B7%E7%BE%B0%CD%BC&mode=1&dm=3&leftp=44230501&cwidth=&cheight=&start=0&reqType=ajax&reqFrom=result'rnhtml = urllib.request.urlopen(url)rnresponse = html.read()rnhjson = json.loads(response)rnprint(hjson["query"])rnrnrn报错:rnUnicodeDecodeError: 'utf-8' codec can't decode byte 0xb7 in position 100: invalid start bytern
数据库安装
>我是xp系统,装了一个sql2005 express 版..由于特殊原因,我又把它卸了...rn>现在在装提示:硬件条件不够,硬盘空间肯定够了.rn>计算机管理中的服务和应用程序提示rn>管理单元初始化失败rn>名称:sql server configuration mangagerrn>CLSID:CA9F8727-31DF-41D2-975C-887D84903967rn>如何解决?????????????rn>系统肯定不能做.rn>rn
数据库安装
我做了一个程序,数据库是sql2000的,我想做一个安装包把<em>数据库安装</em>好,不知道怎样做。我看见用友的<em>数据库安装</em>很方便,不知道是怎么做的。rn谢谢!!
Mfc 简单的通讯模型(select模型)出错出错出错出错!!!大神大神大神快来!!!!
关键代码::rnBOOL CMfcSelectServerDlg::OnInitDialog()rnrn ...rn ...rn ...rn int len=sizeof(SOCKADDR);rn OnInitSocket();rn HWND *lParameter=&m_hWnd;rnrn HANDLE AcceptThread=CreateThread(NULL,0,AcceptProc,(LPVOID)lParameter,0,NULL);//此线程用来不断accept 客户rn HANDLE WorkerThread=CreateThread(NULL,0,WorkerProc,(LPVOID)lParameter,0,NULL);//此线程用来处理收到的数据rn CloseHandle(AcceptThread);rn CloseHandle(WorkerThread);rnrn return true;rn}rnrnDWORD WINAPI CMfcSelectServerDlg::AcceptProc(rn LPVOID lpParameter)rnrn SOCKADDR_IN ClientAddr;rn int len=sizeof(SOCKADDR);rn HWND* lphwnd=(HWND*)lpParameter[color=#FF0000];//取出对话框句柄[/color] SOCKET ClientSock;rn rn while(true)rn rn char buf[50];rn ClientSock=accept(m_ListenSock,(SOCKADDR*)&ClientAddr,&len);rn rn sprintf(buf,"\n Accepted ClientUser:%s:%d",inet_ntoa(ClientAddr.sin_addr),ntohs(ClientAddr.sin_port));rn ClientSockArr[num_conn]=ClientSock;rn num_conn++;rn ::PostMessage(*lphwnd,UM_SOCK,0,(LPARAM)buf);rn rn return 0;rnrnrnDWORD WINAPI CMfcSelectServerDlg::WorkerProc(rn LPVOID lpParameter)rnrn HWND* lphwnd=(HWND*)lpParameter;//[color=#FF0000]取出对话框句柄[/color] int i;rn fd_set fdread;rn int ret;rn struct timeval tv = 1, 0;rn char buf[300];rn while(true)rn rn FD_ZERO(&fdread);rn for(i=0;i
关于数据库安装出错的问题??????在线等急.......
<em>数据库安装</em>程序制作完成后在安装的过程中<em>出错</em>。rn首先是一个非法操作<em>出错</em>点关闭后出现application errorrnexception eolesyserror in module deldata.exe at 000910d1rn类没有注册rn这是怎么回事啊请各位帮帮忙.
大神帮我看一下这是什么问题,SQL server 2008配置出错
[img=https://img-bbs.csdn.net/upload/201311/24/1385303462_538899.png][/img]rn如图,安装完SQL server<em>2008</em>第一次还能用,第二次就不行了,因为这个配置启动不了了。这已经是第二次安装SQL server <em>2008</em>了,和第一次安装的情况是一样的
sql2000中文版数据库安装出错,提示“网络错误……”
我的机器是win2000 advanced server 中文版,可是现在怎么就装不了了呢,rn原来可以装的,现在怎么就不行了呢,请指教rn伤心死了,
数据库安装出错,高手进来拿分呀。
无法安装SQL2000,最后更新时提示,无法找到什么动态链接库,不能安装。急呀。
求助大神求助!!
三月 22, 2013 5:05:29 下午 org.apache.jasper.compiler.TldLocationsCache tldScanJarrnINFO: At least one JAR was scanned for TLDs yet contained no TLDs. Enable debug logging for this logger for a complete list of JARs that were scanned but no TLDs were found in them. Skipping unneeded JARs during scanning can improve startup time and JSP compilation time.rnrnrnrnrnrnrn还有就是 我在Action里面能取到值,使用OGNL表达式迭代的时候,就取不出来值了!! 我表里的字段是这样的rnrn[code=java]System.out.println((list.get(i)).getPE_ID()+"....."+(list.get(i)).getNAMECODE()+"....."+(list.get(i)).getAGE()+"....."+(list.get(i)).getAliasName()+"....."+(list.get(i)).getAliasNameCode()+"....."+(list.get(i)).getBARCODE()+"....."+(list.get(i)).getBIRTH_ADDRESS()+"....."+(list.get(i)).getBLOOD_TYPE());[/code]rnrnrnrn[code=java]0134406.....ZHANG BAO SHAN.....null.....null.....null.....134406.....上海市.....rn1..........null...............1..........rn1 32366.....ZHANG XIA.....null.....null.....null.....1 32366.....江苏省无锡市.....rn10..........null...............10..........rn100763.....ZHENG YOU XIAO.....null.....null.....null.....100763..........rn10085.....WANG ZI.....null.....null.....null.....10085.....410400.....rn10085.....WANG ZI.....null.....null.....null.....10085.....410400.....[/code]rnrnrn里面可以为空的!rnrn代码:rn[code=java]public String execute() throws Exceptionrn Map requests = (Map)ActionContext.getContext().get("request");rn requests.put("lists", this.service.getPeIndex());rn System.out.println(requests.size());rn List list = this.service.getPeIndex();rn System.out.println("ListPeIndexAction.....");rn rn for(int i= 0;irn rn rn rn rn rn rn//上面也不能输出字符!!求<em>大神</em>帮忙(这个只不过是一部分代码)rn rn 无 rn rn rn rn rnrnrn rn rn 无rn rn rn rn rn rn rn rn 无rn rn rn rn rn [/code]
求助,,,求助,,,求大神
vbox虚拟机安装到电脑上为啥根本打不开,,,,求<em>大神</em>指导[img=https://forum.csdn.net/PointForum/ui/scripts/csdn/Plugin/001/face/54.gif][/img],还有在安装过程出现这个图片是什么意思。[img=https://img-bbs.csdn.net/upload/201609/11/1473585774_810192.png][/img]
sql 2008安装出错
我是win7的系统,装了visual studio 2010,然后我找到了里面的SQL server <em>2008</em>安装中心进行安装,流程如下:rnSQL server <em>2008</em>安装中心->安装->全新的sql独立安装,然后就弹出一个对话框让我选安装文件夹,可无论我选哪个rn文件夹老是提示不是有效的安装文件夹,这是为什么呀???大家帮个忙呗
安装sql 2008出错
[img=https://img-bbs.csdn.net/upload/201609/02/1472794188_588605.jpg][/img]rn安装sql <em>2008</em>出现这个错误,请问怎么解决才能安装成功?
求助大神
在使用opencv-python的时候总是报这个错是什么意思? cv2.error:OpenCV(4.0.1)d:\build\opencv\opencv4.0.1\modules\imgproc\src\color.cpp:181: error: (-215:Assertion failed) !_src.empty() in function ‘cv::cvtColor’ ...
大神求助
select * from t_resident where username in("xxx","xx");rnusername 是个varchar2,"xxx"(varchar2),"xx"(varchar2)是根据select语句查询出的所以不能使用orrn怎么实现:rnselect * from t_resident where id in("xxx","xx");一样的功能但是不是id而是username.
求助大神!!!!!!
老师布置了个任务。要在自己的电脑上搭建个online judge,百度了半天也找不出什么有用的信息。。。哪位<em>大神</em>会。说一下
求助大神!!!!
Error:14:04:41.976 [ERROR] [org.gradle.api.Project] G:\Program Files\Android\Android Studio\gradle\m2repository\com\android\tools\build\gradle\caches\transforms-1\files-1.1\appcompat-v7-26.1.0.aar\9a1
求助大神。。。
我在Linux下写一个算法,需要 new来分配内存,刚开始程序正常运行但是用着用着突然就出现了 std::bad_allocrn应该怎么处理阿[img=https://forum.csdn.net/PointForum/ui/scripts/csdn/Plugin/003/monkey/8.gif][/img]
求助大神
<em>求助</em>各位<em>大神</em>一个问题:rnrn库存子系统的Mysql(或Oracle)数据库里有张库存表rnID 商品ID 仓库ID 仓库库存量 累计卖出量rn1 Sku001 Store001 10000 129rn2 Sku002 Store001 13000 750rn功能性需求:当前store001的多个的商品在做抢购业务,需要您在库存子系统里设计一个库存扣减的服务API给订单子系统使用,当订单创建时,实时调用库存扣减的API,更新库存表的累计卖出量,如果累计卖出量超出仓库库存量,则库存扣减失败。rn非功能性要求:rn1)库存子系统采用10个节点的集群方式部署,有多个Java进程对外提供库存扣减API,需要解决并发修改数据的脏读和脏写的问题rn2)库存扣减API需要实现幂等性,当订单模块多次相同的报文请求库存扣减时,只扣减一次,重复扣减的报文请求返回扣减成功。rn3)库存子系统的每1个APP部署节点,需要达到1000TPS的库存扣减的性能要求(1秒内完成1000笔库存扣减)rn部署硬件清单:rn1) Mysql部署的虚拟机 8C 64G 1台rn2) java应用部署的虚拟机2C 4G 10台rn3) eureka服务发现服务器共用,订单子系统从eureka拿到库存子系统的10个节点的IP地址清单后,采用轮询IP的方式调用库存子系统的APIrn4) 不能再使用memcached或redis等其他第三方软件rn针对以上的要求,请给出库存扣减的服务API的核心设计思想(10分)和API接口定义(10分)及代码实现概要rnrn请<em>大神</em>赐教,谢谢了[img=https://forum.csdn.net/PointForum/ui/scripts/csdn/Plugin/003/monkey/15.gif][/img]
求助大神
我的电脑不知道什么时候开始就是识别不了U盘了,不是所有的都不能识别,是之前在我电脑上插过的U盘可以,但是换成其他的U盘就不行了,所有的接口都试了,是不是电脑本身硬件出问题啦?
求助大神!!!!!!!!!!!!!!!!!!!!!!!!!!!!!!!!!!!!!!!!!!!
request.setAttribute("sdi_id", sdi_id);rnrnjs获取var sdi=$jsonSdiStr ;本来应该传的值为001,但是传过来的只是1,前面的00没有了,rnrn求<em>大神</em>指点,不胜感激
大神求助~~~~~~
10:19:04 **** Clean-only build of configuration Debug for project hello ****rn[color=#FF0000]make clean rnmake: *** No rule to make target `clean'. Stop.rn[/color]rn10:19:04 Build Finished (took 219ms)rnrn10:19:04 **** Build of configuration Debug for project hello ****rnmake all rn'Building file: ../project/src/main.c'rn'Invoking: Cross GCC Compiler'rnarm-none-linux-gnueabi-gcc -I"F:\EclipseForCenterm_1.04\Code\hello\project\inc" -I"F:\EclipseForCenterm_1.04\Code\hello\project\lib" -I"F:\EclipseForCenterm_1.04\EclipseForCenterm\Compiler\alps_lib\FrameWork_API\lib" -I"F:\EclipseForCenterm_1.04\EclipseForCenterm\Compiler\alps_lib\FrameWork_API\inc" -I"F:\EclipseForCenterm_1.04\EclipseForCenterm\Compiler\alps_lib\AppLib_API" -I"F:\EclipseForCenterm_1.04\EclipseForCenterm\Compiler\alps_lib\CTBSP_API" -I"F:\EclipseForCenterm_1.04\EclipseForCenterm\Compiler\alps_lib\AppLib_so" -O0 -g3 -Wall -c -fmessage-length=0 -MMD -MP -MF"project/src/main.d" -MT"project/src/main.d" -o "project/src/main.o" "../project/src/main.c"rnIn file included from F:\EclipseForCenterm_1.04\EclipseForCenterm\Compiler\alps_lib\FrameWork_API\inc/mui.h:13:0,rn from F:\EclipseForCenterm_1.04\EclipseForCenterm\Compiler\alps_lib\FrameWork_API\inc/CtLinuxPosCommonApi.h:18,rn from ../project/src/main.c:1:rnC:\MinGW\include/time.h:240:16: error: expected '=', ',', ';', 'asm' or '__attribute__' before 'char'rnIn file included from F:\EclipseForCenterm_1.04\EclipseForCenterm\Compiler\alps_lib\FrameWork_API\inc/Peripherals.h:12:0,rn from F:\EclipseForCenterm_1.04\EclipseForCenterm\Compiler\alps_lib\FrameWork_API\inc/CtLinuxPosCommonApi.h:19,rn from ../project/src/main.c:1:rnC:\MinGW\include/unistd.h:79:1: error: expected ',' or ';' before 'int'rnIn file included from F:\EclipseForCenterm_1.04\EclipseForCenterm\Compiler\alps_lib\FrameWork_API\inc/Peripherals.h:12:0,rn from F:\EclipseForCenterm_1.04\EclipseForCenterm\Compiler\alps_lib\FrameWork_API\inc/CtLinuxPosCommonApi.h:19,rn from ../project/src/main.c:1:rnC:\MinGW\include/unistd.h:105:1: error: expected ',' or ';' before 'int'rnC:\MinGW\include/unistd.h:125:28: error: expected ',' or ';' before 'usleep'rnC:\MinGW\include/unistd.h:138:10: error: conflicting types for '_cdecl'rnC:\MinGW\include/unistd.h:125:5: note: previous declaration of '_cdecl' was herernC:\MinGW\include/unistd.h:138:33: error: expected ',' or ';' before 'sleep'rnC:\MinGW\include/unistd.h:153:12: error: expected '=', ',', ';', 'asm' or '__attribute__' before 'ftruncate'rnIn file included from f:\eclipseforcenterm_1.04\eclipseforcenterm\compiler\arm-2011.03_for_windows\bin\../arm-none-linux-gnueabi/libc/usr/include/sys/socket.h:40:0,rn from f:\eclipseforcenterm_1.04\eclipseforcenterm\compiler\arm-2011.03_for_windows\bin\../arm-none-linux-gnueabi/libc/usr/include/netinet/in.h:25,rn from f:\eclipseforcenterm_1.04\eclipseforcenterm\compiler\arm-2011.03_for_windows\bin\../arm-none-linux-gnueabi/libc/usr/include/arpa/inet.h:23,rn from F:\EclipseForCenterm_1.04\EclipseForCenterm\Compiler\alps_lib\FrameWork_API\inc/ril.h:4162,rn from F:\EclipseForCenterm_1.04\EclipseForCenterm\Compiler\alps_lib\FrameWork_API\inc/CtLinuxPosCommonApi.h:21,rn from ../project/src/main.c:1:rnf:\eclipseforcenterm_1.04\eclipseforcenterm\compiler\arm-2011.03_for_windows\bin\../arm-none-linux-gnueabi/libc/usr/include/bits/socket.h:35:21: error: expected '=', ',', ';', 'asm' or '__attribute__' before 'socklen_t'rnIn file included from f:\eclipseforcenterm_1.04\eclipseforcenterm\compiler\arm-2011.03_for_windows\bin\../arm-none-linux-gnueabi/libc/usr/include/sys/socket.h:40:0,rn from f:\eclipseforcenterm_1.04\eclipseforcenterm\compiler\arm-2011.03_for_windows\bin\../arm-none-linux-gnueabi/libc/usr/include/netinet/in.h:25,rn from f:\eclipseforcenterm_1.04\eclipseforcenterm\compiler\arm-2011.03_for_windows\bin\../arm-none-linux-gnueabi/libc/usr/include/arpa/inet.h:23,rn from F:\EclipseForCenterm_1.04\EclipseForCenterm\Compiler\alps_lib\FrameWork_API\inc/ril.h:4162,rn from F:\EclipseForCenterm_1.04\EclipseForCenterm\Compiler\alps_lib\FrameWork_API\inc/CtLinuxPosCommonApi.h:21,rn from ../project/src/main.c:1:rnf:\eclipseforcenterm_1.04\eclipseforcenterm\compiler\arm-2011.03_for_windows\bin\../arm-none-linux-gnueabi/libc/usr/include/bits/socket.h:254:5: error: expected specifier-qualifier-list before 'socklen_t'rnIn file included from f:\eclipseforcenterm_1.04\eclipseforcenterm\compiler\arm-2011.03_for_windows\bin\../arm-none-linux-gnueabi/libc/usr/include/netinet/in.h:25:0,rn from f:\eclipseforcenterm_1.04\eclipseforcenterm\compiler\arm-2011.03_for_windows\bin\../arm-none-linux-gnueabi/libc/usr/include/arpa/inet.h:23,rn from F:\EclipseForCenterm_1.04\EclipseForCenterm\Compiler\alps_lib\FrameWork_API\inc/ril.h:4162,rn from F:\EclipseForCenterm_1.04\EclipseForCenterm\Compiler\alps_lib\FrameWork_API\inc/CtLinuxPosCommonApi.h:21,rn from ../project/src/main.c:1:rnf:\eclipseforcenterm_1.04\eclipseforcenterm\compiler\arm-2011.03_for_windows\bin\../arm-none-linux-gnueabi/libc/usr/include/sys/socket.h:115:57: error: expected declaration specifiers or '...' before 'socklen_t'rnf:\eclipseforcenterm_1.04\eclipseforcenterm\compiler\arm-2011.03_for_windows\bin\../arm-none-linux-gnueabi/libc/usr/include/sys/socket.h:120:4: error: expected declaration specifiers or '...' before 'socklen_t'rnf:\eclipseforcenterm_1.04\eclipseforcenterm\compiler\arm-2011.03_for_windows\bin\../arm-none-linux-gnueabi/libc/usr/include/sys/socket.h:129:60: error: expected declaration specifiers or '...' before 'socklen_t'rnf:\eclipseforcenterm_1.04\eclipseforcenterm\compiler\arm-2011.03_for_windows\bin\../arm-none-linux-gnueabi/libc/usr/include/sys/socket.h:134:4: error: expected declaration specifiers or '...' before 'socklen_t'rnf:\eclipseforcenterm_1.04\eclipseforcenterm\compiler\arm-2011.03_for_windows\bin\../arm-none-linux-gnueabi/libc/usr/include/sys/socket.h:157:10: error: expected declaration specifiers or '...' before 'socklen_t'rnf:\eclipseforcenterm_1.04\eclipseforcenterm\compiler\arm-2011.03_for_windows\bin\../arm-none-linux-gnueabi/libc/usr/include/sys/socket.h:168:5: error: expected declaration specifiers or '...' before 'socklen_t'rnf:\eclipseforcenterm_1.04\eclipseforcenterm\compiler\arm-2011.03_for_windows\bin\../arm-none-linux-gnueabi/libc/usr/include/sys/socket.h:192:10: error: expected declaration specifiers or '...' before 'socklen_t'rnf:\eclipseforcenterm_1.04\eclipseforcenterm\compiler\arm-2011.03_for_windows\bin\../arm-none-linux-gnueabi/libc/usr/include/sys/socket.h:198:34: error: expected declaration specifiers or '...' before 'socklen_t'rnf:\eclipseforcenterm_1.04\eclipseforcenterm\compiler\arm-2011.03_for_windows\bin\../arm-none-linux-gnueabi/libc/usr/include/sys/socket.h:215:6: error: expected declaration specifiers or '...' before 'socklen_t'rnIn file included from F:\EclipseForCenterm_1.04\EclipseForCenterm\Compiler\alps_lib\FrameWork_API\inc/ril.h:4162:0,rn from F:\EclipseForCenterm_1.04\EclipseForCenterm\Compiler\alps_lib\FrameWork_API\inc/CtLinuxPosCommonApi.h:21,rn from ../project/src/main.c:1:rnf:\eclipseforcenterm_1.04\eclipseforcenterm\compiler\arm-2011.03_for_windows\bin\../arm-none-linux-gnueabi/libc/usr/include/arpa/inet.h:66:29: error: expected declaration specifiers or '...' before 'socklen_t'rnIn file included from ../project/src/main.c:1:0:rnF:\EclipseForCenterm_1.04\EclipseForCenterm\Compiler\alps_lib\FrameWork_API\inc/CtLinuxPosCommonApi.h:26:33: warning: extra tokens at end of #include directivern[color=#FF0000]make: *** [project/src/main.o] Error 1[/color]rnrn10:19:06 Build Finished (took 2s.281ms)rnrnrn我用eclipse搭建的C开发环境,新建一个工程直接build就报上面的错了!急求<em>大神</em>指点
大神求助。。。、、
# include rn# include rnrnint main(void)rnrn int a[5];rn int i;rn double k;rn rn for(i=1; i rn There are no conversions to array types, although there are conversions to references or pointers to arraysrnError executing cl.exe.rnrnqqccc.exe - 1 error(s), 0 warning(s)rn这个问题我还不会。。。。求帮忙
大神求助!
小弟最近再做一个ssh的博客项目,遇到一个问题:rn数据库中存放了博客文章的内容rn想从url直接访问博客文章rn具体怎么实现rn感激不尽啊rn
大神求助
求一个VC++编写的MFC软件。适合大一结束结业的作业,可以是一个管理系统,可以是查询系统,要现成的,步骤越详细越好,先谢谢了,
求助大神。。。。。。。。
开发安卓系统用java什么版本好。。<em>求助</em><em>大神</em>。。。。。。。。。。。。。。。。。。。。
求助!!!大神
[img=https://img-bbs.csdn.net/upload/201606/27/1467033404_337808.png][/img]rnrnrnrn这些错误是什么问题引起的?rn 新装了一次软件,打开原来编译通过的程序,结果竟然出现了,请<em>大神</em>指导一下,不胜感激!!!!!
大神求助》》》
[url=http://www.unlimax.com/jira.html][/url] 这个页面的顶部图怎么做到的。
求助大神。。
非常简单的,就是调用一个外部程序。然而却出现rn[color=#FF0000]CS0234 命名空间“System.Diagnostics”中不存在类型或命名空间名“Process”(是否缺少程序集引用?)[/color]rn网上搜索好像添加.net引用。。可是WIN10通用程序开发,我就找不到这个东西。。只有个“mircosoft .net native”可是并没有什么卵用。。。本人绝对菜鸟。。。就是想玩玩而已。。莫喷。rn(是C#开发 )
SQL 2008 连接出错
昨天我还用得好好的。用这个来练习sql50个句子里面的语句。。可是今天不知怎么的就不行了。。rnrn另外我要说的是我昨天下午的时候装了一个德国的小红帽的杀毒软件。。今天却不可以,我用windows身份登录和sa登录都不可以。rnrn下面是代码rnrn===================================rnrn无法连接到 KING。rnrn===================================rnrn在与 SQL Server 建立连接时出现与网络相关的或特定于实例的错误。未找到或无法访问服务器。请验证实例名称是否正确并且 SQL Server 已配置为允许远程连接。 (provider: 命名管道提供程序, error: 40 - 无法打开到 SQL Server 的连接) (.Net SqlClient Data Provider)rnrn------------------------------rn有关帮助信息,请单击: http://go.microsoft.com/fwlink?ProdName=Microsoft+SQL+Server&EvtSrc=MSSQLServer&EvtID=2&LinkId=20476rnrn------------------------------rn错误号: 2rn严重性: 20rn状态: 0rnrnrn------------------------------rn程序位置:rnrn 在 System.Data.SqlClient.SqlInternalConnection.OnError(SqlException exception, Boolean breakConnection)rn 在 System.Data.SqlClient.TdsParser.ThrowExceptionAndWarning(TdsParserStateObject stateObj)rn 在 System.Data.SqlClient.TdsParser.Connect(ServerInfo serverInfo, SqlInternalConnectionTds connHandler, Boolean ignoreSniOpenTimeout, Int64 timerExpire, Boolean encrypt, Boolean trustServerCert, Boolean integratedSecurity, SqlConnection owningObject)rn 在 System.Data.SqlClient.SqlInternalConnectionTds.AttemptOneLogin(ServerInfo serverInfo, String newPassword, Boolean ignoreSniOpenTimeout, Int64 timerExpire, SqlConnection owningObject)rn 在 System.Data.SqlClient.SqlInternalConnectionTds.LoginNoFailover(String host, String newPassword, Boolean redirectedUserInstance, SqlConnection owningObject, SqlConnectionString connectionOptions, Int64 timerStart)rn 在 System.Data.SqlClient.SqlInternalConnectionTds.OpenLoginEnlist(SqlConnection owningObject, SqlConnectionString connectionOptions, String newPassword, Boolean redirectedUserInstance)rn 在 System.Data.SqlClient.SqlInternalConnectionTds..ctor(DbConnectionPoolIdentity identity, SqlConnectionString connectionOptions, Object providerInfo, String newPassword, SqlConnection owningObject, Boolean redirectedUserInstance)rn 在 System.Data.SqlClient.SqlConnectionFactory.CreateConnection(DbConnectionOptions options, Object poolGroupProviderInfo, DbConnectionPool pool, DbConnection owningConnection)rn 在 System.Data.ProviderBase.DbConnectionFactory.CreateNonPooledConnection(DbConnection owningConnection, DbConnectionPoolGroup poolGroup)rn 在 System.Data.ProviderBase.DbConnectionFactory.GetConnection(DbConnection owningConnection)rn 在 System.Data.ProviderBase.DbConnectionClosed.OpenConnection(DbConnection outerConnection, DbConnectionFactory connectionFactory)rn 在 System.Data.SqlClient.SqlConnection.Open()rn 在 Microsoft.SqlServer.Management.UI.VSIntegration.ObjectExplorer.ObjectExplorer.ValidateConnection(UIConnectionInfo ci, IServerType server)rn 在 Microsoft.SqlServer.Management.UI.ConnectionDlg.Connector.ConnectionThreadUser()rnrn
2008还原出错
各位大虾,我刚装了SQL<em>2008</em>,还原时提示错误,请大虾们帮忙,错误提示为:rnrn还原 对于 服务器“F5052FEBBA4F445”失败。 (Microsoft.SqlServer.SmoExtended)rnrn有关帮助信息,请单击: http://go.microsoft.com/fwlink?ProdName=Microsoft+SQL+Server&ProdVer=10.0.1600.22+((SQL_PreRelease).080709-1414+)&EvtSrc=Microsoft.SqlServer.Management.Smo.ExceptionTemplates.FailedOperationExceptionText&EvtID=还原+Server&LinkId=20476rnrn------------------------------rn其他信息:rnrnSystem.Data.SqlClient.SqlError: 尚未备份数据库 "tb" 的日志尾部。如果该日志包含您不希望丢失的工作,请使用 BACKUP LOG WITH NORECOVERY 备份该日志。请使用 RESTORE 语句的 WITH REPLACE 或 WITH STOPAT 子句来只覆盖该日志的内容。 (Microsoft.SqlServer.Smo)rnrnrnrn
Sql 2008 登陆出错
[img=https://img-bbs.csdn.net/upload/201408/04/1407119932_455835.png][/img]rnrn刚重装的电脑装上SQL之后本来还能用 刚把数据库还原 装上VS之后 就变这样啦rn求<em>大神</em>帮忙解决一下
VS 2008编译时出错
正在编译...rnMainFrm.cpprn正在链接...rnLINK : fatal error LNK1000: Internal error during IncrBuildImagrn Version 9.00.21022.08rn ExceptionCode = C0000005rn ExceptionFlags = 00000000rn ExceptionAddress = 00A4FCF7 (009D0000) "D:\Visual Studio\VC\bin\link.exe"rn NumberParameters = 00000002rn ExceptionInformation[ 0] = 00000000rn ExceptionInformation[ 1] = 00C6D670rnCONTEXT:rn Eax = 40122E4C Esp = 0018EC0Crn Ebx = 40008164 Ebp = 0018EC34rn Ecx = 00C6D670 Esi = 40122CE0rn Edx = 0018EC24 Edi = 009DD6C0rn Eip = 00A4FCF7 EFlags = 00010246rn SegCs = 0000001B SegDs = 00000023rn SegSs = 00000023 SegEs = 00000023rn SegFs = 0000003B SegGs = 00000000rn Dr0 = 00000000 Dr3 = 00000000rn Dr1 = 00000000 Dr6 = 00000000rn Dr2 = 00000000 Dr7 = 00000000rn生成日志保存在“file://h:\VC<em>2008</em>\Exit\Exit\Debug\BuildLog.htm”rnExit - 1 个错误,0 个警告rn========== 生成: 成功 0 个,失败 1 个,最新 0 个,跳过 0 个 ==========rn请教一下要怎么解决?
求助大神......
求<em>大神</em>帮我解答一下下…实在找不到人帮我了 题目要求为:输出分数为80分以上的学生学号和成绩;谢谢,万分感谢,磕头跪谢;
求助大神 VB大神 安在???
临近期末 老师要让交作业啊rn由于自己学期基本在外面跑 没怎么好好上课rn烦请诸位<em>大神</em>帮助 rn第一把txt里面的信息转到exl里面rn第二怎么样在exl里面把一些单元格的文件提取出来rn本来是一些书目 就是要包这些书目精简一下rn通过vb来实现rn下面是 文件格式 红色部分是书目的各项名称rn黑色部分是内容 总共有500条吧 后面要提取的内容有 PT AU TI SO LA DE AB FU CR TC PU CN DI PY SCrn[color=#FF0000]PT AU BA ED GP AF CA TI SO SE LA DT CT CY CL SP HO DE ID AB C1 RP EM FU FX CR NR TC PU PI PA SN BN DI J9 JI PD PY VL IS PN SU SI BP EP AR DI PG SC GA UT[/color]rnJ "Li, KJ; Xu, JC; Liu, XH; Gao, PX; Zhan, LS" "Li, K. J.; Xu, J. C.; Liu, X. H.; Gao, P. X.; Zhan, L. S." Periodicity of Total Solar Irradiance SOLAR PHYSICS English Article Solar irradiance; Solar cycle; Observations MAUNDER MINIMUM; MAGNETIC-FIELD; CYCLES 21-23; CLIMATE; VARIABILITY; TREND; RECONSTRUCTION; LUMINOSITY "We investigate the periodicity in the PMOD composite of the daily total solar irradiance (TSI) from 21 September 1978 to 9 June 2009. Besides the Schwabe cycle period (10.32 years), the quasi-rotation period is found to be statistically significant in TSI, whose value is about 32 days, longer than that in sunspot activity (27 days), and it intermittently appears around the sunspot maximum times. The quasi-rotation period in TSI is inferred to be mainly caused by sunspot activity, but to be modulated by bright features as well. It was previously found that variations of TSI over a Schwabe solar cycle mainly come from the combination of the sunspots' blocking and the intensification due to bright faculae, plages, and network elements, with a slight dominance of the bright-feature effect during the maximum of the Schwabe cycle. For the sunspot-blocking and the bright-feature effect to contribute to TSI over a Schwabe solar cycle, the former is inferred to lead the latter by 29 days at least." "[Li, K. J.; Xu, J. C.; Gao, P. X.] CAS, Yunnan Observ, Natl Astron Observ, Kunming 650011, Peoples R China; [Li, K. J.] Chinese Acad Sci, Key Lab Solar Act, Natl Astron Observ, Beijing 100012, Peoples R China; [Xu, J. C.; Gao, P. X.] CAS, Grad Sch, Beijing 100863, Peoples R China; [Liu, X. H.] Jiaozuo Adv Normal Coll, Dept Phys, Jiaozuo 454107, Peoples R China; [Zhan, L. S.] Jingdezhen Ceram Inst, Jingdezhen 333001, Jiangxi, Peoples R China" "Li, KJ, CAS, Yunnan Observ, Natl Astron Observ, Kunming 650011, Peoples R China" lkj@mail.ynao.ac.cn; gpx@mail.ynao.ac.cn "Natural Science Funds of China [10873032, 10921303, 40636031, 11073010]; 973 project [2006CB806300]; Chinese Academy of Sciences " "We thank the anonymous referees for their careful reading of the manuscript and constructive comments which improved the original version of the manuscript. The authors thank PMOD/WRC, Davos, Switzerland, for making available the data set of total solar irradiance measurements (version d41-62-0906), comprising composite irradiance values since 1978, which includes unpublished data from the VIRGO Experiment on the cooperative ESA/NASA SOHO Mission. This work is supported by the Natural Science Funds of China (10873032, 10921303, 40636031, and 11073010), the 973 project (2006CB806300), and the Chinese Academy of Sciences." "BOND G, 2001, SCIENCE, V294, P2130; CHAPMAN GA, 1987, ANNU REV ASTRON ASTR, V25, P633; COUGHLIN K, 2004, J GEOPHYS RES-ATMOS, V109, ARTN D21105; DAMERIS M, 2006, GEOPHYS RES LETT, V33, ARTN L03806; DEWITTE S, 2004, SOL PHYS, V224, P209, DOI 10.1007/s11207-005-5698-7; DOMINGO V, 2009, SPACE SCI REV, V145, P337, DOI 10.1007/s11214-009-9562-1; EDDY JA, 1976, SCIENCE, V192, P1189; EGOROVA T, 2005, ADV SPACE RES, V35, P451, DOI 10.1016/j.asr.2005.01.048; FONTENLA J, 1999, ASTROPHYS J 1, V518, P480; FROHLICH C, 1998, GEOPHYS RES LETT, V25, P4377; FROHLICH C, 2000, SPACE SCI REV, V94, P15; FROHLICH C, 2003, METROLOGIA, V40, S60; FROHLICH C, 2006, SPACE SCI REV, V125, P53, DOI 10.1007/s11214-006-9046-5; FROHLICH C, 2009, ASTRON ASTROPHYS, V501, L27, DOI 10.1051/0004-6361/200912318; HAIGH JD, 1996, SCIENCE, V272, P981; HAIGH JD, 2001, SCIENCE, V294, P2109; HUDSON HS, 1982, SOL PHYS, V76, P211; KRIVOVA NA, 2007, ASTRON ASTROPHYS, V467, P335, DOI 10.1051/0004-6361:20066725; KRIVOVA NA, <em>2008</em>, J ASTROPHYS ASTRON, V29, P151; KURODA Y, 2005, GEOPHYS RES LETT, V32, ARTN L13802; LEE RB, 1995, J GEOPHYS RES, V100, P1667; LOCKWOOD M, 1999, NATURE, V399, P437; LOCKWOOD M, 2005, SAAS FEE ADV COURSE, V34, P109; MEKAOUI S, <em>2008</em>, SOL PHYS, V247, P203, DOI 10.1007/s11207-007-9070-y; MENDOZA B, 2005, ADV SPACE RES, V35, P882, DOI 10.1016/j.asr.2004.10.011; PAP J, 1990, SOL PHYS, V129, P165; REID GC, 1987, NATURE, V329, P142; RIND D, 2002, SCIENCE, V296, P673; SOLANKI SK, 2000, NATURE, V408, P445; SOLANKI SK, 2003, ESA SP PUBL, V535, P285; SOLANKI SK, 2004, SOL PHYS, V224, P197, DOI 10.1007/s11207-005-6499-8; TORRENCE C, 1998, B AM METEOROL SOC, V79, P61; VAZQUEZ RH, 2006, ESA, P69; WENZLER T, 2006, ASTRON ASTROPHYS, V460, P583, DOI 10.1051/0004-6361:20065752; WILLSON RC, 1988, NATURE, V332, P810; WILLSON RC, 1991, NATURE, V351, P42; WILLSON RC, 1997, SCIENCE, V277, P1963; WILLSON RC, 2003, GEOPHYS RES LETT, V30, ARTN 1199; WOLFF CL, 1987, SOL PHYS, V109, P1" 39 0 SPRINGER DORDRECHT "VAN GODEWIJCKSTRAAT 30, 3311 GZ DORDRECHT, NETHERLANDS" 0038-0938 10.1007/s11207-010-9655-8 SOL PHYS Sol. Phys. DEC 2010 267 2 295 303 9 Astronomy & Astrophysics 687ID ISI:000284771300006
关于SQL server 2008备份失败问题,求助各位大神!!!
<em>求助</em>各位<em>大神</em>,SQL server<em>2008</em>几个数据库一起自动备份很久了都没出现问题的,今天突然有一个数据库出现了问题。如图所示:[img=https://img-bbs.csdn.net/upload/201708/14/1502698800_1450
网站出错大神求职!
org.apache.jasper.JasperException: The absolute uri: http://java.sun.com/jsp/jstl/core cannot be resolved in either web.xml or the jar files deployed with this applicationrn org.apache.jasper.compiler.DefaultErrorHandler.jspError(DefaultErrorHandler.java:51)rn org.apache.jasper.compiler.ErrorDispatcher.dispatch(ErrorDispatcher.java:409)rn org.apache.jasper.compiler.ErrorDispatcher.jspError(ErrorDispatcher.java:116)rn org.apache.jasper.compiler.TagLibraryInfoImpl.generateTLDLocation(TagLibraryInfoImpl.java:310)rn org.apache.jasper.compiler.TagLibraryInfoImpl.(TagLibraryInfoImpl.java:152)rn org.apache.jasper.compiler.Parser.parseTaglibDirective(Parser.java:410)rn org.apache.jasper.compiler.Parser.parseDirective(Parser.java:475)rn org.apache.jasper.compiler.Parser.parseElements(Parser.java:1425)rn org.apache.jasper.compiler.Parser.parse(Parser.java:138)rn org.apache.jasper.compiler.ParserController.doParse(ParserController.java:239)rn org.apache.jasper.compiler.ParserController.parse(ParserController.java:102)rn org.apache.jasper.compiler.Compiler.generateJava(Compiler.java:197)rn org.apache.jasper.compiler.Compiler.compile(Compiler.java:365)rn org.apache.jasper.compiler.Compiler.compile(Compiler.java:345)rn org.apache.jasper.compiler.Compiler.compile(Compiler.java:332)rn org.apache.jasper.JspCompilationContext.compile(JspCompilationContext.java:594)rn org.apache.jasper.servlet.JspServletWrapper.service(JspServletWrapper.java:341)rn org.apache.jasper.servlet.JspServlet.serviceJspFile(JspServlet.java:389)rn org.apache.jasper.servlet.JspServlet.service(JspServlet.java:332)rn javax.servlet.http.HttpServlet.service(HttpServlet.java:722)rn com.common.view.filter.ManageFilter.doFilter(ManageFilter.java:37)rn org.apache.struts2.dispatcher.ServletDispatcherResult.doExecute(ServletDispatcherResult.java:157)rn org.apache.struts2.dispatcher.StrutsResultSupport.execute(StrutsResultSupport.java:186)rn com.opensymphony.xwork2.DefaultActionInvocation.executeResult(DefaultActionInvocation.java:373)rn com.opensymphony.xwork2.DefaultActionInvocation.invoke(DefaultActionInvocation.java:277)rn com.opensymphony.xwork2.interceptor.DefaultWorkflowInterceptor.doIntercept(DefaultWorkflowInterceptor.java:176)rn com.opensymphony.xwork2.interceptor.MethodFilterInterceptor.intercept(MethodFilterInterceptor.java:98)rn com.opensymphony.xwork2.DefaultActionInvocation.invoke(DefaultActionInvocation.java:248)rn com.opensymphony.xwork2.validator.ValidationInterceptor.doIntercept(ValidationInterceptor.java:263)rn org.apache.struts2.interceptor.validation.AnnotationValidationInterceptor.doIntercept(AnnotationValidationInterceptor.java:68)rn com.opensymphony.xwork2.interceptor.MethodFilterInterceptor.intercept(MethodFilterInterceptor.java:98)rn com.opensymphony.xwork2.DefaultActionInvocation.invoke(DefaultActionInvocation.java:248)rn com.opensymphony.xwork2.interceptor.ConversionErrorInterceptor.intercept(ConversionErrorInterceptor.java:138)rn com.opensymphony.xwork2.DefaultActionInvocation.invoke(DefaultActionInvocation.java:248)rn com.opensymphony.xwork2.interceptor.ParametersInterceptor.doIntercept(ParametersInterceptor.java:207)rn com.opensymphony.xwork2.interceptor.MethodFilterInterceptor.intercept(MethodFilterInterceptor.java:98)rn com.opensymphony.xwork2.DefaultActionInvocation.invoke(DefaultActionInvocation.java:248)rn com.opensymphony.xwork2.interceptor.ParametersInterceptor.doIntercept(ParametersInterceptor.java:207)rn com.opensymphony.xwork2.interceptor.MethodFilterInterceptor.intercept(MethodFilterInterceptor.java:98)rn com.opensymphony.xwork2.DefaultActionInvocation.invoke(DefaultActionInvocation.java:248)rn com.opensymphony.xwork2.interceptor.StaticParametersInterceptor.intercept(StaticParametersInterceptor.java:190)rn com.opensymphony.xwork2.DefaultActionInvocation.invoke(DefaultActionInvocation.java:248)rn org.apache.struts2.interceptor.MultiselectInterceptor.intercept(MultiselectInterceptor.java:75)rn com.opensymphony.xwork2.DefaultActionInvocation.invoke(DefaultActionInvocation.java:248)rn org.apache.struts2.interceptor.CheckboxInterceptor.intercept(CheckboxInterceptor.java:94)rn com.opensymphony.xwork2.DefaultActionInvocation.invoke(DefaultActionInvocation.java:248)rn org.apache.struts2.interceptor.FileUploadInterceptor.intercept(FileUploadInterceptor.java:243)rn com.opensymphony.xwork2.DefaultActionInvocation.invoke(DefaultActionInvocation.java:248)rn com.opensymphony.xwork2.interceptor.ModelDrivenInterceptor.intercept(ModelDrivenInterceptor.java:100)rn com.opensymphony.xwork2.DefaultActionInvocation.invoke(DefaultActionInvocation.java:248)rn com.opensymphony.xwork2.interceptor.ScopedModelDrivenInterceptor.intercept(ScopedModelDrivenInterceptor.java:141)rn com.opensymphony.xwork2.DefaultActionInvocation.invoke(DefaultActionInvocation.java:248)rn org.apache.struts2.interceptor.debugging.DebuggingInterceptor.intercept(DebuggingInterceptor.java:270)rn com.opensymphony.xwork2.DefaultActionInvocation.invoke(DefaultActionInvocation.java:248)rn com.opensymphony.xwork2.interceptor.ChainingInterceptor.intercept(ChainingInterceptor.java:145)rn com.opensymphony.xwork2.DefaultActionInvocation.invoke(DefaultActionInvocation.java:248)rn com.opensymphony.xwork2.interceptor.PrepareInterceptor.doIntercept(PrepareInterceptor.java:171)rn com.opensymphony.xwork2.interceptor.MethodFilterInterceptor.intercept(MethodFilterInterceptor.java:98)rn com.opensymphony.xwork2.DefaultActionInvocation.invoke(DefaultActionInvocation.java:248)rn com.opensymphony.xwork2.interceptor.I18nInterceptor.intercept(I18nInterceptor.java:176)rn com.opensymphony.xwork2.DefaultActionInvocation.invoke(DefaultActionInvocation.java:248)rn org.apache.struts2.interceptor.ServletConfigInterceptor.intercept(ServletConfigInterceptor.java:164)rn com.opensymphony.xwork2.DefaultActionInvocation.invoke(DefaultActionInvocation.java:248)rn com.opensymphony.xwork2.interceptor.AliasInterceptor.intercept(AliasInterceptor.java:190)rn com.opensymphony.xwork2.DefaultActionInvocation.invoke(DefaultActionInvocation.java:248)rn com.opensymphony.xwork2.interceptor.ExceptionMappingInterceptor.intercept(ExceptionMappingInterceptor.java:187)rn com.opensymphony.xwork2.DefaultActionInvocation.invoke(DefaultActionInvocation.java:248)rn org.apache.struts2.impl.StrutsActionProxy.execute(StrutsActionProxy.java:52)rn org.apache.struts2.dispatcher.Dispatcher.serviceAction(Dispatcher.java:498)rn org.apache.struts2.dispatcher.ng.ExecuteOperations.executeAction(ExecuteOperations.java:77)rn org.apache.struts2.dispatcher.ng.filter.StrutsPrepareAndExecuteFilter.doFilter(StrutsPrepareAndExecuteFilter.java:91)rn
二维数组出错,求大神
代码:rn[code=java]public class Matrixrnrn rn rn rn //从文件中读取数据,将读取到的矩阵数据加载到字符串中rn public String toString(String s1,String s2, String s3)rn tryrn BufferedReader buffer = new BufferedReader(new FileReader(s3));rn while((s1=buffer.readLine())!=null)rn rn s2+=s1+"\n"; rn rn buffer.close();rn rn //System.out.println(s2);rn rn catch(FileNotFoundException e)rn System.out.println("未找到文件");rn rn catch(IOException e)rn System.out.println("运行<em>出错</em>");rn rn rn rn return s2;rn rn rn //将得到的字符串转化为数组rn public String[][] ToMatrix(String str)rn String[] split = str.split("\n");rn String[][] ar = new String[split.length][];rn for(int i=0;i < split.length; i++)rn ar[i] = split[i].split(" ");rn rn rn rn return ar;rn rnrn rn //将得到的array数组打印出来rn public void Print(String[][] array)rn rn System.out.println(array.length);rn for(int i=0; i < array.length; i++)rn for(int j=0;j
JAVASCRIPT的中文教程下载
JAVASCRIPT中文教程.zip, 不错的JAVASCRIPT入门教程 相关下载链接:[url=//download.csdn.net/download/jlmouse/2046421?utm_source=bbsseo]//download.csdn.net/download/jlmouse/2046421?utm_source=bbsseo[/url]
acts_as_list.rar下载
acts_as_list.raracts_as_list.raracts_as_list.raracts_as_list.raracts_as_list.raracts_as_list.raracts_as_list.raracts_as_list.raracts_as_list.raracts_as_list.raracts_as_list.raracts_as_list.raracts_as_list.raracts_as_list.raracts_as_list.raracts_as_list.raracts_as_list.raracts_as_list.raracts_as_list 相关下载链接:[url=//download.csdn.net/download/wodwl/3536366?utm_source=bbsseo]//download.csdn.net/download/wodwl/3536366?utm_source=bbsseo[/url]
小黄蜂刷机教程下载
小黄蜂刷机教程,顺便说一下,64位WIN7的朋友,驱动无法在64位WIN7下正常运行(刷机状态下),刷完后,在电脑端安装豌豆荚,可以正常USB连接。 相关下载链接:[url=//download.csdn.net/download/coffiya/4992754?utm_source=bbsseo]//download.csdn.net/download/coffiya/4992754?utm_source=bbsseo[/url]
相关热词 c# 去空格去转义符 c#用户登录窗体代码 c# 流 c# linux 可视化 c# mvc 返回图片 c# 像素空间 c# 日期 最后一天 c#字典序排序 c# 截屏取色 c#中的哪些属于托管机制
我们是很有底线的