opencv4.4.0交叉编译好的动态库和静态库.rar下载

等级
本版专家分:0
勋章
Blank
技术圈认证 用户完成年度认证,即可获得
Blank
签到达人 累计签到获取,不积跬步,无以至千里,继续坚持!
Blank
GitHub 绑定GitHub第三方账户获取
Blank
领英 绑定领英第三方账户获取
结帖率 83.11%
眼镜333

等级:

Blank
技术圈认证 用户完成年度认证,即可获得
Blank
签到达人 累计签到获取,不积跬步,无以至千里,继续坚持!
Blank
GitHub 绑定GitHub第三方账户获取
Blank
领英 绑定领英第三方账户获取
编译OpenCV4.4测试运行

编译OpenCV编译安装流程错误处理 编译安装流程 错误处理 错误:gcc: error: long: No such file or directory C:\msys64\mingw64\bin\windres.exe: preprocessing failed. make[2]: *** [modules\core\CMakeFiles\...

嵌入式开发之Opencv(一)交叉编译

本文档涉及到的目标硬件为全志H8(8核Cortex-A7,Armv7架构),但是对其他Arm芯片也有一定的借鉴意义,只需要更换交叉编译链即可。 开发环境介绍 主机操作系统:Ubuntu14.04 64位 目标平台:BoxV3 全志H8 交叉...

opencv交叉编译arm环境静态动态库和可执行程序

在工作中遇到把基于opencv的代码移植到板子上运行,在网上查看了很多...附上ndk编译代码,准备下面两个文件后,就可以编译出一个native的可执行文件,直接放到机器上运行,就可以得到opencv计算的结果了 android.mk 

anaconda4.4.0 python3.6 安装opencv3 问题解决

问题最近anaconda推出了Python3.6 ,自己就装了该版本,但是安装后发现安装opencv3不像Python3.5 版本安装opencv3那样简单,以前安装opencv3 只需要conda install –channel ...Unsatis

解决cv2.error: OpenCV(4.0.0)的方法

1

cv2.error: OpenCV(4.0.0)

新手入门,想用Python处理图片,在网上查了这个函数cv2.adaptiveThreshold想用来处理阈值分割,但是代码报错了,在网上也没有找到解决方法![图片说明]... 报的错是!... 哪位大佬能麻烦帮我解答一下,

linux编译动态库和静态库的makefile示例

根据GenDll.cpp文件,分别生成动态库.so和静态库.a文件,需要依赖的外部opencv。1. 静态库的生成makefile命令的简介可参考:跟我一起写 Makefile。使用ar命令生成.a文件,可参考:Linux下动态库(.so)和静态库(.a...

opencv+ linux + cmake 生成 opencv 静态库

您可以省去如下步骤,直接下载编译好opencv2.4.4 + Ubuntu + 64bit 静态库:http://download.csdn.net/detail/u011258240/97103311. 下载opencv源码2. 将opencv 源码放在linux 的一个文件夹下(记得不要放在共享...

VS2015编译32位Opencv310(动态库+静态库,文末有下载链接)

利用CMake编译适合编译环境的静态以及动态库,亲测VS2015VS2010+最新版Opencv310可用。 //这里主要编译X86 win32的静态和动态库,文末有下载链接

python 使用opencv读取图片,解决cv2.error: OpenCV(4.1.0) C:\projects\opencv-python\opencv.......

完整代码如下: # -*- coding: utf-8 -*- # @Time : 2019/5/27 19:24 # @Author : 未来战士biubiu!...import cv2 # 引入opencv模块 import serial # 串口模块 import os os.chdir('D:\DOCUMENT/U1/Python3_...

VS2015编译OpenCV320的32位64位动态库和静态库

Markdown扩展Markdown简洁的语法 代码块高亮 图片链接图片上传 LaTex数学公式 UML序列图流程图 离线写博客 导入导出Markdown文件 丰富的快捷键 快捷键 加粗 Ctrl + B 斜体 Ctrl + I 引用

OpenCV - 编译静态OpenCV库(静态)

在一个项目中需要用到OpenCV,刚开始使用了OpenCV动态链接,这样,在移动可执行程序时还必须将OpenCV动态支持一起搬移,很是麻烦。所以,最终选择OpenCV静态链接,这样程序移植运行就方便了很多。需要编译成...

【已解决】python下opencv遇到问题:cv2.error: OpenCV(3.4.2) /tmp/build/80754af9/opencv-suite_...

目录问题描述解决方法 问题描述 Traceback (most recent call last): File "test.py", line 229, in <module> object_is.test(args) File "test.py", line 220, in test save_path=save_path) ...

编译CUDA版OpenCV4.0.0

cmd :nvcc -V   A: 似乎DTree,SVM,nBayes这些算法还没有GPU的接口 B: 分类、决策树好像是没有, 可能需要你...B: OpenCV 有GPU版本的示例代码,试一下相关算法就知道了-- opencv\sources\samples\gpu ...

静态调用OpenCV库以及生成自己的静态库

我们暂且不讨论静态库和动态库谁坏了吧,设计初衷不同而已。而且有时候你在别人对接项目的时候,对方要求你给一个干干净净的lib文件h头文件(或者一个exe)就行的时候,你总得满足对方的要求吧。试想一下...

Ubuntu16.04下编译OpenCV2.4.13静态库(.a文件)

我们在做项目的时候,经常用到的都是链接动态库,在Linux平台中就是.so文件,我的另外一篇文章介绍的就是如何生成动态库,可以参看《ubuntu 16.04下安装使用OpenCV2.4.13(动态库.so)》。但是有时候,我们仍然希望...

用Qt Creator编译opencv并配置开发环境

前言opencv是一个跨平台计算机视觉,使用前需要把它编译成二进制的静态库和动态库,之后在代码中直接连接到二进制。网上很多教程都是用CMake配合MinGW编译opencv,其中需要用到命令行操作,其实有更简单的方法,...

Python3.7中安装openCV库

1.首先自己直接在cmd中输入 pip3 install openCV是不可行的,即需要自己下载安装包本地安装2.openCV库 下载地址http://www.lfd.uci.edu/~gohlke/pythonlibs/#opencv 3.opencv_python‑3.4.2‑cp37‑cp37m‑win_amd...

用gcc编译opencv程序

opencv是一个开源的视觉,有很多视觉开发常用方法,这里介绍下如何用gcc编译含有opencv函数的程序。  我的opencv库放在e:/opencv文件夹下。我在d:/test目录下有一个facetest.cpp源程序。现在要通过gcc将它编译...

Win7 64位+Python3.6.1(Anaconda3-4.4.0)安装配置 OpenCV3.2.0-v14

关于Anaconda3-4.4.0下配置OpenCV3.2.0 1.首先官网下载最新版本的Anaconda3-4.4.0(基于自己的电脑选择32位或64位),该版本已经支持最新的Python3.6;  注意:安装过程中:  1)安装路径可以改变,但一定要是非...

[opencv]OpenCV项目的动态编译和静态编译

1.Dll(Dynamic Link Library)Lib文件 2.动态编译静态编译的区别 3.opencv项目的动态编译 4.opencv项目的静态编译 参考链接

解决cv2.error: OpenCV(4.0.0) ...error: (-215:Assertion failed) !ssize.empty() in function 'cv::...

报错: File "D:\curiosity\mineral classification1\src\猫狗识别\dataset.py", line 22, in load_train image = cv2.resize(image, (image_size, image_size),0,0, cv...cv2.error: OpenCV(4.0.0) C:\...

ubuntu 14.04 下利用apt-get方式安装opencv

通过apt方式安装没有自动生成opencv.pc文件,所以在编写makefile文件时不能直接使用pkg-config工具,而需要逐个指定opencv_core、opencv_imgproc等动态链接!2.安装方法 更新ubtuntu系统软件源 sudo apt-get ...

opencv+opencv_contrib 人脸识别检测 python开发环境快速搭建(30分钟)图文教程

很多朋友为了学习python、ML(机器学习)、opencv等花费了大量时间配置安装环境(一个朋友花了4天时间才配置)各种搜索、下载、安装配置,出问题等。 市面上的配置资料很多,选择也成为了难题,实际上呢,很多...

Ubuntu上交叉编译opencvopencv_contrib并移植到ARM板之一

零、环境准备:编译环境:Ubuntu-14.04交叉编译工具链:arm-linux-gnueabi-4.5.1目标机器:粤嵌GEC210开发板S5PV210(Cortex-a8)opencv库opencv-3.2.0(源码),解压至某一目录opencv_contribopencv_contrib-...

Python+opencv出错

Python+opencv读取图片出错:cv2.error: D:\Build\OpenCV\opencv-3.3.0\modules\highgui\src\window.cpp:333: error: (-215) size.width>0 && size.height>0 in function cv::imshow错误原因:放在当前文件夹下的...

opencv各版本链接及opencv_contrib各版本链接

contrib:https://github.com/opencv/opencv_contrib/releases opencv版本:https://opencv.org/releases.html

使用OpenCV官方提供文件配置、静态编译并运行OpenCV-2.3.x/2.4.x实例

版权声明:对于本博客所有原创文章,允许个人、教育非商业目的使用,但务必保证文章的完整性且不作任何修改地以超链接形式注明原始作者、出处及本声明。  博客地址:http://blog.csdn.net/shuxiao9058  ...

交叉编译OpenCV静态库

一,环境安装 系统:

解决cv2.error: OpenCV(4.2.0) C:\projects\opencv-python\opencv\modules\objdetect\src\cascadedetect....

cv2.error: OpenCV(4.2.0) C:\projects\opencv-python\opencv\modules\objdetect\src\cascadedetect.cpp:1689: error: (-215:Assertion failed) !empty() in function ‘cv::CascadeClassifier::detectMultiScale’ ...

相关热词 c#用函数打印菱形 c# 文件名合法 c# 枚举名称 c# out ref c#五子棋人机 c# ef 事务删除 c# this 属性 c#注册代码没有数据库 c#限定时间范围 c#控件跟随窗口大小变化