CSDN论坛 > Windows专区 > Windows Server

See the attached file for details [问题点数:0分]

Bbs1
本版专家分:10
结帖率 100%
CSDN今日推荐
Bbs8
本版专家分:32562
Blank
红花 2003年8月 Windows专区大版内专家分月排行榜第一
2003年7月 Windows专区大版内专家分月排行榜第一
Blank
蓝花 2003年6月 Windows专区大版内专家分月排行榜第三
Bbs1
本版专家分:45
Blank
红花 2005年2月 多媒体/设计/Flash/Silverlight 开发大版内专家分月排行榜第一
Bbs7
本版专家分:10264
匿名用户不能发表回复!
其他相关推荐
JSP异常 message Invalid tld file
今天要起一个很久核心业务系统,下载完后启动访问JSP一直在报这个错 java error: message Invalid tld file: see JSP 2.2 specification section 7.3.1 for more details ,纠结了一个小时,读过错误提示的文档后发现. JSP标签类文件.tld文件不能放在WEB-INFO的classes,li
Myeclipse Source not found 以及 调用javadoc的问题
原文链接:http://jingyan.baidu.com/article/9c69d48f48026813c9024e16.html                    http://jingyan.baidu.com/article/ab69b270a598202ca7189f0a.html                    http://blog.163.com/logow
Android Studio 导入项目报错:Some file crunching failed, see logs for details 解决方案
错误日志:Error:java.lang.RuntimeException: Some file crunching failed, see logs for details     Log:   FAILURE: Build failed with an exception.   * What went wrong:   Execution failed for task ':a
Android Gradle Build Error:Some file crunching failed, see logs for details解决办法(转载)
转自:《Android Gradle Build Error:Some file crunching failed, see logs for details解决办法》 错误日志:Error:java.lang.RuntimeException: Some file crunching failed, see logs for details Log:   FAI
Error:java.lang.RuntimeException: Some file crunching failed, see logs for detail
出现这个错误的原因是有哪种情况? 1.构建Gradle的时候,Gradle会去检查一下是否修改过文件的后缀名; 2.一般大多数是出现在图片上,.jpg修改成了.png就会出现这个问题; 3.9patch图片也可能出现这个问题。 解决办法 在app目录下的build.gradle中添加如下设置 aaptOptions { cruncherEnab
JAR creation failed. See details for additional information. Exported with compile errors: JDK/src
今天编译jdk里面的src.zip的时候总是报错: JDK source in src.zip won't compile。网上的说的 方法  都没用。后来找到他们的 社区 还是没有找到决绝办法。现在感觉不能编译jdk源码。高手路过,请多多指教。。。...
Android Studio 图片问题Error:java.lang.RuntimeException: Some file crunching failed, see logs for detail
按照《第一行代码Android Studio》学习到3.2常用控件的使用方法,在插入图片时报错Error:java.lang.RuntimeException: Some file crunching failed, see logs for detailsLog:  FAILURE: Build failed with an exception.  * What went wrong:  Exe
java error: message Invalid tld file: see JSP 2.2 specification section 7.3.1 for more details
完整的错误信息如下 严重: Servlet.service() for servlet jsp threw exception org.apache.jasper.JasperException: /view/exception/exceptionmsg.jsp (line: 2, column: 0) /view/include/common/normal.jsp (line: 1, colu
A resource was acquired at attached stack trace but never released.
A resource was acquired at attached stack trace but never released. E/StrictMode: A resource was acquired at attached stack trace but never released. See java.io.Closeable for information on avoiding ...
SyntaxError: Non-UTF-8 code starting with '\xb2in file.
SyntaxError: Non-UTF-8 code starting with '\xb2' in file...   程序中出现中文,运行的时候出现如下错误:   SyntaxError: Non-UTF-8 code starting with '\xb2' in file XXX.py on line 8, but no encoding declared; see  http:/
关闭