maven配置阿里云镜像出现报错,求大神解决,困扰好久了
[INFO] Scanning for projects...
Downloading from nexus-aliyun: https://maven.aliyun.com/repository/public/org/apache/maven/plugins/maven-clean-plugin/2.5/maven-clean-plugin-2.5.pom
[WARNING] Failed to create parent directories for tracking file D:\Program Files\maven\warehouse\org\apache\maven\plugins\maven-clean-plugin\2.5\maven-clean-plugin-2.5.pom.lastUpdated
[WARNING] Failed to retrieve plugin descriptor for org.apache.maven.plugins:maven-clean-plugin:2.5: Plugin org.apache.maven.plugins:maven-clean-plugin:2.5 or one of its dependencies could not be resolved: Failed to read artifact descriptor for org.apache.maven.plugins:maven-clean-plugin:jar:2.5
Downloading from nexus-aliyun: https://maven.aliyun.com/repository/public/org/apache/maven/plugins/maven-install-plugin/2.4/maven-install-plugin-2.4.pom
[WARNING] Failed to create parent directories for tracking file D:\Program Files\maven\warehouse\org\apache\maven\plugins\maven-install-plugin\2.4\maven-install-plugin-2.4.pom.lastUpdated
[WARNING] Failed to retrieve plugin descriptor for org.apache.maven.plugins:maven-install-plugin:2.4: Plugin org.apache.maven.plugins:maven-install-plugin:2.4 or one of its dependencies could not be resolved: Failed to read artifact descriptor for org.apache.maven.plugins:maven-install-plugin:jar:2.4
Downloading from nexus-aliyun: https://maven.aliyun.com/repository/public/org/apache/maven/plugins/maven-deploy-plugin/2.7/maven-deploy-plugin-2.7.pom
[WARNING] Failed to create parent directories for tracking file D:\Program Files\maven\warehouse\org\apache\maven\plugins\maven-deploy-plugin\2.7\maven-deploy-plugin-2.7.pom.lastUpdated
[WARNING] Failed to retrieve plugin descriptor for org.apache.maven.plugins:maven-deploy-plugin:2.7: Plugin org.apache.maven.plugins:maven-deploy-plugin:2.7 or one of its dependencies could not be resolved: Failed to read artifact descriptor for org.apache.maven.plugins:maven-deploy-plugin:jar:2.7
Downloading from nexus-aliyun: https://maven.aliyun.com/repository/public/org/apache/maven/plugins/maven-site-plugin/3.3/maven-site-plugin-3.3.pom
[WARNING] Failed to create parent directories for tracking file D:\Program Files\maven\warehouse\org\apache\maven\plugins\maven-site-plugin\3.3\maven-site-plugin-3.3.pom.lastUpdated
[WARNING] Failed to retrieve plugin descriptor for org.apache.maven.plugins:maven-site-plugin:3.3: Plugin org.apache.maven.plugins:maven-site-plugin:3.3 or one of its dependencies could not be resolved: Failed to read artifact descriptor for org.apache.maven.plugins:maven-site-plugin:jar:3.3
Downloading from nexus-aliyun: https://maven.aliyun.com/repository/public/org/apache/maven/plugins/maven-antrun-plugin/1.3/maven-antrun-plugin-1.3.pom
[WARNING] Failed to create parent directories for tracking file D:\Program Files\maven\warehouse\org\apache\maven\plugins\maven-antrun-plugin\1.3\maven-antrun-plugin-1.3.pom.lastUpdated
[WARNING] Failed to retrieve plugin descriptor for org.apache.maven.plugins:maven-antrun-plugin:1.3: Plugin org.apache.maven.plugins:maven-antrun-plugin:1.3 or one of its dependencies could not be resolved: Failed to read artifact descriptor for org.apache.maven.plugins:maven-antrun-plugin:jar:1.3
Downloading from nexus-aliyun: https://maven.aliyun.com/repository/public/org/apache/maven/plugins/maven-assembly-plugin/2.2-beta-5/maven-assembly-plugin-2.2-beta-5.pom
[WARNING] Failed to create parent directories for tracking file D:\Program Files\maven\warehouse\org\apache\maven\plugins\maven-assembly-plugin\2.2-beta-5\maven-assembly-plugin-2.2-beta-5.pom.lastUpdated
[WARNING] Failed to retrieve plugin descriptor for org.apache.maven.plugins:maven-assembly-plugin:2.2-beta-5: Plugin org.apache.maven.plugins:maven-assembly-plugin:2.2-beta-5 or one of its dependencies could not be resolved: Failed to read artifact descriptor for org.apache.maven.plugins:maven-assembly-plugin:jar:2.2-beta-5
Downloading from nexus-aliyun: https://maven.aliyun.com/repository/public/org/apache/maven/plugins/maven-dependency-plugin/2.8/maven-dependency-plugin-2.8.pom
[WARNING] Failed to create parent directories for tracking file D:\Program Files\maven\warehouse\org\apache\maven\plugins\maven-dependency-plugin\2.8\maven-dependency-plugin-2.8.pom.lastUpdated
[WARNING] Failed to retrieve plugin descriptor for org.apache.maven.plugins:maven-dependency-plugin:2.8: Plugin org.apache.maven.plugins:maven-dependency-plugin:2.8 or one of its dependencies could not be resolved: Failed to read artifact descriptor for org.apache.maven.plugins:maven-dependency-plugin:jar:2.8
Downloading from nexus-aliyun: https://maven.aliyun.com/repository/public/org/apache/maven/plugins/maven-release-plugin/2.5.3/maven-release-plugin-2.5.3.pom
[WARNING] Failed to create parent directories for tracking file D:\Program Files\maven\warehouse\org\apache\maven\plugins\maven-release-plugin\2.5.3\maven-release-plugin-2.5.3.pom.lastUpdated
[WARNING] Failed to retrieve plugin descriptor for org.apache.maven.plugins:maven-release-plugin:2.5.3: Plugin org.apache.maven.plugins:maven-release-plugin:2.5.3 or one of its dependencies could not be resolved: Failed to read artifact descriptor for org.apache.maven.plugins:maven-release-plugin:jar:2.5.3
Downloading from nexus-aliyun: https://maven.aliyun.com/repository/public/org/apache/maven/plugins/maven-metadata.xml
Downloading from nexus-aliyun: https://maven.aliyun.com/repository/public/org/codehaus/mojo/maven-metadata.xml
[WARNING] Failed to create parent directories for tracking file D:\Program Files\maven\warehouse\org\apache\maven\plugins\resolver-status.properties
[WARNING] Failed to create parent directories for tracking file D:\Program Files\maven\warehouse\org\codehaus\mojo\resolver-status.properties
[WARNING] Could not transfer metadata org.apache.maven.plugins/maven-metadata.xml from/to nexus-aliyun (https://maven.aliyun.com/repository/public): D:\Program Files\maven\warehouse\org\apache\maven\plugins\maven-metadata-nexus-aliyun.xml.part.lock (系统找不到指定的路径。)
[WARNING] Could not transfer metadata org.codehaus.mojo/maven-metadata.xml from/to nexus-aliyun (https://maven.aliyun.com/repository/public): D:\Program Files\maven\warehouse\org\codehaus\mojo\maven-metadata-nexus-aliyun.xml.part.lock (系统找不到指定的路径。)
Downloading from nexus-aliyun: https://maven.aliyun.com/repository/public/org/codehaus/mojo/maven-metadata.xml
Downloading from nexus-aliyun: https://maven.aliyun.com/repository/public/org/apache/maven/plugins/maven-metadata.xml
[WARNING] Failed to create parent directories for tracking file D:\Program Files\maven\warehouse\org\codehaus\mojo\resolver-status.properties
[WARNING] Failed to create parent directories for tracking file D:\Program Files\maven\warehouse\org\apache\maven\plugins\resolver-status.properties
[WARNING] Could not transfer metadata org.apache.maven.plugins/maven-metadata.xml from/to nexus-aliyun (https://maven.aliyun.com/repository/public): D:\Program Files\maven\warehouse\org\apache\maven\plugins\maven-metadata-nexus-aliyun.xml.part.lock (系统找不到指定的路径。)
[WARNING] Could not transfer metadata org.codehaus.mojo/maven-metadata.xml from/to nexus-aliyun (https://maven.aliyun.com/repository/public): D:\Program Files\maven\warehouse\org\codehaus\mojo\maven-metadata-nexus-aliyun.xml.part.lock (系统找不到指定的路径。)
[INFO] ------------------------------------------------------------------------
[INFO] BUILD FAILURE
[INFO] ------------------------------------------------------------------------
[INFO] Total time: 0.412 s
[INFO] Finished at: 2024-12-06T01:35:25+08:00
[INFO] ------------------------------------------------------------------------
[ERROR] No plugin found for prefix 'help' in the current project and in the plugin groups [org.apache.maven.plugins, org.codehaus.mojo] available from the repositories [local (D:\Program Files\maven\warehouse), nexus-aliyun (https://maven.aliyun.com/repository/public)] -> [Help 1]
[ERROR]
[ERROR] To see the full stack trace of the errors, re-run Maven with the -e switch.
[ERROR] Re-run Maven using the -X switch to enable full debug logging.
[ERROR]
[ERROR] For more information about the errors and possible solutions, please read the following articles:
[ERROR] [Help 1] http://cwiki.apache.org/confluence/display/MAVEN/NoPluginFoundForPrefixException

...全文
相关推荐
IDEA配置maven环境的详细教程(Unable to import maven project报错问题的解决)
主要介绍了IDEA配置maven环境的详细教程(Unable to import maven project问题的解决),本文通过图文并茂的形式给大家介绍的非常详细,对大家的学习或工作具有一定的参考借鉴价值,需要的朋友可以参考下
spring boot项目导入依赖后代码报错问题的解决方法
主要给大家介绍了关于spring boot项目导入依赖后代码报错问题的解决方法,文中通过示例代码介绍的非常详细,对大家学习或者使用spring Boot具有一定的参考学习价值,需要的朋友们下面来一起学习学习吧
IDEA中Maven依赖下载失败的完美解决方案
使用IDEA进行Maven项目开发时,时不时会遇到pom.xml报错的情况,其中很大概率是因为Maven依赖的jar包下载失败,找来找去也没有找到是什么问题,困扰了很多程序猿,这里给出IDEA中Maven依赖下载失败解决方案,给大家参考,实测有用
IDEA中pom依赖报错解决方法汇总.docx
新手使用IDEA使用Maven配置pom依赖时经常出现的问题
idea2019导入maven项目中的某些问题及解决方法
主要介绍了idea2019导入maven项目中的某些问题,本文给大家介绍的非常详细,对大家的学习或工作具有一定的参考借鉴价值,需要的朋友可以参考下


Web 开发
