错误: "Cannot use object linking and embedding."如何解决. [问题点数:100分,结帖人Marguess]

Bbs1
本版专家分:0
结帖率 92.31%
Bbs1
本版专家分:0
Bbs6
本版专家分:8089
Blank
黄花 2005年1月 其他开发语言大版内专家分月排行榜第二
2004年9月 其他开发语言大版内专家分月排行榜第二
2004年7月 其他开发语言大版内专家分月排行榜第二
Blank
蓝花 2004年8月 其他开发语言大版内专家分月排行榜第三
Bbs1
本版专家分:0
Bbs1
本版专家分:0
Bbs4
本版专家分:1721
Blank
银牌 2004年12月 总版技术专家分月排行榜第二
Blank
微软MVP 2005年7月 荣获微软MVP称号
2007年7月 荣获微软MVP称号
2006年7月 荣获微软MVP称号
Blank
红花 2004年12月 VC/MFC大版内专家分月排行榜第一
2003年3月 VC/MFC大版内专家分月排行榜第一
Blank
黄花 2005年2月 VC/MFC大版内专家分月排行榜第二
2004年11月 VC/MFC大版内专家分月排行榜第二
Bbs6
本版专家分:8089
Blank
黄花 2005年1月 其他开发语言大版内专家分月排行榜第二
2004年9月 其他开发语言大版内专家分月排行榜第二
2004年7月 其他开发语言大版内专家分月排行榜第二
Blank
蓝花 2004年8月 其他开发语言大版内专家分月排行榜第三
Bbs1
本版专家分:0
Bbs1
本版专家分:0
Bbs6
本版专家分:8089
Blank
黄花 2005年1月 其他开发语言大版内专家分月排行榜第二
2004年9月 其他开发语言大版内专家分月排行榜第二
2004年7月 其他开发语言大版内专家分月排行榜第二
Blank
蓝花 2004年8月 其他开发语言大版内专家分月排行榜第三
libkateinterfaces.so.0
<em>解决</em>kscope运行时缺少库的<em>错误</em> kscope: error while loading shared libraries: libkateinterfaces.so.0: <em>cannot</em> open shared <em>object</em> file: No such file or directory 将<em>解决</em>后的二个库放在/usr/lib下。
dashboard界面总是抛出异常错误
dashboard界面总是抛出异常<em>错误</em>? 在点击openstack的dashboard时右上角总是弹出一些<em>错误</em>的提示,再次刷新时又不提示 原因: MYSQL数据库安装完成后,默认最大连接数是100,一般流量稍微大一点这个连接数是远远不够的 <em>解决</em>办法: 1、修改mairadb的配置文件,将最大连接数改为1500 # echo "max_connections=1500">>/
XCode升级10版本遇到的link问题
Xcode升级到最新版本10,有些旧的项目运行出报错,如 link error,具体如下: error:Build input file <em>cannot</em> be found:‘/Users/…/Libraries/WebSocket/libfishhook.a’ 这是我的一个react-native 项目在进行XCode上进行编译的时候所报的<em>错误</em>,libfishhook 链接<em>错误</em>,找不到文件了,<em>解决</em>的...
Cannot use object of type ... as array
Fatal error: Cannot <em>use</em> <em>object</em> of type countries_search as array in F:\AppServ\www\smg\application\models\TrackAction.php on line 24rnrn请问出现这样的提示一般是因为什么?rnrnps:rn1,不会是因为程序问题,程序应该是对的,不是由于把<em>object</em>当数组来调用导致的,因为我们服务器上运转完全正常,我只是把代码copy到我电脑的环境里就不行了rn2,不会是因为Php或apache版本的原因,因为和服务器是一样的rn3,服务器的系统是solaris,我电脑是xp+appservrnrn望高手指教
Websocket————错误总结
websocket 一、需要注意的是,js建立连接处完整的js代码要执行完成退出后才会真正发起建立连接请求,如果在此之前发送消息则会报错如下: InvalidStateError: An attempt was made to <em>use</em> an <em>object</em> that is not, or is no longer, usable <em>解决</em>办法:在websocket已经和Workerman链接的时候再...
mapgis67补丁_解决cannot错误.rar
mapgis67补丁_<em>解决</em><em>cannot</em><em>错误</em>.rar
ros中使用pcl编译报错
Linking CXX executable /home/shyreckdc/catkin_ws/devel/lib/my_pcl/cloud_viewer /usr/bin/ld: CMakeFiles/cloud_viewer.dir/src/cloud_viewer.cpp.o: undefined reference to symbol '_ZN15vtkSphereSource3New
MySQL源码安装
1 获取mysql源码版本 http://dev.mysql.com/downloads/mysql/ 下载并留心MD5信息 将下载后的文件上传到linux服务器上 2 校验 安装包 [root@server ~]# md5sum -b MySQL-5.6.26-1.rhel5.src.rpm b054b30d89c03f6173af4c6
DB2 访问表时SQL1477N报错的原因及处理
DB2中,对表进行访问时,有时会遇到以下报错: SQL1477N  For table "" an <em>object</em> "" in table       space "" <em>cannot</em> be accessed.   可能的原因如下: 1.)开启了不记日志的操作之后,若显示地发出了rollback命令,或者SQL因为意外情况失败(比如锁超时、内存不足等)导致事务回滚,则该表将不能访问,
不能使用类型为stdClass的对象作为数组?
问题:Fatal error: Cannot <em>use</em> <em>object</em> of type stdClass as array in<em>解决</em>方案:$result = json_decode($data, true);
学习tensorflow遇到的问题(更新中)
1.tensorflow.python.framework.errors_impl.permissiondeniederror /path permission denied 问题的<em>解决</em>方式 在Linux环境中运行python程序时可能会出现上述问题,<em>解决</em>问题的办法就是将你的路径改为绝对路径,例如: ‘/path/to/MNIST_data/’ 改为: "/home/yangjy/path...
ES6语法中的解构赋值
关于数组的解构赋值 Easy Assignment 简便赋值 //ES5定义方法 var a = 1, b = 2, c = 3; //ES6定义方法 var [a, b, c] = [1, 2, 3]; Jump Assignment 跳跃赋值 var [a, , c] = [1, 2, 3]; console.log(a); console.log(b); console.log(c); ...
OCLint的部分规则(Migration 部分)
OCLint的部分规则(Migration 部分)对OCLint的部分规则进行简单翻译解释,有部分进行了验证以及进一步分析、测试
kafka使用常见报错及解决方法
1 启动advertised.listeners配置异常: java.lang.IllegalArgumentException: requirement failed: advertised.listeners <em>cannot</em> <em>use</em> the nonroutable meta-address 0.0.0.0. Use a routable IP addre...
Android studio 一些错误解决方法
1.在低版本的手机或者模拟器不能运行 但是高的可以 使用自定义的Application继承MultiDexApplication这个类,或者重写Application的方法attachBaseContext(),并调用MultiDex.install(); @Override protected void attachBaseContext(Context base) { super...
安装opencv-3.1.0.zip 出错的解决方法,小记一下
ubuntu14.04安装caffe+cuda7.5的步骤见另外两篇 Caffe 安装配置步骤 http://blog.csdn.net/windrainlife/article/details/52217317 ubuntu14.04安装cuda6.5简易版本,易操作: http://blog.csdn.net/windrainlife/article/details/52217
使用swoole遇到的问题
在编译swoole过程中 ./configure时报错 Cannot find php-config. Please <em>use</em> --with-php-config=PATH 原因是 没有安装php-config指令 需要运行 yum install php-devel
PB9常见错误及含义
1. by zero   发生被0除<em>错误</em> 2. Null <em>object</em> reference   空对象引用 3. Array boundary exceeded   数组越界 4. Enumerated value is out of range for function   枚举值超出函数的范围 5. Negative value encountered in function   函数...
libcublas.so.9.0
<em>错误</em>:ImportError: libcublas.so.9.0: <em>cannot</em> open shared <em>object</em> file: No such file or directory cudnn-9.0-linux-x64-v7.1
python中import cv2遇到的错误及安装方法
从x86_64 + ubuntu14.04 + python3.5中import cv2(opencv3.3), 遇到以下<em>错误</em>: ImportError: libSM.so.6: <em>cannot</em> open shared <em>object</em> file: No such file or directory ImportError: libXrender.so.1: <em>cannot</em> open shared ob
Qt使用中遇到的问题及解决方案
1. <em>解决</em>QSqlDatabasePrivate::removeDatabase: connection ‘myConnection’ is still in <em>use</em>, all queries will cease to work的问题该问题主要是因为没有关闭之前的数据库连接,然后又需要创建新的数据库连接导致。<em>解决</em>方案:必须释放该连接的所有查询,即删除所有与该连接有关的query;同时在释放该连接时
Android Studio 常见问题
问题一: Error:(26, 9) Attribute application@icon value=(@drawable/logo) from AndroidManifest.xml:26:9 Error:(28, 9) Attribute application@theme value=(@style/ThemeActionBar) from AndroidManifest.xm
core-renderer
可以<em>解决</em>ITextRenderer <em>cannot</em> be resolved to a type <em>错误</em>
Scrapy抓取网页相关问题解决以及注意事项总结
1、urllib2是python自带的模块,在python3.x中被改为urllib.request,如"font-size:12px;">url = "http://music.baidu.com/album/all?order=time&style=pop"  html = urllib.request.urlopen(url).read()    AttributeE
开发环境 - 执行make的时候出错(未搭建内核开发包)
从别处拿到一段源码,想要编译生成镜像并加载到板子的内核中去。首先在linux虚拟机上编译,生成的ko文件无法加载到板子的内核中,因为两个内核版本不匹配。那就想在板子里面的linux下编译,生成的ko一定是对应的版本号的。在实际编译的时候出现以下问题:[root@localhost 0530]# make make: Warning: File `Makefile' has modification...
mysql编译报错解决办法之一
Linking CXX static library libbinlog.a [ 73%] Built target binlog [ 73%] Building CXX <em>object</em> sql/CMakeFiles/gen_lex_hash.dir/gen_lex_hash.cc.o Linking CXX executable gen_lex_hash [ 73%] Built ta...
Object Detectionin Videos by High Quality Object Linking
Object Detectionin Videos by High Quality Object Linking 视频对象的高质量对象链接检测
谷歌浏览器插件导致报错
Error in event handler: ReferenceError: browser is not defined at w.k.R Unchecked runtime.lastError: Could not establish connection. Receiving end does not exist Uncaught Error: Attempting to us...
关于ubuntu16.04编译2进制文件时,出现“加载共享库时出错”错误解决
编译时出现的<em>错误</em>: error while loading shared libraries: libarcsoft_fsdk_face_detection.so: <em>cannot</em> open shared <em>object</em> file: No such file or directory 出现这种情况一般有两种原因: 1、系统没有这个库,<em>解决</em>办法:自行安装就好。 2、ubuntu系统没有这个库
【深度学习】Caffe2安装 ubuntu16.04
1.介绍 一个轻量级的深度学习框架,商用项目上面貌似用的比较多,废话不多说,看看怎么装 2.安装 应为官网流程很详细,直接给出官网链接,针对一些有问题的地方给予补充(算了,我还是写一下)。我使用的平台式Ubuntu 16.04,CUDA ,CUDNN,OPENCV都已经装好 Caffe2官网 3.先安装依赖库 sudo apt-get update ...
ES6学习——新的语法:对象解构(Object Destructuring)
解构在ES6中应该是一种新的语法,在其他语言中我没怎么见到这种语法,也可以说是赋值操作的另一种形式,因为解构的整个定义都在规范的赋值操作符章节下面,有兴趣的可以看规范的12.14.5。目前浏览器对这个新语法的支持还不是很好,但是Firefox 43已经支持了大部分解构特性,这里我们仍然继续使用Kinoma Studio来测试代码。 这篇文章主要讲对象的解构赋值操作,先看个简单的例子有点印象:
readOGR加载shape文件时报错
加载shape文件时报错:> library(rgdal)> maps +                 layer = "ne_50m_admin_1_states_provinces_lakes", +                  encoding = "UTF-8",verbose=FALSE)Error in ogrInfo(dsn = dsn, layer = layer, en
VS2010中出现C2664错误
error C2664: “BOOL SHGetPathFromIDListW(LPCITEMIDLIST,LPWSTR)”: 无法将参数 2 从“char [260]”转换为“LPWSTR” <em>解决</em>方案: 1 把工程属性中的“<em>use</em> unicode charset”改成"<em>use</em> multibyte charset“。2把char改成TCHAR,sprintf改成_stprintf,字符
SpringData JPA @Query分页查询Exception问题解决方案
Ca<em>use</em>d by: org.springframework.data.jpa.repository.query.InvalidJpaQueryMethodException: Cannot <em>use</em> native queries with dynamic sorting and/or pagination in method public abstract org.springframework.
在tensorflow object detection安装出现错误总结
1.tensorflow的model目录下的reseach文件中: from <em>object</em>_detection.builders import model_builder ImportError: No module named '<em>object</em>_detection' <em>解决</em>: 在site-packages添加一个路径文件,如tensorflow_model.pth,必须以.pth为后缀,写上...
配置torch、nccl环境遇到的问题
问题描述Tried loading libnccl.so.1 but got error /home/ninghongke/torch/install/share/lua/5.1/nccl/ffi.lua:192: libnccl.so.1: <em>cannot</em> open shared <em>object</em> file: No such file or directory Tried loading libncc
libmysqlclient.so.16()
<em>解决</em>error while loading shared libraries: libmysqlclient.so.16: <em>cannot</em> open shared <em>object</em>
instantclient_11_2
包含了basic和sqlplus,<em>解决</em>了<em>cannot</em> load oci dll 193和<em>cannot</em> load oci dll 193的<em>错误</em>,非常非常非常好用
硬连接(hard link)和软连接(symbolic link)
stat - display file or file system status struct stat { mode_t       st_mode;    /* file type & mode (permissions) */ ino_t       st_ino;     /* i-node number (serial number) */ dev_t
【学习笔记0001】Go初学者需要关注的50个注意事项
本人最近因为项目需要,故开始学习golang(简称go),下面是我最近学习中查阅相关资料整理出来的,对于像我一样刚入门的初学者很有帮助!希望对你也有帮助! 1.开大括号不能放在单独的一行 在大多数其他使用大括号的语言中,你需要选择放置它们的位置。Go的方式不同。你可以为此感谢下自动分号的注入(没有预读)。是的,Go中也是有分号的:-)失败的例子: package main
R语言错误信息及相关解决方法
原创:黄小仙 Error: <em>object</em> of type ‘closure’ is not subsettable 对象大于被取子集,看看对象是不是空的,有时候文件路径或者名称不对,数据并没有导入成功 Remove duplicates before running TSNE 有重复的数据行,Rtsne package里有个参数 check_duplicates = FALSE Error ...
JSON数据转出Object错误
com.alibaba.fastjson.JSONObject <em>cannot</em> be cast to cn.iponkan.commons.util.PageData{ &quot;data&quot;: &quot;[{\&quot;amount\&quot;:9592.3200,\&quot;type_name\&quot;:\&quot;普通订单\&quot;,\&quot;step_type\&quot;:1,\&quot;seller_enterprise_type\&quot;:3,\&q
Python 我编码遇到的错误
ValueError: invalid literal for int() with base 10: ‘0.000’Traceback (most recent call last): File "", line 1, in File "", line 17, in cal_simi ValueError: invalid literal fo
解决mongodb插入数据出现bson.errors错误
<em>解决</em>mongodb插入数据出现bson.errors<em>错误</em>在这里我会记录一些自己平时遇到过的一些问题及<em>解决</em>方法,希望与大家共同进步。例子对于“bson.errors.InvalidStringData: strings in documents must be valid UTF-8”的<em>错误</em>,可以通过如下方法来<em>解决</em>:# 对编码出错的字符串 str = str_.decode("unicode_esca
vue-i18n 报错解决
如图,出现如上问题,该咋办? 见代码(下面是修改后的代码),需安装'js-cookie',并且在locale那里使用,同时messages 里面的写法需注意,{... zh}的写法 import Vue from &quot;vue&quot; import VueI18n from 'vue-i18n' import Cookies from 'js-cookie' import zh from './z...
Cannot use __try in functions that require object unwinding
Cannot <em>use</em> __try in functions that require <em>object</em> unwindingrnrn这个什么意思??rn我对SEH 不是很了解
Eclipse频繁卡顿的解决办法
最近装了个新版本的Eclipse,踩了很多坑,现在发一篇博客记录我遇到的问题并分享<em>解决</em>方案。 一、启动慢 Eclipse应用的体积不大,但是这破玩意儿启动居然耗时很久。我很不能理解,所以研究了一下,发现是启动加载插件过多的原因(就和电脑开机慢其实是一个道理)。 二、使用时期卡慢 使用使其卡慢的原因有很多种,<em>解决</em>卡慢的首先要做的是定位问题,一是看日志(位于workspace的.metad...
IOS - 使用Linking处理APP被外部URL调起的事件和解析URL参数
参考资料: https://blog.csdn.net/sinat_17775997/article/details/70473988 https://www.jianshu.com/p/8f2232da0956 http://www.cocoachina.com/ios/20161026/17855.html 本文主要介绍react-native应用<em>如何</em>处理APP被外部URL...
ActionScript的常用出现的错误提示
搜藏了:http://livedocs.adobe.com/flex/3_cn/compilerErrors.html Ambiguous reference to %s. 引用可能指向多项。例如,以下示例使用 rss 和 xml 命名空间,每个命名空间都为 hello() 函数定义了不同的值。trace(hello()) 语句无法确定使用哪个命名空间,因此返回此<em>错误</em>。 privat...
String转Json,数据格式没问题,始终报String cannot be converted to JSONObject的解决办法
服务器端返回的数据如下: {"status":1,"msg":"","data":{"companyname":"","resCount":4,"res":[{"id":"120","sp":"\u56db\u5ddd\u7701","sc":"\u6210\u90fd\u5e02","ep":"\u5c71\u897f\u7701","ec":"\u592a\u539f\u5e02","pro
Tensorflow学习笔记——ObjectDetectionAPI学习使用
写在前面:在开始ObjDetectionAPI学习之前请确认几个事情。1、识别机器是否可以正常跑Tensorflow1.4版本以上的Demo (即jupyter notebook中那个RunAll的Demo)吐槽一下:Demo中在每一次识别前都要下载对应的模型,而已经下载以后再重新下载就会报错(Python2.7)。2、识别机器是Tensorflow-gpu版。当然如果偏要用CPU去跑也可以 只不...
【整理】学习Android Studio时遇到的错误解决方法(持续更新)
在这儿我整理出我在学习android studio时遇到的一些<em>错误</em>,以备以后学习查询。 【<em>错误</em>1】 【版本】 android studio:3.3.2 OS:win10 【<em>错误</em>类型】 <em>错误</em>: 找不到符号 符号: 变量 Log 位置: 类 MainActivity 【<em>错误</em>代码】 @Override protected void...
ImageField显示错误的url问题
未配置 在未配置的情况下展示url为当前地址拼接上文件地址导致url无法访问 <em>解决</em>方法: 在setting中加上以下配置 MEDIA_ROOT = STATICFILES_PATH MEDIA_URL = '/media/' 在urls文件加上以下语句以便media路径下的图片能够访问 from django.conf.urls impor...
Angluar2报错记录(持续更新...)
Cannot find a differ supporting <em>object</em> ‘[<em>object</em> HTMLSelectElement]’ of type ‘<em>object</em>’. NgFor only supports binding to Iterables such as Arrays.ngFor指令只支持数组对象,而不支持Html的(Select类型)元素因为<select #week (chan
libopencv_core300.dll
Linking CXX shared library ....\bin\libopencv_core300.dll
keil出现的错误
首先,编译器的不同可以使得在汇编阶段产生<em>错误</em>,因为keil下现在可以使用两套不同的编译器,但是对于不同的编译器,识别的汇编语言格式不同,所以,再出错时,检查编译器是否调换回来其次,map.lds文件负责内存的映射,如果缺少这个文件,会使得调试过程中,出现没有访问权限这一说所有的指令的内存地址都无法查看...
vue 项目低版本浏览器出现的几个报错
1、vuex requires a Promise polyfill in this browser.低版本浏览器不支付 Promise  ..<em>解决</em>:下载 babel-polyfill  ,然后在配置文件里改动一下npm install --save-dev babel-polyfill在  webpack.base.conf.js 里把entry: { app: './src/main....
解决ms_cannot_allocmem错误补丁
有的时候安装mapgis,但是打不开光栅文件
Android P非公开sdk适配指南
Android P非公开sdk适配指南 因为博客中提到的地址需要通过代理才能访问,所以将对应地址下的内容已打包,有需要者可以下载https://download.csdn.net/download/lisdye2/10513405 非公开sdk说明 在P上,谷歌提出调用非公开sdk限制的说明,但为了各大应用便于逐渐迁移,推出了三个主要的名单。 浅灰名单(light greyl...
关于VC中 error C2871: 'std' : does not exist or is not a namespace
#include using namespace std;然后编译时出现 error C2871: 'std' : does not exist or is not a namespace查了一下,原来 C++有两个不同版本的头文件。引入名字空间这个概念以前编译器用的是#include ,而引入名字空间的概念以后std名字空间的头文件名字变成了。是比较老的C++的头文件的版本,而namespace
ActiveMq消息对象进行序列化时报错
先贴出生产者的主代码:JianRen jianRen = new JianRen(&quot;名字&quot;,&quot;描述&quot;); ActiveMQObjectMessage mes=(ActiveMQObjectMessage)session.createObjectMessage(jianRen); mes.setObject(jianRen); producer.sen...
完整repo-project
15年6月更新,完整的repo-project,完美<em>解决</em>fatal: Cannot get https://gerrit.googlesource.com/git-repo/clone.bundle <em>错误</em>,绕开GFW,详细请参考我的博客《完美<em>解决</em>repo init <em>错误</em> fatal: Cannot get https://gerrit.googlesource.com/git-repo/clone.bundle 》
C++ libcaffe.so无法调用
在用QT编写调用caffe的工程时,发现一直有个<em>错误</em>error while loading shared libraries libcaffe.so.1.0.0-rc3: <em>cannot</em> open shared <em>object</em> file: No such file or directory. 原本以为时没有添加libcaffe.so到.pro文件中,但是后来把库的完整路径加入也会报错。
53 pandas 时间序列-时区处理(tz_localize本地化tz_conver转换)(tcy)
时区处理 2019/1/16 1.pytz和dateutil库-对时区的支持:     1) DST 夏令时     2) UTC 协调世界时     3) 时区是以UTC的偏移量的形式表示的 # 1.1查看时区名称 import pytz,dateutil pytz.common_timezones '''[...,'Asia/Shanghai',...] '''#Dateutil时区字...
pydicom读取压缩格式的DICOM图像报错的解决方案
本文由Markdown语法编辑器编辑完成。前言:已知用pydicom读取一类Dicom图像时会报错,报错信息大致如下: OSError: <em>cannot</em> identify image file During handling of the above exception, another exception occured:
树莓派调用tensorflow错误解决
笔者使用的是树莓派3B+,系统是 Raspbian (目前还不支持 Ubuntu Mate), python 是 3.5 版本。在听说 Tensorflow 官方除了支持树莓派的版本后就尝试了一下,结果在调用 TF 时出了不少错,下面是笔者踩完坑的总结。 在出现下列两种<em>错误</em>时: Original error was: libf77blas.so.3: <em>cannot</em> open shared obj...
python中的TypeError错误解决办法
新手在学习python时候,会遇到很多的坑,下面来具体说说其中一个。 在使用python编写面向对象的程序时,新手可能遇到TypeError: this constructor takes no arguments这个<em>错误</em>。 例如下面的程序: class Ball: def _init_(self,color,size,direction):
Rreact Native 常见错误总结
Rreact Native 常见<em>错误</em>总结
从 cached_property 理解描述符
疑问产生 首先,运行取自Daniel Roy Greenfeld的文章 cached-property: Don’t copy/paste code 的一段代码: import time class cached_property(<em>object</em>): def __init__(self, func): self.__doc__ = getattr(func, '__doc...
异常之Tomcat7.0服务器无法发布项目
MyEclipse出现Cannot acquire J2EEFlexProjDeployable <em>object</em> for module test [EXPLODED on MyEclipse Tomcat v7.0],无法发布服务器的情况。
修复 MySQL 数据库结构错误 – mysql_upgrade升级
[ERROR] Missing system table mysql.proxies_priv; please run mysql_upgrade to create it [ERROR] Native table 'performance_schema'.'events_waits_current' has the wrong structure [ERROR] Native table 'pe...
msinttypes--r26.zip
用于<em>解决</em><em>错误</em>: fatal error C1083: Cannot open include file: 'stdint.h': No such file or directory
ubuntu16.04 CRF++安装及报错处理
安装CRF++-0.58.tar.gz2
hadoop2.2.0-lib-native-macos.zip
hadoop2.2.0 64位的native lib包<em>解决</em><em>cannot</em> load native lib的<em>错误</em>
Oracle64位oci解决Navicat for Oracle cannot load oci 126 193错误
Oracle64位oci<em>解决</em>Navicat for Oracle <em>cannot</em> load oci 126 193<em>错误</em>
python3.6 xlwt 安装报错解决
python3.6 版本 pip install xlwt 安装成功后 import xlwt 一直提示<em>错误</em>     Python 3.6.0a4 (v3.6.0a4:017cf260936b, Aug 16 2016, 00:59:16) [MSC v.1900 64 bit (AMD64)] on win32 Type "copyright", "credits" or "lice
libartsc.so.0
libartsc.so.0是一个共享库,用来<em>解决</em>mplayer: error while loading shared libraries: libartsc.so.0: <em>cannot</em> open shared <em>object</em> file: No such file or directory
解决:安装ORACLE 时报错 libXp.so.6:
<em>解决</em>:安装ORACLE 时报错 /jre/1.4.2/lib/i386/libawt.so: libXp.so.6: <em>cannot</em> open shared <em>object</em> file: No such file
树莓派下的FTDI驱动库
可以在树莓派下使用的FTDI的驱动库。<em>解决</em>官网下载遇到的“Cannot open shared <em>object</em> file : No such file or directory ”问题。
Linking 错误
#include rnusing namespace std ;rntemplaternT TMax(T a, T b) ;rnint main(void)rnrn cout << TMax(2.3,6.3) << endl ;rn cout << TMax(2,6) << endl ;rn cin.get() ;rn return 0 ; rnrnrnrndouble mass(double density, double volume = 1.0)rnrn return density * volume ;rnrnrnvoid repeat(int n, char *str)rnrn for(int i = 0; i < n ; i++)rn rn cout << str ;rn rnrnrnrnvoid repeat(char *str)rnrn repeat(10, str) ;rnrnrndouble average(double a, double b)rnrn return (a + b) / 2 ;rn rnrnint average(int a, int b)rnrn return (a + b) / 2 ;rnrnrnchar mangle(char a)rnrn return 'I' ;rnrnrnchar *mangle(char *a)rnrn return a ;rnrntemplaternT TMax(T a, T b)rnrn return a < b? b: a ;rnrn——————————————————————————————rn在vc6种编译是<em>错误</em>:rn--------------------Configuration: Ex8_5 - Win32 Debug--------------------rnLinking...rnLIBCD.lib(crt0.obj) : error LNK2001: unresolved external symbol _mainrnDebug/Ex8_5.exe : fatal error LNK1120: 1 unresolved externalsrnError executing link.exe.rnrnEx8_5.exe - 2 error(s), 0 warning(s)rn——————————————————————-----------------------------rn前问这是怎么回事?谢谢。rn
linux系统安装oracle数据库详解
<em>解决</em>以下<em>错误</em>以及安装过程的详细步骤和截图 <em>错误</em>一 Exception in thread “main” java.lang.UnsatisfiedLinkError: /tmp/OraInstall2009-11-25_02-34-42PM/jre/1.4.2/lib/i386/libawt.so:libXp.so.6: <em>cannot</em> open shared <em>object</em> file: No such file or directory <em>错误</em>二 #Xlib: connection to ":0.0" ref<em>use</em>d by server Xlib: No protocol specified <em>错误</em>三 warning: Cannot convert string "-isas-song ti-medium-r-normal--*-140-*-*-c-*-gb2312.1980-0" to type <em>错误</em>四 Checking kernel parameters Warning <em>错误</em>五 Checking physical memory requirements <em>错误</em>六 Checking Network Configuration requiements not executed
python常见问题集合
1.urllib.error.URLError . certificate verify failed: unable to get local issue 是python2.79以后版本的原因 https链接不是从签发机构买的 所以失败了,加一句ssl._create_default_https_context = ssl._create_unverified_context 就可以 2.P...
错题集(已解决):pymongo报错InvalidDocument: Cannot encode object: 52(某个数值)
今天写个宏玩,结果发现一个可能是编码引发的问题··· 完全不知道怎么处理·· import pandas as pd import numpy as np import pymongo myclient = pymongo.MongoClient(host='mongodb://localhost:27017/') mydbs = myclient['db_WebCrwr'] my...
利用python画词云图(wordcloud)
想通过python展示一些词出现频率,通过词大小显示出现次数,因此以下为主要搭建环境过程 1.安装wordcloud 直接通pip  install wordcloud会报VC++<em>错误</em> 结局方法 1.网上建议安装Twisted-17.9.0-cp36-cp36m-win_amd64.whl  下载并安装依然报错 2.自己下载wordcloud-1.3.2-cp36-cp36m-win_a
Android jdk1.8的使用配置并解决android jack编译乱码
Android jdk1.8的使用配置并<em>解决</em>android jack编译乱码置
numpy版本不兼容问题解决办法
TypeError: 'numpy.float64' <em>object</em> <em>cannot</em> be interpreted as an index 这里是因为numpy版本不兼容导致的问题,最好的<em>解决</em>办法是卸载你的numpy,安装numpy1.11.0。如果你和笔者一样不是服务器的网管,没有权限的话,就只能自己想办法<em>解决</em>了。  修改如下几个地方的code: 1) /home/xxx/py
【Caffe代码解析】Blob
主要功能: Blob 是Caffe作为数据传输的媒介,无论是网络权重参数,还是输入数据,都是转化为Blob数据结构来存储,网络,求解器等都是直接与此结构打交道的。 其直观的可以把它看成一个有4纬的结构体(包含数据和梯度),而实际上,它们只是一维的指针而已,其4维结构通过shape属性得以计算出来(根据C语言的数据顺序)。 protected: shared_ptr d
java.lang.IllegalArgumentException Cannot format given Object as a Date
java.lang.IllegalArgumentException Cannot format given Object as a Date
FindBugs 常见错误类型整理
转载自:https://zdran.com/20180717.html 1.Dodgy code 糟糕的代码 1.1 Mis<em>use</em> of static fields 滥用静态字段 Write to static field from instance method 由于在方法内对静态属性进行赋值操作 class A{ private static int count; ...
React路上遇到的那些问题以及解决方案
问题1:首先必须在键名后面添加一个空格,否则报错 Module build failed: YAMLException: can notread a block mapping entry; a multiline key may not be an implicit key at line6, column 1: 必须是如:name  :'Hello world!' 还有一个可能,如下
android欢迎界面简单实现下载
一个简单的android欢迎界面实现,用于在程序启动时添加欢迎动画,使得程序更炫。简单而使用。 相关下载链接:[url=//download.csdn.net/download/raynaing/4250753?utm_source=bbsseo]//download.csdn.net/download/raynaing/4250753?utm_source=bbsseo[/url]
Photoshop_CS5教你如何快速抠出美女飘逸的头发下载
Photoshop_CS5教你如何快速抠出美女飘逸的头发 相关下载链接:[url=//download.csdn.net/download/youhuiad/4245559?utm_source=bbsseo]//download.csdn.net/download/youhuiad/4245559?utm_source=bbsseo[/url]
OpenMeetings源码编译手册下载
OpenMeetings源码编译手册 相关下载链接:[url=//download.csdn.net/download/liaochaowu4/4346531?utm_source=bbsseo]//download.csdn.net/download/liaochaowu4/4346531?utm_source=bbsseo[/url]
我们是很有底线的