出现Cannot execute program的错误,什么原因? [问题点数:0分]

Bbs1
本版专家分:57
结帖率 97.92%
Bbs5
本版专家分:3133
Bbs1
本版专家分:57
Bbs5
本版专家分:3133
VC“cannot execute program错误的解决方法
编译连接都成功,但是运行的时候却<em>出现</em>“ <em>cannot</em>  <em>execute</em> <em>program</em>”的对话框 解决方法很简单,Project-》Setting-》Debug选择Executable for debug session选项,选择编译连接后正确的可执行文件的路径就可以了
cannot execute program" 解决方法">VC++ "cannot execute program" 解决方法
编译成功后,运行提示“<em>cannot</em>  <em>execute</em> <em>program</em> ”   提示框的解决办法: Project-〉Setting 下Debug选项下Execuctable for Debug Session 把这个路径选择成编译后生成的可执行文件路径就好了。
VC新手安装出现 cannot execute 'c1'错误解决办法
将 VC98/bin/C1XX.dll 改为 C1.dll就可以了nn
cannot execute program 是什么错误
这是其他人的程序,好像executable for debug session的路径是写死了的!但是我改也没有用!rn问题出在什么地方?
IIS部署错误-拒绝访问 CS0016
1 <em>错误</em>描述nnn2 <em>错误</em>原因n3 解决
使用PyCharm遇到的一个小问题及解决方案
使用PyCharm<em>出现</em>Error running ‘xxx’: Cannot run <em>program</em> “E:\Program Files\PycharmProjects\aaa\python.exe” (in directory “E:\Program Files\PycharmProjects\bbb”): CreateProcess error=2, 系统找不到指定的文件。nn首先排查pyth...
使用Jenkins 启动shell脚本所遇到的问题
sh命令无法使用:rnrnrnBuilding in workspace C:\Program Files (x86)\Jenkins\workspace\testn[test] $ sh -xe C:\Windows\TEMP\hudson6299483223982766034.shnThe system <em>cannot</em> find the file specifiednnFATAL: L'exéc
一次AIX系统报错的问题处理思路
今天遇到一个同事在AIX 5.3环境中启动程序时报错的问题,<em>错误</em>截图如下: 其中报错内容如下: $ ./MBAFileAgent 0509-036 Cannot load <em>program</em> ./MBAFileAgent because of the following errors: 0509-022 Cannot load module ./jre/bin/libstd
cannot execute the specified program"">安装服务时出现"The system cannot execute the specified program"
Visual Studio 2013下的Windows服务程序,在安装服务时<em>出现</em>"The system <em>cannot</em> <em>execute</em> the specified <em>program</em>",原因1: 文件不全,需要重新编译;原因2:配置文件有问题,比如<em>出现</em>value="... 少个引号等。 转载于:https://www.cnblogs.com/zhangtingzu/p/5453774.html...
程序运行出现cannot execute program的原因
今天的程序第一次遇到这个问题..在网上找到这个解释,不是太懂,先收藏了程序编译通过,仅说明程序本身无语法<em>错误</em>,并不意味着程序能够顺利的执行。这是一种经常遇到的问题。根据自己对OpenCV程序的体会,主要存在以下几种情况。1 数据类型及长度的不匹配。比如说,某些函数处理图像时,要求将它需要的某些参数的数据长度定为8位,16位或32位。还有有无数据类型区分。如果不满足条件,执行时将出错。2 对图像
X264运行提示“cannot execute program ” 提示框
-
运行错误!!cannot execute program
VC++ 6.0 运行<em>错误</em>!!“<em>cannot</em> <em>execute</em> <em>program</em>”,怎么解决呀??
cannot execute program
我在EVC环境下包含sqlite3的头文件,sqlite3.lib等相关文件也复制到了工程目录下,当执行的时候就<em>出现</em><em>cannot</em> <em>execute</em> <em>program</em>,编译已经通过没<em>错误</em>,注释掉sqlite语句后正常,请问这是啥问题呢~~~?在线等!!
Eclipse 进行 ANT 时错误 Javadoc failed java.io.IOException Cannot run program javadoc
Eclipse 进行 ANT 时<em>错误</em> Javadoc failed java.io.IOException Cannot run <em>program</em> javadoc
hadoop 搭建后初始化及运行出现错误 cannot execute binary file
请问大神们  这是什么问题  软件版本操作系统:红帽5   jdk:10.1.0  hadoop :3.1.0  我是根据书上一步一步来的 可能版本和用的系统不一样 书上是centos急!!!! ...
下面的 消息响应 错在哪里,出现错误 cannot execute program 错误
rnstruct message rnrn unsigned int age; rn unsigned int workcode;rn unsigned int reg;rn char username[32];rn unsigned int datalen;rn char data[100]; rn ;rnrnrnDWORD WINAPI CKaiDlg::RecvProc(LPVOID lpParam)rnrn CKaiDlg *pCKaiDlg=(CKaiDlg*)(lpParam);rn struct message recvmsg,*pRecvmsg = NULL; rn ////////////rn char *pPostmsgbuf ;rn pPostmsgbuf = new char[200]; rn rn while(1)rn rn memset(pPostmsgbuf, 0, sizeof(pPostmsgbuf)); rn recvfrom(pCKaiDlg->sockClient,pPostmsgbuf,100,0,(SOCKADDR*)&(pCKaiDlg->addrSrv),&(pCKaiDlg->len));rn memcpy(&recvmsg,pPostmsgbuf, sizeof(pPostmsgbuf)); rn rn ::PostMessage(::FindWindow(NULL,"客户信息显示"),WM_YOURMSG,(WPARAM)pPostmsgbuf,NULL);rn rn rn delete []pPostmsgbuf;rn pCKaiDlg->m_Set.Close(); rn return 0;rnrnrn//////////////////////////////////////////////////////////////////rn LRESULT CKaiDlg::OnYourMsg(WPARAM wp, LPARAM lp)rnrn int getdotleft;rn char *handlebuf = new char[200];rn handlebuf =( char *)wp;rn memset(&handlebuf,0,sizeof(handlebuf));//rn struct message handlemsg;rn memcpy(&handlemsg, handlebuf, sizeof(handlebuf));// ////////////////rn rn delete []handlebuf;rn return 0;rn
VC6.0 出现 Cannot execute program 问题
我在VC6.0的一个工程文件,编译连接都没有问题,但是在运行的时候不能运行。rn淡出提示窗口:Cannot <em>execute</em> <em>program</em>.rnrn链接的时候有这么一句提示,想请问这是怎么回事,请高手帮忙解决一下!rnLINK : LNK6004: Debug/DirectShow_1.exe not found or not built by the last incremental link; performing full link rnrn
操作dosbox0.74时遇到的几个问题
下载好dosbox0.74之后,找到目录下DOSBox 0.74 Options.bat文件,打开拖到最后一行,n加上这样一段代码后。TASM是自己创建的一个文件夹。nMOUNT C F:\TASMnC:n即如下:n[autoexec]n# Lines in this section will be run at startup.n# You can put your MOUNT l
安装hadoop 时遇到的问题,格式化文件系统时,不能成功
rn 安装hadoop 时遇到的问题,格式化文件系统时,不能成功rn执行命令: hadoop namenode –formatrn<em>出现</em>下面<em>错误</em>:rn/usr/bin/hadoop: line 321: /usr/java/default/bin/java: No such file or directoryrn/usr/bin/hadoop: line 387: /usr/java/default...
IntelliJ IDEA无法正常使用SVN解决办法
问题描述:nn IntelliJ IDEA安装之后,使用SVN进行提交或更新以及检出代码的时候会<em>出现</em>如下<em>错误</em>:nCannot load supported formats: Cannot run <em>program</em> "svn": CreateProcess error=2nn 原因是SVN使用了命令行工具,如果本地没有SVN的命令行工具,则导致出错。
cannot execute program是为什么
建 了个 WIN32 CONSOLE APPLICATION rn随便写了个HELLO WORLD 的程序 rn运行的时候就<em>出现</em><em>cannot</em> <em>execute</em> <em>program</em> 为什么啊
Hibernate的关联关系映射之一对多映射
JavaWEB中一对多的设计及建表原则n导入SQL的建表语句n创建数据库:create database hibernate_day03n编写客户和联系人的JavaBean程序(注意一对多的编写规则)n客户的JavaBean如下npublic class Customer {n private Long cust_id;n private String cust_name;n p...
elasticsearch 后集群状态下 聚合时 类型转换错误 原因及分析
先来看下<em>错误</em>前端<em>错误</em>n两层聚类时,外面一层返回的key是乱码,这个乱码并不是编码问题,而是根本没有对第二层的聚类分类。第一层里面的数据全部都是一样的。n直接报错,500或者503,类型转换<em>错误</em>或者解析异常。n后台<em>错误</em>:[2015-11-30 11:06:56,105][DEBUG][action.search.type ] [local] failed to reduce search
Linux中出现这个问题怎么解决
Cannot find tomcat/bin/setclasspath.sh This file is needed to run this <em>program</em>解决的办法: vim catalina.sh进入到文件中找到cygwin=false这一句,然后在这一句上面加入: JAVA_HOME= JAVA_HOME=/usr/lib/jvm/jdk1.8.0_161保存退出 jdk1.8.0_161=...
安装qt-creator的二进制文件出现不能执行的解决办法
安装qtcreator第一步rnsudo apt-get install qt4-dev-tools qt4-doc qt4-qtconfig qt4-demos qt4-designerrnrn第二步,官网下载相应的bin文件,qt-creator-linux-x86_64-opensource-2.6.1.bin,可以保存到目录 /home/topeet/downloads下rn下载链接:ht
jhipster项目启动报错Application run failed,跪求大神给个解决思路
jhipster项目启动报错Application run failed,跪求大神给个解决思路n<em>错误</em>内容如下:n[ERROR] Failed to <em>execute</em> goal com.github.eirslett:frontend-maven-plugin:1.6:npm (npm install) on project myapplication: Failed to run task: ‘np...
Ubuntu-树莓派之交叉编译
[前言]调试IOT设备SDK(派模拟设备端功能)需要,在UBUNTU系统的笔记本上编写和编译C程序Demo,然后scp编译后的文件到派上,缩减树梅派本身性能导致的编译时间长的问题。
R语言学习笔记之
问题1:安装问题n由于R涉及到Fortran语言,要下载gcc-gfortran包nnn问题2:nnunsupported URL schemenWarning: unable to access index for repository https://rweb.crmda.ku.edu/cran/src/contribn镜像问题,解决方式有两种:1)换镜像,即在选择的时候改
Linux 调用FFmpeg截图
在Windows中调用FFmpeg:http://www.tuicool.com/articles/ARFnMfrn按照上面的示例可以在Windows中正常截图。rn而在Linux就会报错:java.io.IOException: Cannot run <em>program</em> "../ffmpeg.exe": error=13, Permission deniedrn在Linux中需要安装FFmpeg然后
Codeblocks中遇到的调试问题,已解决
我单独讨论如下的两类问题:nn1 ERROR: You need to specify a debugger <em>program</em> in the debuggers’s settings. n(For MinGW compilers, it’s ‘gdb.exe’ (without the quotes))nn(For MSVC compilers, it’s ‘cdb.exe’ (without t...
Myeclipse添加外部Tomcat出现启动故障的问题解决
故障:rnrn1.java.lang.IllegalStateException: No output folderrnrn分析:work文件夹无写权限rnrn解决:找到tomcat的安装文件夹,右键点击work文件夹“属性”,在“安全”卡中编辑权限,把当前用户组的权限修改为“修改”即可。rnrn2.java.io.FileNotFoundException: C:\Program Files\A
win下编译hadoop项目--踩过的坑
装了IDEA,一直没有配环境。最近非得搞环境了--nn第一次在Terminal上运行nnnmvn package -Pdist,native,docs -DskipTests -Dtarnn<em>出现</em>以下error:nnn[ERROR] Failed to <em>execute</em> goal org.apache.maven.plugins:maven-antrun-plugin:1.7:run (pre-dis...
oracle 字符集问题
问题描述:这是在将dmp文件导入oracle的时候,遇到的另一个问题。在导入的时候遇到如下提示:已经完成 ZHS16GBK 字符集和 AL16UTF16 NCHAR 字符集中的导入报错如下:IMP-00019: 由于 ORACLE <em>错误</em> 12899 而拒绝行IMP-00003: 遇到 ORACLE <em>错误</em> 12899ORA-12899: 列 &quot;SYSTEM&quot;.&quot;表名&quot;.&quot;字段名&quot; 的值太大 (实际值...
MySQL错误2014原因无法执行查询--P…
网上查了不少n最后定位到PDO这个类nnhttp://stackoverflow.com/questions/17434102/causes-of-mysql-error-2014-<em>cannot</em>-<em>execute</em>-queries-while-other-unbuffered-queries&usg=ALkJrhgqG0PsXgSYk9W7uMgljOGEUbiwawn这个网址说的不错nnMySQL客
linux安装node避坑
linux centos7 64位搭建node环境nn运行 node -v 如果报错bash: ./node: <em>cannot</em> <em>execute</em> binary filenn可能是下载的node版本不对,请核对是否是linux centos7 64位版的nodenn安装node如下:nn1、wget https://nodejs.org/dist/v8.11.1/node-v8.11.1-linux-...
最新在Ubuntu 14.04.5 64位上编译OpenJDK7和错误解决
编译环境:n      笔者是在虚拟机上进行的安装,虚拟机上安装Ubuntu 14.04.5 LTS下载链接地址。n一.编译前的准备n    1.下载OpenJDK7 下载链接www.java.net/download/openjdk/jdk7u40/promoted/b43/openjdk-7u40-fcs-src-b43-26_aug_2013.zipn解压到一个你的工作路径下,最好看
Genymotion缺失文件reg.exe
Exception (VBoxManage): java.io.IOException: Cannot run <em>program</em> "D:\Program Files\Genymobile\Genymotion\/reg": CreateProcess error=2, 系统找不到指定的文件。
webstorm运行javascript时报错:Program path not specified 的解决方案——安装并配置Node.js路径
webstorm小白我本人在运行javascript时报错:Program path not specifiedn摆渡一下找到了原因是没有配置Node.js,解决问题后的我开心的给大家来一个WebStorm2018.2.5+Node.js环境配置攻略n1. 下载WebStorm2018.2.5n官网走起:Download WebSrotmn2. 下载Node.jsn官网走起:Download No...
Node.js安装express框架出现的问题级解决
1:命令行下:cd C:\Program Files\nodejs\node_modules\npm\rn2:命令行下:npm install express rn3:这时会发现C:\Program Files\nodejs\node_modules\npm\node_modules\.bin文件夹存在express、express.cmd两个文件。rn4:在电脑系统环境变量path中加入C:\P
java备份数据库的时出错
java备份数据库的时候,<em>出现</em>以下报错;先写下文档记录下:rnjava.io.IOException: Cannot run <em>program</em> "mysqldump": CreateProcess error=2, 系统找不到指定的文件。rnrnrnat java.lang.ProcessBuilder.start(Unknown Source)rnat java.lang.Runtime.exec
Hive出现的问题汇总
1.<em>出现</em>问题的前提条件:我在Hive中创建一个表然后想向表中插入数据,每次插入数据都会<em>出现</em>如下异常;nnjava.io.IOException: org.apache.hadoop.yarn.exceptions.YarnException: Failed to submit application_1533616024453_0004 to YARN : Application applicat...
oozie错误
1、nCannot run <em>program</em> &quot;en.sh&quot; (in directory &quot;/home/install/hadoop-2.5.0-cdh5.3.6/tmp/nm-local-dir/usercache/hadoop/appcache/application_1523583797725_0010/container_1523583797725_0010_01_000002&quot;):erro...
解决Eclipse中启动genymotion模拟器出错的问题
解决解决Eclipse中启动genymotion模拟器出错的问题:Exception (VBoxManage): java.io.IOException: Cannot run <em>program</em> "D:\Program Files\Genymobile\Genymotion\/reg"
记一次 MIDL1001错误
本来正常的一个源代码,突然编译提示 error MIDL1001 <em>cannot</em> open input file ./dlldata.c  百度一下也没找到相应的解决方案。不过既然提示无法打开输入文件,那我就去根目录下寻找这个文件,我打开以后,用记事本打开然后复制到新的记事本里面, 将原文件重命名,新txt更名为dlldata.c  就能使用了,我估计是因为我电脑室安装了加密软件,造成部分源文件无法...
wince5 响应右键时事 cannot execute program
添加相应的头文件和库rnrn但执行时 rn if(::SHRecognizeGesture(&shrg) == GN_CONTEXTMENU)//长按键消息 rn rnrn在这条语句<em>出现</em>了 <em>cannot</em> <em>execute</em> <em>program</em> 请问怎样解决?
tensorflow学习入门
深度学习框架tensorflow安装,基本概念,入门学习
使用MyBatis进行数据库的操作,出现XAER_RMFAIL错误
n org.infinispann infinispan-commonsn 8.0.2.Finalnnn org.springframework.boot</g
程序调试没错误了还是出现cannot execute program 提示框?
为什么我的程序调试没<em>错误</em>了 还是<em>出现</em><em>cannot</em> <em>execute</em> <em>program</em> 提示框?生成的程序无法执行呢
一个AsyncTask的错误,显然我又一次执行了Async的Execute方法
07-09 23:30:11.085 23377-23377/com.wp.cheez E/AndroidRuntime: FATAL EXCEPTION: main    Process: com.wp.cheez, PID: 23377    java.lang.IllegalStateException: Cannot <em>execute</em> task: the task has already b...
VS 2013 professional版在win10上安装出错的解决方法
VS 2013 professional版在win10上安装的问题解决方法nnnwin10上安装完VS 2012 professional和VS 2017 professional后,由于项目的需要,要在电脑上继续安装VS2013 pro,结果<em>出现</em>了下面3个问题,已经一一解决,解决方法总结如下~nnn问题1. Setup Failed! Install <em>cannot</em> continue
Cannot run program "python": CreateProcess error=2, 系统找不到指定的文件——IDEA本地Test解决方案记录
首先确定是否安装python,rnwindows下使用cmd命令,键入 python 回车。rn命令未查找到即未安装,如下图显示版本号即安装完成。rn安装Anaconda时勾选自动添加环境变量配置按钮。rnrn已安装,未配置环境变量的需手动配置。rnPATH=D:\Anaconda3;D:\Anaconda3\Library\mingw-w64\bin;rnD:\Anaconda3\Library\usr\bi...
PyCharm-运行错误-找不到指定文件python.exe (python2和3都适用)
1、现象nn系统提示找不到指定的文件:nnError running 'hello': Cannot run <em>program</em> &quot;x:xxx\Scripts\python3.exe&quot; (in directory &quot;\文件名&quot;): CreateProcess error=2, 系统找不到指定的文件python3.exe。nn2. 缘由nnpython的编译环境,被移动了位置nn3. 解决nn(1) ...
IDEA从svn检出项目报错Cannot checkout from svn: 'C:\Program' 不是内部或外部命令,也不是可运行的程序 或批处理文件。
Cannot checkout from svn: ‘C:\Program’ 不是内部或外部命令,也不是可运行的程序n或批处理文件。nn解决方法:nnn去掉默认框里面的勾就可以了nn
openoffice4 不能正常启动终极解决方案
环境:[root@a786 zwy]# cat /etc/issuenCentOS release 6.7 (Final)nKernel \r on an \mopenoffice 不能正常启动原因排查。症状:没有任何输出,启动后,输出对应pid,但是会闪退。解决方案整理如下: n步骤1:卸载已安装的openoffice4。1.1 干掉已安装包和文件[root@dev ~]# rpm -e `rpm
JLINK驱动刷新之WIN7
今天遇到一个问题,我在新的版本KEIL提示我更新JLINK驱动之后,<em>出现</em>JLINK驱动丢失现象,指示灯也不亮了。在网上查了许多资料尝试了好久,最后终于弄好了n1、主要问题<em>出现</em>在我执行完各个操作之后,最后在PORT<em>出现</em>了 bossa <em>program</em> com 这样的一个驱动,直接导致我设置好 SAM-PROG2.4之后,write按钮一直显示为灰色。n2、然后我禁止了系统自动UPDATE驱动,选择
eclipse提示CreateProcess error=87错误的解决方法
eclipse提示CreateProcess error=87<em>错误</em>的解决方法,有可能是因为因为eclipse里设置的某个环境变量路径太长太深导致。
MinGW-w64安装---主要是解决ERROR res错误问题
n n n MinGW,是Minimalist GNUfor Windows的缩写。它是一个可自由使用和自由发布的Windows特定头文件和使用GNU工具集导入库的集合,允许你在GNU/Linux和Windows平台生成本地的Windows程序而不需要第三方C运行时(C Runtime)库。MinGW 是一组包含文件和端口库,其功能是允许控制台模式的程序使用微软的标准...
Python安装遇到的问题汇总(持续更新)
Python安装遇到的问题汇总nn1.安装 padans_datareader n在Anaconda 中搜索安装或者执行命令安装: n n导入pandans_datareader报错问题: n参考解决:ImportError: <em>cannot</em> import name ‘is_list_like’ n...
PhpStorm中报 “Cannot run program git.exe, 系统找不到指定的文件” 错误的解决方法
在使用PhpStorm的GitHub或Git功能时,经常会<em>出现</em>以下<em>错误</em>信息:rnrnCannot run <em>program</em> "git.exe": CreateProcess error=2, 系统找不到指定的文件。rnrnrn原因分析:rnrnrn电脑还未安装git客户端虽然安装了git客户端,但系统无法直接找到git.exe文件,即路径不完整rnrnrnrn解决方法:rn1. 从Github Fo
node.js系统找不到指定文件报错
问题: nException occurred executing command line. nCannot run <em>program</em> “node” (in directory “C:\Users\Calora\workspace2\hw”): CreateProcess error=2, 系统找不到指定的文件。系统:win32 n解决方法: n1.下载node.exe 下载地址:https:/
史上巨坑eureka注册,出现TransportException异常
由于自己造轮子,所以踩了好久的坑,导致<em>出现</em>以下异常。com.netflix.discovery.shared.transport.TransportException: Cannot <em>execute</em> request on any known servern at com.netflix.discovery.shared.transport.decorator.RetryableEurekaHttp...
安装eclipse时jdk、ADT、sdk的配置问题解决办法
本想写一下安装linux时遇到的问题,可昨天保存的截图不翼而飞了~~作罢,正好昨天重装的双系统,今天配置下win7下的eclipse,遇到了问题还要下软件,翻看以前的笔记,麻烦。rn说一下,有的解决办法时转载的,当时是保存到笔记里把链接删了,今天又拿出来不知道原地址了,这里是汇总一下我当时安装时<em>出现</em>的问题。rn接下来进入主题:rnrnrnrn先说下安装过程,然后讲述一下安装过程中<em>出现</em>的问题:rn1
运行c++ primer中的例子,编译没有错误,但是运行时出现这个错误: Cannot execute program
例子全部代码:rn#includern#includern#includernrnint main()rnrn vector ivec;rnrn // size should be zero; capacity is implementation definedrn cout << "ivec: size: " << ivec.size()rn << " capacity: " << ivec.capacity() << endl;rnrn // give ivec 24 elementsrn for (vector::size_type ix = 0; ix != 24; ++ix)rn ivec.push_back(ix);rnrn // size should be 24; capacity will be >= 24 and is implementation definedrn cout << "ivec: size: " << ivec.size()rn << " capacity: " << ivec.capacity() << endl;rnrn return 0;rnrn代码就是这样的,rn工程制作过程是这样的:rnnewprojectsWin32 Console Application输入project namernnewfile C++ Source File 输入 Source File name.rn写入代码。。。。rn编译,运行,
求助Cannot load program错误
我自己写了一个动态库test.so,这个动态库同时会调用一个开源静态库libssl.a,rn然后我又写了一个调用test.so的程序test,在编译过程中没有报错,但是在启动test程序时,报错:rnexec(): 0509-036 Cannot load <em>program</em> test rnbecause of the following errors:rnrtld: 0712-001 Symbol BIO_f_base64 was referencedrn from module /home/ccc/lib test.so but a runtime definitionrn of the symbol was not found.rnrn我在编译test.so时已经链接了libssl.a,在编译test程序时也链接了libssl.a,BIO_f_base64函数是libssl.a里面定义的,makefile过程已经打印出来,确实包含libssl.a,但是在执行ldd test时,发现没有libssl.a.rnrn在线求解答!!!rnrn谢谢啦~
自动化项目部署过程可能遇到的各种BUG
不断补充中。。rn0、maven 启动 测试用例 报错问题。rn<em>错误</em>日志如下。rn***********************日志bigan*************************************rn[ERROR] Failed to <em>execute</em> goal com.github.eirslett:frontend-maven-plugin:1.0:npm (npm inst
关于GNS3 IOU 和 VM主机相连的问题
小弟有个问题,我用GNS31.2.3 iou 模拟了交换机和路由器,但不知道为什么不能和VM里安装的XP想连。请帮我看看吧。 我的操作过程在增加一台主机,不知道这个对话框是什么意思?
安装vmware tools错误解决办法
[size=medium] [b] 安装vmware tools<em>错误</em>解决办法[/b][/size]rn很多朋友都在用vmware装linux,在安装vmware tools的时候,由于操作不当,在安装vmware tools中途中断,在第二次安装的时候,系统提示vmware tools安装已存在,要安就要先卸载,可是yes后,提示error:unable to ...
ADS v1.2 错误合集
1 error:L6239E: Cannot call THUMB symbol 'thumb1' in non-interworking object armex.0 from ARM code in armex.o默认是ARM编程,想要ARM混合编程的话需要勾选刚开始只勾选这一项的这个时候,仍会出错,把Language Settings全勾选了才好,但是之后为了记录这个<em>错误</em>,重新勾选,只勾选这...
jsp页面引入bootstrap时出现异常
异常:nutil.js:56 Uncaught TypeError: Cannot read property ‘fn’ of undefinednat setTransitionEndSupport (util.js:56)nat util.js:147nat util.js:10nat bootstrap.js:9nat bootstrap.js:10n引入的bootstrap的文件n&amp;lt;...
Prometheus配置过程中出现的bug及解决方案
一、简介rnNode exporter,Promenade和Alertmanager在安装配置后,Prometheus运行<em>出现</em>的bug,并针对这些bug进行了解决。本博客主要总结这些bug和解决方案,进行记录。rnPrometheus运行命令参考如下:rndocker run -p 9090:9090 -v /tmp/prometheus.yml:/etc/prometheus/prometheus.y...
Vue项目一段时间没运行今天运行出现了eslint的错误求大神解决!
npm run dev后就<em>出现</em>这个 很久没打开的项目 求大神告知如何解决!!谢谢
手动安装postgis时遇到的坑
在使用源代码安装postgis的过程中, 需要先安装proj-4.9.1,geos-3.5.0,libxml2-2.6.30, 最后再安装postgis. 以下是安装过程中遇到的坑.
dev-c++ unable to run program file 问题解决办法
主要解决dev-c++ 在编译的时候报unable to run <em>program</em> file <em>错误</em>的问题 mail:gychqyl@126.com
Navicat链接数据库奇葩错误
今天使用Navicat ,其他功能都正常,但是新建查询的时候,<em>出现</em>一个很奇葩的问题rnrnrnD:\Program Files (x86)\PremiumSoft\Navicat for MySQL8.1/_NAVICAT_DESIGNQUERY.sql.bak  系统找不到指定路径rnrnrnrn找了半天找不到解决办法,重装也不好使,恶心死了。rnrnrn最后发现,改一下属性就好了rnrnrn在
maven和jdk不配套,导致maven失败
使用idea下载了一份开源程序,然后使用maven install,结果只报了如下<em>错误</em>。研究了半天,结果是因为jdk和maven不配套导致的,我使用的是jdk1.7.0_04和maven 3.5,后面我将maven修改成了apache-maven-3.2.3,install正常了。rnrnrnrnrn"C:\Program Files\Java\jdk1.7.0_04\bin\java" -Dma
新建项目报错,Failed to execute appt 错误,导致R文件报错的解决办法
<em>错误</em>的问题:nnError:FAILURE: Build failed with an exception.nnn// What went wrong:nExecution failed for task ':app:processDebugResources'.n> com.android.ide.common.process.ProcessException: Failed to <em>execute</em>nnaaptnnn//Try:nRun with --stacktrace option to get the
Mac配置Eclipse CDT的Debug出现的问题
问题1:<em>出现</em> Could not determine GDB version using command: gdb --version原因:mac上没有安装gdb或者gdb位置配置有问题解决方法:1 安装gdb,2 如果确定已经安装了gdb,需要配置Eclipse中Debuger的路径:项目右键-》Debug As-》Debug Configurations-》左侧C++ Application找...
编译hbase-1.2.3源代码
目录n目录 1n1. 约定 1n2. 安装jdk 1n3. 安装maven 1n4. 网络配置 2n4.1. eclipse 3n4.2. maven 3n5. 从hbase官网下载源代码包: 4n6. eclipse导入hbase源代码 4n7. 编译hbase-thrift 6n8. Problems opening an editor ... does not exis
PyCharm-错误-找不到指定文件python.exe
1、现象nn系统提示找不到指定的文件:nnError running 'hello': Cannot run <em>program</em> &quot;B:\pystudy\venv\Scripts\python.exe&quot; (in directory &quot;\python-study&quot;): CreateProcess error=2, 系统找不到指定的文件。nnnn2、原因nn原来的工程目录(B盘)下,保存了python的编...
Centos安装NodeJs 二进制文件方法
1、在官网https://nodejs.org/en/download/下载Linux Binaries (.tar.xz)文件:node-v4.4.2-linux-x64.tar.xzrn2、解压 xz -d  得到node-v4.4.2-linux-x64.tarrn再使用命令 tar -xvf node-v4.4.2-linux-x64.tar  解压文件rn3、设置环境变量rnvim /e
Eclipse编译调试Cocos2d问题汇总
<em>出现</em>无法找到GLEnfatal error: GLES2/gl2platform.h: No such file or directory  nApplication.mkn 中加上 APP_PLATFORM := android-19(当前使用的安卓版本)
Odoo运行出现错误:Could not execute command lessc的解决办法
    按照文档搭建好odoo10运行环境,在运行odoo的时候<em>出现</em>Could not <em>execute</em> command lessc。    解决过程:卸载Node.js,重新选择8.11版本安装,进入cmd切换到C:\Program Files\nodejs目录,执行npm install -d less,安装完成后,将C:\Program Files\nodejs\node_modules\.b...
学习 spring cloud 时错误笔记
最近在慢慢学习cloud的相关知识,会把碰见的一些问题记录下来。 n对照学习的参考链接:【程序猿DD】Spring Cloud构建微服务架构系列,持续更新~](http://bbs.springcloud.com.cn/d/1-dd-spring-cloud) n在 spring cloud 入门时避免不了<em>出现</em>大大小小的问题,我就把我遇到的问题和解决方法贴在下面:nnn n 1, Conne
findbugs-maven-plugin:3.0.0求助,hadoop源码编译报错,已安装过findbugs并尝试了多个版本
main:[INFO] Executed tasks[INFO] [INFO] --- hadoop-maven-plugins:2.7.5:protoc (compile-protoc) @ hadoop-hdfs ---[INFO] [INFO] &amp;lt;&amp;lt;&amp;lt; maven-source-plugin:2.3:test-jar (default) &amp;lt; generate-sour...
java CreateProcess error=740 请求的操作需要提升的问题
关于:java CreateProcess error=740 请求的操作需要提升的问题的解决方法!
adb连接时经常出现这个错误CreateProcess failure, error 2 *, 创建过程失败,错误2
把 adb.exe fastboot.exe AdbWinApi.dll AdbWinUsbApi.dll这个四个文件粘贴到C:\Windows\SysWOW64目录下,然后重新启动cmd即可
Selenium+PhantomJS使用时报错原因及解决方案
今天在学Selenium+PhantomJS的时候,报如下<em>错误</em>:nImportError: <em>cannot</em> import name webdrivernn具体原因就是你的文件名是’selenium.py’,这会导致引用的时候,先调用自己创建的这个文件,所以就找不到了。n除此之外值得注意的一点就是,在改了文件名以后,还要删掉生成的selenium.pyc这个文件才行。nn...
openoffice 安装与报错解决
参考bolg: n http://blog.csdn.net/zhiaixiatian/article/details/42191627 n http://blog.csdn.net/cuker919/article/details/46389449 n - 环境 n - centos 7.5 n - openoffice4.0 n - 安装方法 n - 上传安装,链接地址安装包
整理js中出现的各种错误(一)
                                                  整理js中<em>出现</em>的各种<em>错误</em>(一)nn nn1.  谷歌: Uncaught DOMException: Failed to <em>execute</em> 'appendChild' on 'Node': Only one element on document allowed.(在“节点”上执行“appendChi...
Maven编译打包spark(2.1.0)源码及出现问题的解决方案(win7+Intellij IDEA)
Maven编译打包spark(2.1.0)源码及<em>出现</em>问题的解决方案(win7+Intellij IDEA)n 编译spark源码进行二次开发,中间<em>出现</em>的问题及解决方法
Win10正常安装Matlab7.0后,运行出现Runtime Error错误解决方法
Win10正常安装Matlab7.0之后,打开<em>出现</em>Runtime Error<em>错误</em>解决方法nnerror如下:nnnn解决办法如下:nnMatlb图标--&amp;gt;点击右键-&amp;gt;属性-&amp;gt;兼容性,勾选“以兼容模式运行这个程序”,选择“Windos Vista”,再点击应用--&amp;gt;确认 就OK了nn具体看你的电脑的系统,我的电脑选择“Windos Vista”就可以了,选其它的“Windos...
纪念自动创建表的辛酸历程之自动建表时出现could not execute statement错误
emmmm,虽然老师在课上讲过,可能因为是一个小小的知识点所以转头就忘记了<em>出现</em>这个<em>错误</em>的时候应该怎么解决,为了解决这个问题真的是煞费苦心其实真的非常简单,我们经常会遇见这样的情况,问题很简单,解决问题的方法也很简单,可是寻找这个方法的过程很艰难只要在配置文件中将方言改为第二行,就可以畅快使用自动建表没烦恼恩没错,,就这么简单...
DEVC++编译奇怪报错问题解决
DEVC++编译奇怪报错问题解决rnrn平时都是在linux下编软件,偶尔才会编两个windows工具程序方便大家使用。所以一直使用轻量级的IDE DEVC++来编译,但有天突然发现以前可以通过DEVC++编译的代码突然就编不过了。报错还很奇怪。rnrnrn示例代码如下:rnrn#include stdio.h>nn#define dprintf(format, argv...) printf("
大富翁手机版源代码(运行成功基本没有bug)下载
手机版大富翁,小型的基于手机的java游戏。 相关下载链接:[url=//download.csdn.net/download/zhb_satan/2944634?utm_source=bbsseo]//download.csdn.net/download/zhb_satan/2944634?utm_source=bbsseo[/url]
侠客密码查看器 4.85 Build 10.1230下载
侠客密码查看器是一款功能强大的密码查看软件 支持Windows系统中 '***' 显示的星号密码查看 支持拨号密码查看,包括ADSL上网密码查看与LAN上网密码查看 支持网页中 '***' 显示的星号密码查看,支持框架页面 支持IE自动完成的密码、表单内容查看与密码列表保存 支持OutLook Express邮件帐户密码查看 支持Windows自动登录密码查看 支持CMOS开机密码清除 支持IE分级审查密码清除 支持Foxmail帐户密码清除 支持微软公司软件产品序列号获取 相关下载链接:[url=//download.csdn.net/download/lxmans/3247875?utm_source=bbsseo]//download.csdn.net/download/lxmans/3247875?utm_source=bbsseo[/url]
虚拟ADSL客户端_1.8.0 Beta for 兰州交大博文学院下载
这是一个很好的虚拟上网adsl软件,带宽比较我们学校都用这个没带宽限制 相关下载链接:[url=//download.csdn.net/download/pengkai123/3324673?utm_source=bbsseo]//download.csdn.net/download/pengkai123/3324673?utm_source=bbsseo[/url]
文章热词 机器学习教程 Objective-C培训 交互设计视频教程 颜色模型 设计制作学习
相关热词 mysql关联查询两次本表 native底部 react extjs glyph 图标 区块链什么时候出现的 java学习常出现的问题
我们是很有底线的