test

扩充话题 > 程序人生 [问题点数:20分,结帖人stuwei]
等级
本版专家分:13220
结帖率 100%
等级
本版专家分:51
等级
本版专家分:13220
等级
本版专家分:1846
等级
本版专家分:9434
stuwei

等级:

正则验证时test()方法

test() 方法用于检测一个字符串是否匹配某个模式. 规则.test(str); 返回值:如果字符串中含有与所写正则匹配的文本,则返回true,否则返回false。

java单元测试(@Test

初学者在写java代码的时候,可能会因为写一个小功能就要写一个类,写一个main方法而苦恼。其实java的工程师在很早的时候就提供了解决的方案。就是我们今天要讲 的Junit测试。 在使用的时候首先需要配置环境: ...

linux 中的test 命令

转载:... test命令用法。 ...功能:检查文件和比较值 ... if test (表达式为真) ... if test !... test 表达式1 –a 表达式2 两个表达式都为真 ... test 表达式1 –o 表达式2 

test命令

test命令编程开发 =[] 如[-e file.txt]test命令是shell环境中测试条件表达式的实用工具。 语法test(选项)选项-b<文件>:如果文件为一个块特殊文件,则为真; -c<文件>:如果文件为...

R语言|函数|t.test()

t.test(x, y = NULL,  alternative = c("two.sided", "less", "greater"),  mu = 0, paired = FALSE, var.equal = FALSE,  conf.level = 0.95, ...) Value A list with class...

【TestNG】TestNG使用教程详解

一、TestNG介绍 TestNG是Java中的一个测试框架, 类似于JUnit 和NUnit, 功能都差不多, 只是功能更加强大,使用也更方便。 二、TestNG安装(基于eclipse+maven) 工程的pom.xml中需要添加如下内容: ...

关于C++/JAVA类中的static成员和对象成员的说法正确的是:

A:static成员变量在对象构造时候生成 B: static成员函数在对象成员函数中无法调用 C: 虚成员函数不可能是static成员函数 ...D: static成员函数不能访问static成员变量 ...答案:c 解释,(1)类的static成员...

javadoc注释规范

java中的注释,大家应该已经很熟悉了。 文档注释可以用于对类、属性、方法等进行说明。写文档注释时除了需要使用 /** .... */ 限定之外,还需要注意注释内部的一些细节问题。 1文档和文档注释的格式化 ...

java 如何使用@test

java 如何使用@test 如何使用@test

使用Go Test测试单个文件和单个方法

1、文件名须以"_test.go"结尾 2、方法名须以"Test"打头,并且形参为 (t *testing.T) 举例:/hello_test.go package main import ( "testing" "fmt" ) func TestHello(t *testing.T) { fmt.Println("Test...

IDEA Maven打包时去掉test

Junit4中Test Suite的用法

貌似目前项目用到的Eclipse中新建Test Suite的向导是针对Junit3的,而且网上很多资料介绍Test Suite也都是Junit3的,这里简要介绍一下Junit4中Test Suite的使用方法。 一种是类似Junit3的方法: public ...

go test 测试单个文件和测试单个函数

1,测试单个文件

简单的GCC语法: 弄清gcc test.c 与 gcc -c test.c 的差别

简单的GCC语法: 如果你只有一个文件(或者只有几个文件),那么就可以不写Makefile文件(当然有Makefile更加方便),用gcc直接编译就行了。...表示只编译test.c文件,成功时输出目标文件test.o gcc

三种t-test的区别

1.单一样本T检验(One-Sample T Test),用于比较一个正态总体在方差未知时总体均值与某一已知数是否有显著性差异。或者说,用看比较未知样本总体的均值和已知样本总体的均值(这个是已知的)是否有显著性差异。这里...

缺少类型说明符 - 假定为 int。注意: C++ 不支持默认 int---->解决方法

写了一个对应让其出的错误(其实也挺不容易的喔 )错误如下:1>d:\work\win32project\testeachotherclude\testeachotherclude\test2.h(9): error C2143: 语法错误 : 缺少“;”(在“*”的前面)1>d:\work\win32project...

mybatis的动态sql之if test用法

参数为String,if test读取该参数代码: SELECT MAX(DEPART_ID) FROM T_P_DEPART <if test=

maven编译时出现There are test failures

[ERROR] Failed to execute goal org.apache.maven.plugins:maven-surefire-plugin:2.10:test (default-test) on project web_nanchang: There are test failures.[ERROR][ERROR] Please refer to E:\maven\web_nanc

gtest的TEST_F与TEST的区别

TEST_F与TEST的区别是,TEST_F提供了一个初始化函数(SetUp)和一个清理函数(TearDown),在TEST_F中使用的变量可以在初始化函数SetUp中初始化,在TearDown中销毁,并且所有的TEST_F是互相独立的,都是在初始化以后的...

引入了junit为什么还是用不了@Test注解

pom文件明明引入了unit,为什么还是用不了@Test? 配置如下: junit junit ${junit.version} test原因:上述scope配置了Junit可用的位置,test表示只能在src下的test文件夹下面才可以使用解决办法:去掉scope...

ftp查看本地目录文件

问到一个简单的问题,ftp到远程服务器之后需要上传一个文件,但是我忘记了本地需要上传的文件名,因此需要查看本地目录。 解决方法: 1 lcd到本地目录 2 !ls查看本地目录的内容。...ftp> GUI test

import org.junit.Test 和@Test报错---解决方案大全

在最近用spring框架做项目的时候,发现不定时出现import org.junit.Test 和@Test报错,在包没有导入错误的前提下,该问题的解决方案如下:解决方案一:MyEclipse 在项目右击属性选择【build path】的【add ...

maven编译,打包的时候跳过test

方式1:用命令带上参数mvn install -Dmaven.test.skip=true方式2:在pom.xml里面配置 123456789&lt;plugins&gt; &lt;plugin&gt; &lt;groupId&gt;org.apache.maven.plugins&lt;/...

获取NSArray的前几个元素,取数组中某个元素

NSArray *smallArray = [largeArray subarrayWithRange:NSMakeRange(0, 10)]; NSArray *symptoms = [NSArray arrayWithArray:[self.dataSource[section] objectForKey:kDataSourceSectionKey]];

makefile入门

linux下编程,makefile的重要性不用多说,网上一大堆,今天简单的实战一下。...makefile test1.cpp test2.cpp [xxx@localhost test]$ cat test1.cpp #include int main() { printf("this is test1\n"); return

JS正则test()方法

每个正则表达式都有一个 lastIndex 属性,用于记录上一次匹配结束的位置,包括exec方法。...alert(re.test(str)); //返回true str = "1234567"; alert(re.test(str)); //返回false 解决

IDEA 配置JUnit 并自动生成Test文件夹和类

1. Preferences --> Plugins 安装Junit Generator ...2.设置Junit的Output Path目录为${SOURCEPATH}/../test/${PACKAGE}/${FILENAME},否则默认为${SOURCEPATH}/test/${PACKAGE}/${FILENAME} ,此目标和Maven设置test

linux awk把修改写入原文件中

[root@system1 ~]# cat test test word test word test word test word test word word test word hello test word nihao test word nihao test word hi test word test word test word test wor

初见Java消息中间件之ActiveMQ

消息中间件概况消息队列技术是分布式应用间交换信息的一种技术。消息队列可驻留在内存或磁盘上,队列存储消息直到它们被应用程序读走。通过消息队列,应用程序可独立地执行–它们不需要知道彼此的位置、或在继续执行...

@test在idea使用不了的问题

2018 10-16关于@test在idea使用不了的问题 1.有的人导入JUint 4 jar包,发现@test还是使用不了,这是因为你没有修改JUnit配置,导致必须放在Test文件目录下才能使用@Test进行测试。 2.第一步:打开idea 点击File&...

相关热词 c#等比例压缩图片大小 c# word 替换 c# mysql插入 c#窗体上的叉添加事件 c#打印图片文件 c#後台調前台js c#控制台美化 c#获取当前的农历日期 c# 构造函数重载 c#代码修改服务器时间