failed to get data for *错误

Delphi > Windows SDK/API [问题点数:20分,结帖人iqyely]
等级
本版专家分:2688
结帖率 95.45%
等级
本版专家分:2688
iqyely

等级:

Tensorflow ERROR(错误):Failed to get convolution algorithm.

运行卷积运算时出现下面错误: 出现原因:同时打开了PyCharm和VSCode两个编译器,造成了内存占用过多。 解决方法:关掉其中一个编译器,编译即可通过 --------------------------------------------------------...

failed to get the installation date from the system registy

今天,安装了一个Xmanager,点Xstart,输入完毕信息后,点run,出现了该错误failed to get the installation date from the system registy 解决方法:进Xmanager的XBrowser,点help,点abort Broswer,点击'enter ...

Springboot jar 部署IllegalStateException: Failed to get nested archive for entry BOOT-INF/lib/byte-...

Exception in thread &... java.lang.IllegalStateException: Failed to get nested archive for entry BOOT-INF/lib/byte-buddy-1.7.11.jar at org.springframework.boot.loader.archive.JarFileArchive.getNes...

解决Failed to get convolution algorithm. cudnn failed to initialize...

CuDNN library compatibility error after loading model weights服务器环境错误原因如解决方案 服务器环境 Ubuntu16.04、cuda9.0、cudnn7.0、tensorflow...Failed to get convolution algorithm. cudnn failed to...

完美解决问题:Failed to get convolution algorithm

写在前面 用pycharm或jupyter notebook运行...Failed to get convolution algorithm. This is probably because cuDNN failed to initialize, so try looking to see if a warning log message was printed above...

Xmanager Failed to get the installation date from the system registry

Xmanager Failed to get the installation date from the system registry 默认分类 2011-02-14 11:15:12 阅读1563 评论7 字号:大中小 订阅 安装完Xmanager之后,使用的时候,运行Xmanager browser时,会出现以下...

Linux环境下C3P0 Failed to get local InetAddress for VMID 解决办法

今天在做一个项目中用到了C3P0数据源

tensorflow-gpu Failed to get convolution algorithm.

UnknownError (see above for traceback): Failed to get convolution algorithm. This is probably because cuDNN failed to initialize, so try looking to see if a warning log message was printed above. ...

Springboot: Failed to get nested archive for entry BOOT-INF/lib/ & Zip64 archives are not supported

$ java -Djava.security.egd=file:/dev/./urandom -Xms256m -Xmx256m -jar /opt/workspace/cheetah-node-v1.0.0-SNAPSHOT.cdh/sbin/../jars/cheetah-bootstrap-1.0.0-SNAPSHOT.jar ...

Failed to get convolution algorithm. This is probably because cuDNN failed to initialize【解决】

已安装系统背景 1、tensorflow-gpu==1.12 2、cuda9.0 3、cudnn-9.0-linux-x64-v7.tgz ...UnknownError (see above for traceback): Failed to get convolution algorithm. This is probably becau...

tensorflow keras tensorboard bug集锦UnknownError (see above for traceback): Failed to get ...

1:UnknownError (see above for traceback): Failed to get convolution algorithm. This is probably because cuDNN failed to initialize, 原因: CUDNN 版本跟TF需求不同 请参考TF官方安装手册 Tensorflow-gpu ...

Error: Failed to send data by channels – post message failed

转自:http://softwaretesttips.com/2013/08/01/error-failed-to-send-data-by-channels-post-message-failed/ In LoadRunner or Performance Center 11.00, during the middle of a running a scenario or ...

Ajax请求response下显示failed to load response data

ajax请求一个链接的时候response下显示failed to load response data 问题一:有数据返回-->将请求链接直接放在浏览器里请求的时候就会看到。【本地】 问题二:没数据返回-->将请求链接直接放在浏览器里请求的...

adb bugreport -- Failed to get bugreportz version

今天在查看电量时候,需要导出5.0手机的bugreport。 结果出现了下面的错误日志,几个月...Failed to get bugreportz version, which is only available on devices running Android 7.0 or later. Trying a plain-te

Android之java.lang.UnsatisfiedLinkError(Failed to register native method ***callMethod1())解决办法

Failed to register native method com.example.chenyu.test.JniClient.callMethod1() java.lang.UnsatisfiedLinkError: JNI_ERR returned from JNI_OnLoad in "/data/app/com.example.chenyu.test-2

js ajax请求成功,response显示 “failed to load response data

js ajax请求成功,response显示 “failed to load response data” #原因 服务端返回的数据量过大,导致数据无法展示; #通过"open in new tab "来查看返回的数据 注意: 如果该请求时Get请求,那没问题; 如果...

Ajax请求提示"Failed to load response data

今天上线后前端F12查看发现几个请求的response提示"Failed to load response data",经查是由于该请求对应的ajax属性timeout设置时长过短,而后台耗时过长导致的。 ...

Failed to retrieve data from /webhdfs/v1/?op=LISTSTATUS: Internal Server Error

Failed to retrieve data from /webhdfs/v1/?op=LISTSTATUS: Internal Server Error 这个异常会由很多原因发生,如果想确定是什么原因要查看,所访问的web界面的namenode的日志。 我本次遇到的这个异常,在...

[问题记录.WinDbg]WinDbg 调试遇到 Failed to load data access DLL, 0x80004005

【问题】 拿到服务人员提交的dump文件,用 DebugDiag Analysis/WinDbg 分析时提示以下...Failed to load data access DLL, 0x80004005 Verify that 1) you have a recent build of the debugger (6.2.14 or newer)  

tensorflow.python.framework.errors_impl.UnknownError: Failed to get convolution algorithm....

一、问题描述 ...tensorflow.python.framework.errors_impl.UnknownError: Failed to get convolution algorithm. This is probably because cuDNN failed to initialize, so try looking to s...

分析、解决java访问HBase 1.2.4时put数据卡住很久并报错:Failed to get region location

终于配置好了完全分布式的HBase1.2.4的环境,zookeeper集群是独立的,即HBase没有托管ZooKeeper的集群,研究清楚了新版本的api的变化,遂写好了简单的demo代码往某张表里put数据,api很简单从略,运行时卡住,程序...

初始化hive时org.apache.hadoop.hive.metastore.HiveMetaException: Failed to get schema version

org.apache.hadoop.hive.metastore.HiveMetaException: Failed to get schema version +java.sql.SQLException : The server time zone value 'Öйú±ê׼ʱ¼ä' is unrecognized or represents more than ...

Get data from file(xxx.png) failed!

最近有很多朋友在群里问用VS+Cocos2d-x 加载图片资源时总是报“ Get data from file(xxx.png) failed! ” 错误,问题虽小,但却能影响项目的往下进行,在一遍又一遍的检查后,还是没有什么发现,这着实让人抓狂哇~~~...

PHP Warning: file_get_contents failed to open stream解决办法

file_get_contents函数在获得远程文件时提示Warning: file_get_contents failed to open stream,希望例子能够帮助到各位,希望例子能够帮助到大家。 在做项目时用 file_get_contents 来获取数据,php 报错 ...

成功解决NotFoundError (see above for traceback): Failed to create a directory: ; No such file or ...

成功解决NotFoundError (see above for traceback): Failed to create a directory: ; No such file or directo 目录 解决问题 解决方法 解决问题 NotFoundError (see above for traceback): Failed ...

vs2010+pcl运行cloudviewer时出现Failed to find match for field 'rgba'.

以下附上可视化点云的cloudviewer.cpp代码: #include <pcl/visualization/cloud_viewer.h> #include <iostream> #include <pcl/io/io.h&...int user_data; void v...

Failure[INSTALL_PARSE_FAILED_UNEXPECTED_EXCEPTION:failed to parse /data/app/base.apk: AndroidManifes

报错内容: Failure[INSTALL_PARSE_FAILED_UNEXPECTED_EXCEPTION:failed to parse /data/app/vmd11325441314.tmp/base.apk: AndroidManifest.xml] 解决办法

Spark standalone集群安装

本文不会搞什么Yarn混搭Spark,只想建立一个纯粹的Spark环境,太多层东西搅和在一起,不靠谱。创建spark服务运行帐号# useradd smilesmile帐号就是spark服务的运行帐号。下载安装包在root帐号下,下载最新安装包,...

PHP+mysql系统报错:PHP message: PHP Warning: Unknown: Failed to write session data (files)

PHP+mysql系统报错:PHP message: PHP Warning:  Unknown: Failed to write session data (files) 故障现象,后台页面点击没有反应,也不报错 通过查看log文件,可以通过在nginx中单独定义错误日志文件,方便...

新建项目报错,Failed to execute appt 错误,导致R文件报错的解决办法

错误的问题: Error:FAILURE: Build failed with an exception. // What went wrong: Execution failed for task ':app:processDebugResources'. > com.android.ide.common.process.ProcessException: Failed to ...

相关热词 c#绘制图形时界面闪烁 c# emgucv 行人 c# datable合并 c# if折叠 c# 设置全局锁 c# 如何定义全局变量 c# 获取剪切板内容 c#推箱子重新开始 c# 读取接口数据 c#配置 mysql