使用H-jtag时出现的错误 [问题点数:20分,结帖人dancheng1]

Bbs1
本版专家分:0
结帖率 91.67%
Bbs10
本版专家分:122425
版主
Blank
优秀版主 2015年7月优秀小版主
2015年5月优秀小版主
2014年11月论坛优秀版主
Blank
微软MVP 2014年7月荣获微软MVP称号
2013年7月 荣获微软MVP称号
2012年7月 荣获微软MVP称号
2011年7月 荣获微软MVP称号
2010年7月 荣获微软MVP称号
Blank
红花 2016年8月 硬件/嵌入开发大版内专家分月排行榜第一
2016年6月 硬件/嵌入开发大版内专家分月排行榜第一
2015年12月 硬件/嵌入开发大版内专家分月排行榜第一
2015年7月 硬件/嵌入开发大版内专家分月排行榜第一
2015年6月 硬件/嵌入开发大版内专家分月排行榜第一
2015年4月 硬件/嵌入开发大版内专家分月排行榜第一
2014年12月 硬件/嵌入开发大版内专家分月排行榜第一
2014年10月 硬件/嵌入开发大版内专家分月排行榜第一
2014年9月 硬件/嵌入开发大版内专家分月排行榜第一
2014年8月 硬件/嵌入开发大版内专家分月排行榜第一
2014年7月 硬件/嵌入开发大版内专家分月排行榜第一
2014年5月 硬件/嵌入开发大版内专家分月排行榜第一
2014年4月 硬件/嵌入开发大版内专家分月排行榜第一
2014年3月 硬件/嵌入开发大版内专家分月排行榜第一
2014年1月 硬件/嵌入开发大版内专家分月排行榜第一
2013年12月 硬件/嵌入开发大版内专家分月排行榜第一
2013年10月 硬件/嵌入开发大版内专家分月排行榜第一
2013年9月 硬件/嵌入开发大版内专家分月排行榜第一
2013年8月 硬件/嵌入开发大版内专家分月排行榜第一
2013年7月 硬件/嵌入开发大版内专家分月排行榜第一
2013年5月 硬件/嵌入开发大版内专家分月排行榜第一
2013年4月 硬件/嵌入开发大版内专家分月排行榜第一
2013年3月 硬件/嵌入开发大版内专家分月排行榜第一
2012年12月 硬件/嵌入开发大版内专家分月排行榜第一
2012年11月 硬件/嵌入开发大版内专家分月排行榜第一
2011年3月 硬件/嵌入开发大版内专家分月排行榜第一
2011年2月 硬件/嵌入开发大版内专家分月排行榜第一
2009年10月 硬件/嵌入开发大版内专家分月排行榜第一
2009年7月 硬件/嵌入开发大版内专家分月排行榜第一
2009年6月 硬件/嵌入开发大版内专家分月排行榜第一
2007年12月 硬件/嵌入开发大版内专家分月排行榜第一
2003年6月 硬件/嵌入开发大版内专家分月排行榜第一
2002年9月 硬件/嵌入开发大版内专家分月排行榜第一
2002年8月 硬件/嵌入开发大版内专家分月排行榜第一
2002年7月 硬件/嵌入开发大版内专家分月排行榜第一
2002年5月 硬件/嵌入开发大版内专家分月排行榜第一
2002年4月 硬件/嵌入开发大版内专家分月排行榜第一
Blank
黄花 2015年5月 硬件/嵌入开发大版内专家分月排行榜第二
2015年1月 硬件/嵌入开发大版内专家分月排行榜第二
2014年11月 硬件/嵌入开发大版内专家分月排行榜第二
2014年6月 硬件/嵌入开发大版内专家分月排行榜第二
2013年11月 硬件/嵌入开发大版内专家分月排行榜第二
2013年6月 硬件/嵌入开发大版内专家分月排行榜第二
2013年1月 硬件/嵌入开发大版内专家分月排行榜第二
2012年10月 硬件/嵌入开发大版内专家分月排行榜第二
2012年9月 硬件/嵌入开发大版内专家分月排行榜第二
2012年6月 硬件/嵌入开发大版内专家分月排行榜第二
2012年5月 硬件/嵌入开发大版内专家分月排行榜第二
2012年4月 硬件/嵌入开发大版内专家分月排行榜第二
2012年3月 硬件/嵌入开发大版内专家分月排行榜第二
2012年2月 硬件/嵌入开发大版内专家分月排行榜第二
2011年7月 硬件/嵌入开发大版内专家分月排行榜第二
2011年5月 硬件/嵌入开发大版内专家分月排行榜第二
2011年4月 硬件/嵌入开发大版内专家分月排行榜第二
2011年1月 硬件/嵌入开发大版内专家分月排行榜第二
2010年11月 硬件/嵌入开发大版内专家分月排行榜第二
2009年9月 硬件/嵌入开发大版内专家分月排行榜第二
2009年8月 硬件/嵌入开发大版内专家分月排行榜第二
2008年11月 硬件/嵌入开发大版内专家分月排行榜第二
2008年9月 硬件/嵌入开发大版内专家分月排行榜第二
2004年7月 硬件/嵌入开发大版内专家分月排行榜第二
2004年3月 硬件/嵌入开发大版内专家分月排行榜第二
2004年1月 硬件/嵌入开发大版内专家分月排行榜第二
2003年5月 硬件/嵌入开发大版内专家分月排行榜第二
Bbs1
本版专家分:0
使用自定义控件时出现错误
从网上下载下来的自定义控件代码,从05转到了08 代码本身没问题。rnrn但我将控件引用到页面中后 有的时候IDE就<em>出现</em>了“创建控件时出错” 这个问题不是总<em>出现</em>,关闭解决方案有的时候会好,如果不设置控件的属性也不会出问题。 rnrn程序运行没问题啊rnrnrn我希望大家能告诉为什么出这个问题,不要告诉我 关闭vs再开 或说 “运行没问题就行”rnrn我是抱着学习的态度来的 rnrnrn感谢
使用okhttp时出现错误
<em>出现</em>android.view.ViewRootImpl$CalledFromWrongThreadException这种<em>错误</em>, 原因是因为在onResponse执行的线程并不是UI线程。需要: @Override public void onResponse(final Response response) throws IOException { final String res
使用phpMyAdmin时出现错误
mysql已经开始运行,rn但是调出phpMyAdmin时显示:rnrnWillkommen bei phpMyAdmin 2.4.0rnrnFehlerrnMySQL meldet: rnrnUnknown MySQL Server Host 'localhost' (11001)rnrn如何解决?
使用spark时出现错误
刚刚开始<em>使用</em>spark+java,两个都不会没办法只能从头踩坑首先复制粘贴了wordcount工程import scala.Tuple2; import java.util.Arrays; import static com.google.common.base.Preconditions.checkArgument; /** * WordCountTask class, we will ...
使用Parameters.parambyname时出现错误
程序实现的功能就是查找在指定日期之间的数据,原程序如下:rn---------------------------------------------------------------------------------rnprocedure TF_Sale_Print.Button1Click(Sender: TObject);rnbeginrn with DataModuleMain.ADOQuery_Sale_Print dorn beginrn SQL.Clear;rn SQL.Add('select 员工名,客户名,产品名,销售日期,销售数量,销售单价,销售数量*销售单价 as 销售总额');rn SQL.Add('from customer a, sale b,produce c,employee d');rn SQL.Add('where b.员工号=d.员工号 and c.产品号=b.产品号 and a.客户号=b.客户号 and ');rn SQL.Add('b.销售日期>=:dt1 and b.销售日期).Value:=DateTimePicker2.Date; //问题语句rn endrnend;rn--------------------------------------------------------------------------------------rn可是,我在运行的时候,程序总是说dt1没有找到,请问这个是什么原因,如何解决,谢谢。rn
使用session变量时出现错误
我在文件中写入rnrn然后执行就<em>出现</em>:rnWarning: open(C:\PHP\sessiondata\sess_f656312a510040cc2bc64242d73e82db, O_RDWR) failed: m (2) in D:\。。。\1.php on line 2rnok! rnWarning: open(C:\PHP\sessiondata\sess_f656312a510040cc2bc64242d73e82db, O_RDWR) failed: m (2) in Unknown on line 0rnrnWarning: Failed to write session data (files). Please verify that the current setting of session.save_path is correct (C:\PHP\sessiondata) in Unknown on line 0 rn怎摸办啊???
H-JTAG使用文档 详细
H-JTAG <em>使用</em>文档 详细 照着步子来可以练习烧写我们的NOrflash,如果是s3c2410,请一定要记住拔下我们的跳线帽!不然,是烧不成功的
H-JTAG使用、设置
介绍H-JTAG软件的设置、<em>使用</em>等情况,对开发<em>使用</em>此软件的朋友来说,是不错的资料
H-jtag驱动程序,H-JTAG V0.8.0
H-JTAG V0.8.0,驱动程序,欢迎下载。。。
h-jtag
arm调试代理软件,支持arm7,arm7等
H-JTAG
JTAG下载软件,方便硬件调试
H-JTAG基本使用.pdf
H-JTAG基本<em>使用</em>.pdfH-JTAG基本<em>使用</em>.pdf
重装系统时出现错误
我的机器原来装的是windows 98 ,后来系统损坏,不能正常启动,我想把C盘重新格式化装windows 2000。在用2000光盘启动后,系统读完盘后提示:BOIS设置有<em>错误</em>,我重新进入BIOS设置,把它全改为默认值,再重新安装结果还是提示:BIOS设置有<em>错误</em>。该怎么办呢?
打包时出现错误
C:\Users\xuhf60\PycharmProjects\zhanhao&amp;gt;pyinstaller -D tongji.py --hidden-import =pandas._libs.tslibs.np_datetime --hidden-import=pandas._libs.tslibs.nattype --h idden-import=pandas._libs.skiplist ...
commit时出现错误
往一表里面插入数据,rnINSERT后我查看了SQLCA.SQLERRTEXT是没有<em>错误</em>的,rn但是COMMIT<em>出现</em>如下图中的<em>错误</em>,请帮忙看看是什么问题?rn[img=http://hi.csdn.net/attachment/201109/2/5516229_1314951682H4n0.jpg][/img]
在pull时出现错误
rn<em>错误</em>号:28574rnAn internal error occurred.rnparamenters:rnP0:IDrnerror:rnSSCE_M_INTERNALERROR rn请教这是哪里出问题了?
调试时出现错误
在调试时<em>出现</em>以下提示,怎么回事啊?rnrn“/Client”应用程序中的服务器<em>错误</em>。rn--------------------------------------------------------------------------------rnrn对路径“D:\WINDOWS\Microsoft.NET\Framework\v1.1.4322\Temporary ASP.NET Files\client\2396b281\bd666721”的访问被拒绝。 rn说明: 执行当前 Web 请求期间,<em>出现</em>未处理的异常。请检查堆栈跟踪信息,以了解有关该<em>错误</em>以及代码中导致<em>错误</em>的出处的详细信息。 rnrn异常详细信息: System.UnauthorizedAccessException: 对路径“D:\WINDOWS\Microsoft.NET\Framework\v1.1.4322\Temporary ASP.NET Files\client\2396b281\bd666721”的访问被拒绝。 rnrnASP.NET 未被授权访问所请求的资源。请考虑授予 ASP.NET 请求标识访问此资源的权限。ASP.NET 有一个在应用程序没有模拟时<em>使用</em>的基进程标识(通常,在 IIS 5 上为 MACHINE\ASPNET,在 IIS 6 上为网络服务)。如果应用程序正在通过 模拟,则标识将为匿名用户(通常为 IUSR_MACHINENAME)或经过身份验证的请求用户。 rnrn若要授予 ASP.NET 对文件的写访问权,请在资源管理器中右击该文件,选择“属性”,然后选择“安全”选项卡。单击“添加”添加适当的用户或组。突出显示 ASP.NET 帐户,选中所需访问权限对应的框。rnrn源<em>错误</em>: rnrn执行当前 Web 请求期间生成了未处理的异常。可以<em>使用</em>下面的异常堆栈跟踪信息确定有关异常原因和发生位置的信息。 rnrn堆栈跟踪: rnrnrn[UnauthorizedAccessException: 对路径“D:\WINDOWS\Microsoft.NET\Framework\v1.1.4322\Temporary ASP.NET Files\client\2396b281\bd666721”的访问被拒绝。]rn System.IO.__Error.WinIOError(Int32 errorCode, String str) +393rn System.IO.Directory.InternalCreateDirectory(String fullPath, String path) +632rn System.IO.Directory.CreateDirectory(String path) +195rn System.Web.Compilation.PreservedAssemblyEntry.DoFirstTimeInit(HttpContext context) +85rn System.Web.Compilation.PreservedAssemblyEntry.EnsureFirstTimeInit(HttpContext context) +97rn System.Web.Compilation.PreservedAssemblyEntry.GetPreservedAssemblyEntry(HttpContext context, String virtualPath, Boolean fApplicationFile) +29rn System.Web.UI.TemplateParser.GetParserCacheItemFromPreservedCompilation() +91rn System.Web.UI.TemplateParser.GetParserCacheItemInternal(Boolean fCreateIfNotFound) +148rn System.Web.UI.TemplateParser.GetParserCacheItemWithNewConfigPath() +125rn System.Web.UI.TemplateParser.GetParserCacheItem() +88rn System.Web.UI.ApplicationFileParser.GetCompiledApplicationType(String inputFile, HttpContext context, ApplicationFileParser& parser) +171rn System.Web.HttpApplicationFactory.CompileApplication(HttpContext context) +43rn System.Web.HttpApplicationFactory.Init(HttpContext context) +485rn System.Web.HttpApplicationFactory.GetApplicationInstance(HttpContext context) +170rn System.Web.HttpRuntime.ProcessRequestInternal(HttpWorkerRequest wr) +414rnrn rnrnrn--------------------------------------------------------------------------------rn版本信息: Microsoft .NET Framework 版本:1.1.4322.573; ASP.NET 版本:1.1.4322.573
连接数据库时出现错误
运行时提示:首先为"灾难性故障" 接着"连接无法用于执行此操作 在此上下文中它可能已被关闭或rnrn无效"rn 然后是"Runtime error rnabnormal progrtam termination" rnrn连接代码如下:(本来运行没有问题的,突然<em>出现</em>这种情况)rntryrnrnm_pConnection.CreateInstance(_uuidof(Connection));rnrn_bstr_t rnrnstrConnection="Provider=SQLOLEDB;Server=legend\\sqlserver2000;database=Stock;uid=lmn;pwd=lrnrnmnbelock";rnrnm_pConnection->Open(strConnection,"","",adModeUnknown);rnrnrncatch (_com_error e)rnrnAfxMessageBox(e.Description());rn
使用ASP生成XML文件时出现错误
<em>使用</em>ASP生成XML文件时<em>出现</em>的<em>错误</em> :rn生成XML文件时<em>出现</em>的<em>错误</em>:rn代码如下:rnrnstrSourceFile = Server.MapPath("xml/word.xml")rnSet objXML = Server.CreateObject("Microsoft.XMLDOM")rnobjXML.load(strSourceFile)rnIf objXML.parseError.ErrorCode <> 0 Then rnobjXML.loadXML ""rnEnd IfrnSet objRootlist = objXML.documentElement.selectSingleNode("xml")rnIf objRootlist.hasChildNodes thenrnid = objRootlist.lastChild.firstChild.text + 1rnElsernid=1rnEnd Ifrn rnSet oListNode = objXML.documentElement.selectSingleNode("xml").AppendChild(objXML.createElement("item"))rnrnSet oDetailsNode = oListNode.appendChild(objXML.createElement("id"))rnoDetailsNode.Text=idrnrnSet oDetailsNode = oListNode.appendChild(objXML.createElement("linktype"))rnoDetailsNode.Text="1"rnrnSet oDetailsNode = oListNode.appendChild(objXML.createElement("linkname"))rnoDetailsNode.Text=linknamernrnSet oDetailsNode = oListNode.appendChild(objXML.createElement("linkurl"))rnoDetailsNode.Text=linkurlrnrnSet oDetailsNode = oListNode.appendChild(objXML.createElement("imgpath"))rnoDetailsNode.Text=""rnrnSet oDetailsNode = oListNode.appendChild(objXML.createElement("addtime"))rnoDetailsNode.Text=now()rnrnSet oDetailsNode = oListNode.appendChild(objXML.createElement("ischeck"))rnoDetailsNode.Text="0"rnrnrnobjXML.save(strSourceFile) rnSet objXML=nothingrnrnrnrn<em>错误</em>类型:rnMicrosoft VBScript 运行时<em>错误</em> (0x800A01A8)rn缺少对象: 'objRootlist'rn/scrcdw/resume_updateXML1.asp, 第 11 行rnrn
android使用Toast时出现错误
前不久在做android项目的时候遇到的问题,分享出来希望能帮到大家。<em>错误</em>代码如下: 解决方法1:在调用Toast(或者AlertDialog)的地方的前面加上Looper.prepare(),后边加上Looper.loop()即可解决问题 解决方法2:<em>使用</em>Handler(处理者),把Toast放在Handler中实现,具体步骤如下: Handler handler = new
使用request.getSession()时出现NullPointerException错误
我做了一个简单的注册登录系统,登录时想把用户名保存到session中,但总是<em>出现</em>这样的<em>错误</em>:rnHTTP Status 500 -rnrntype Exception reportrnmessagerndescription The server encountered an internal error () that prevented it from fulfilling this request.rnexceptionrnjava.lang.NullPointerExceptionrn com.zzk.regandlogin.action.LoginAction.execute(LoginAction.java:63)rn sun.reflect.NativeMethodAccessorImpl.invoke0(Native Method)rn sun.reflect.NativeMethodAccessorImpl.invoke(NativeMethodAccessorImpl.java:39)rn sun.reflect.DelegatingMethodAccessorImpl.invoke(DelegatingMethodAccessorImpl.java:25)rn java.lang.reflect.Method.invoke(Method.java:585)rn com.opensymphony.xwork2.DefaultActionInvocation.invokeAction(DefaultActionInvocation.java:441)rn com.opensymphony.xwork2.DefaultActionInvocation.invokeActionOnly(DefaultActionInvocation.java:280)rn com.opensymphony.xwork2.DefaultActionInvocation.invoke(DefaultActionInvocation.java:243)rn com.opensymphony.xwork2.interceptor.DefaultWorkflowInterceptor.doIntercept(DefaultWorkflowInterceptor.java:165)rn com.opensymphony.xwork2.interceptor.MethodFilterInterceptor.intercept(MethodFilterInterceptor.java:87)rn com.opensymphony.xwork2.DefaultActionInvocation.invoke(DefaultActionInvocation.java:237)rn com.opensymphony.xwork2.validator.ValidationInterceptor.doIntercept(ValidationInterceptor.java:252)rn org.apache.struts2.interceptor.validation.AnnotationValidationInterceptor.doIntercept(AnnotationValidationInterceptor.java:68)rn com.opensymphony.xwork2.interceptor.MethodFilterInterceptor.intercept(MethodFilterInterceptor.java:87)rn com.opensymphony.xwork2.DefaultActionInvocation.invoke(DefaultActionInvocation.java:237)rn com.opensymphony.xwork2.interceptor.ConversionErrorInterceptor.intercept(ConversionErrorInterceptor.java:122)rn com.opensymphony.xwork2.DefaultActionInvocation.invoke(DefaultActionInvocation.java:237)rn com.opensymphony.xwork2.interceptor.ParametersInterceptor.doIntercept(ParametersInterceptor.java:195)rn com.opensymphony.xwork2.interceptor.MethodFilterInterceptor.intercept(MethodFilterInterceptor.java:87)rn com.opensymphony.xwork2.DefaultActionInvocation.invoke(DefaultActionInvocation.java:237)rn com.opensymphony.xwork2.interceptor.ParametersInterceptor.doIntercept(ParametersInterceptor.java:195)rn com.opensymphony.xwork2.interceptor.MethodFilterInterceptor.intercept(MethodFilterInterceptor.java:87)rn com.opensymphony.xwork2.DefaultActionInvocation.invoke(DefaultActionInvocation.java:237)rn com.opensymphony.xwork2.interceptor.StaticParametersInterceptor.intercept(StaticParametersInterceptor.java:179)rn com.opensymphony.xwork2.DefaultActionInvocation.invoke(DefaultActionInvocation.java:237)rn org.apache.struts2.interceptor.MultiselectInterceptor.intercept(MultiselectInterceptor.java:75)rn com.opensymphony.xwork2.DefaultActionInvocation.invoke(DefaultActionInvocation.java:237)rn org.apache.struts2.interceptor.CheckboxInterceptor.intercept(CheckboxInterceptor.java:94)rn com.opensymphony.xwork2.DefaultActionInvocation.invoke(DefaultActionInvocation.java:237)rn org.apache.struts2.interceptor.FileUploadInterceptor.intercept(FileUploadInterceptor.java:235)rn com.opensymphony.xwork2.DefaultActionInvocation.invoke(DefaultActionInvocation.java:237)rn com.opensymphony.xwork2.interceptor.ModelDrivenInterceptor.intercept(ModelDrivenInterceptor.java:89)rn com.opensymphony.xwork2.DefaultActionInvocation.invoke(DefaultActionInvocation.java:237)rn com.opensymphony.xwork2.interceptor.ScopedModelDrivenInterceptor.intercept(ScopedModelDrivenInterceptor.java:130)rn com.opensymphony.xwork2.DefaultActionInvocation.invoke(DefaultActionInvocation.java:237)rn org.apache.struts2.interceptor.debugging.DebuggingInterceptor.intercept(DebuggingInterceptor.java:267)rn com.opensymphony.xwork2.DefaultActionInvocation.invoke(DefaultActionInvocation.java:237)rn com.opensymphony.xwork2.interceptor.ChainingInterceptor.intercept(ChainingInterceptor.java:126)rn com.opensymphony.xwork2.DefaultActionInvocation.invoke(DefaultActionInvocation.java:237)rn com.opensymphony.xwork2.interceptor.PrepareInterceptor.doIntercept(PrepareInterceptor.java:138)rn com.opensymphony.xwork2.interceptor.MethodFilterInterceptor.intercept(MethodFilterInterceptor.java:87)rn com.opensymphony.xwork2.DefaultActionInvocation.invoke(DefaultActionInvocation.java:237)rn com.opensymphony.xwork2.interceptor.I18nInterceptor.intercept(I18nInterceptor.java:165)rn com.opensymphony.xwork2.DefaultActionInvocation.invoke(DefaultActionInvocation.java:237)rn org.apache.struts2.interceptor.ServletConfigInterceptor.intercept(ServletConfigInterceptor.java:164)rn com.opensymphony.xwork2.DefaultActionInvocation.invoke(DefaultActionInvocation.java:237)rn com.opensymphony.xwork2.interceptor.AliasInterceptor.intercept(AliasInterceptor.java:179)rn com.opensymphony.xwork2.DefaultActionInvocation.invoke(DefaultActionInvocation.java:237)rn com.opensymphony.xwork2.interceptor.ExceptionMappingInterceptor.intercept(ExceptionMappingInterceptor.java:176)rn com.opensymphony.xwork2.DefaultActionInvocation.invoke(DefaultActionInvocation.java:237)rn org.apache.struts2.impl.StrutsActionProxy.execute(StrutsActionProxy.java:52)rn org.apache.struts2.dispatcher.Dispatcher.serviceAction(Dispatcher.java:488)rn org.apache.struts2.dispatcher.ng.ExecuteOperations.executeAction(ExecuteOperations.java:77)rn org.apache.struts2.dispatcher.ng.filter.StrutsPrepareAndExecuteFilter.doFilter(StrutsPrepareAndExecuteFilter.java:91)rnnote The full stack trace of the root cause is available in the Apache Tomcat/6.0.33 logs.rnApache Tomcat/6.0.33rnrn[color=#FF0000]LoginAction.java中第63行的代码是:HttpSession session = request.getSession();rn不得到session时程序是正确的。[/color]rnrn以下是LoginAction.java中的全部代码:rnpackage com.zzk.regandlogin.action;rnrnimport javax.servlet.http.HttpServletRequest;rnimport javax.servlet.http.HttpSession;rnrnimport com.opensymphony.xwork2.ActionContext;rnimport com.opensymphony.xwork2.ActionSupport;rnimport com.opensymphony.xwork2.ModelDriven;rnimport com.zzk.regandlogin.dao.UserDAOImpl;rnimport com.zzk.regandlogin.dao.interfaces.UserDAO;rnimport com.zzk.regandlogin.model.User;rnrnpublic class LoginAction extends ActionSupport implements ModelDriven rnrn private static final long serialVersionUID = -1655622871625965987L;rn rn private User user = new User();rn private HttpServletRequest request;rnrn public HttpServletRequest getRequest() rn return request;rn rnrnrn public void setRequest(HttpServletRequest request) rn this.request = request;rn// this.request = (HttpServletRequest)ActionContext.getContext().getSession().get(ServletActionContext.HTTP_REQUEST);rn rnrn public User getModel() rn return user;rn rn rn public String execute() throws Exceptionrn UserDAO userDAO = new UserDAOImpl();rn Object obj = ActionContext.getContext().getSession().get("validation_code");rn String validationCode = (obj != null) ? obj.toString() : "";rn rn if(!validationCode.equalsIgnoreCase(user.getValidationCode()))rn if(validationCode != null)rn this.addActionError("验证码输入<em>错误</em>!");rn return INPUT;rn rn rn rn if(!userDAO.validateUser(user))rn this.addActionError("用户名或密码<em>错误</em>!");rn return INPUT;rn rn rnrn HttpSession session = request.getSession();rn session.setAttribute("username", user.getUsername());rn session.setMaxInactiveInterval(60 * 60 * 3);rn return SUCCESS;rn rnrnrnuser.getUsername()可以得到值。rn到底是哪出错了,求解……
使用Enterprise Library DAAB时出现错误
<em>错误</em> 1 类型“Microsoft.Practices.EnterpriseLibrary.Common.Instrumentation.IInstrumentationEventProvider”在未被引用的程序集中定义。必须添加对程序集“Microsoft.Practices.EnterpriseLibrary.Common, Version=4.0.0.0, Culture=neutral, PublicKeyToken=31bf3856ad364e35”的引用。 C:\Users\hp\Desktop\TestEnterpriseLibrary\TestEnterpriseLibrary\Default.aspx.cs 23 13 TestEnterpriseLibraryrnrn请问是什么原因呢?!
使用unset()时出现错误怎么解决
[code=PHP]rn", $user);rn rn unset($user);rn printf("Username now set to: %s ", $user);rn?>rn[/code]rnrn为什么unset()时显示Notice: Undefined variable: user in D:\Apache Group\Apache2\htdocs\PHPProject\index3.php on line 30:rnrnrn发现关于session的函数多少都会有些<em>错误</em>提示的。。。
使用LinkButton时,出现JS错误
点击LinkButton时,<em>出现</em>js<em>错误</em>,对象不存在。rn调查后,发现是在自动生成的__doPostBack()函数里的theForm.__EVENTTARGET对象不存在。rn求帮助,这个该怎样去掉。rnWin7环境,VS2005,WebApplication。
PB使用ACCESS时出现错误,请多多指教!
在PB环境中想浏览DATABASE或<em>使用</em>数据窗口时<em>出现</em>"程序类型越界"<em>错误</em>提示(98/2000/XP),但是插入删除是没问题的,SELECT不行,怎么解决?!请多多指教!
使用 T2OLE() 时出现错误,为何?
我用的是VC.NET 2003rnrnCString str;rn......rn......rnLPOLESTR ole=T2OLE(str); ///<-------这句rnrn<em>出现</em>以下<em>错误</em>,请问如何解决,先谢了!!!rnrn error C2065: “_lpa” : 未声明的标识符rn error C2065: “_convert” : 未声明的标识符rn error C2065: “_acp” : 未声明的标识符rn error C3861: “_lpa”: 即使<em>使用</em>参数相关的查找,也未找到标识符rn error C3861: “_convert”: 即使<em>使用</em>参数相关的查找,也未找到标识符rn error C3861: “_lpa”: 即使<em>使用</em>参数相关的查找,也未找到标识符rn error C3861: “_convert”: 即使<em>使用</em>参数相关的查找,也未找到标识符rnrn
上传时出现错误
FTP服务器上的文件或文件夹时发生<em>错误</em>。请检查是否有权限rnrnThe Process cannot access the file because it is being used by another processrnrnrn有进程一直占用着如何删除或修改Access啊rn
上传文件时出现错误
Warning: move_uploaded_file(D:/EOFFICE/webroot/register.inc) [function.move-uploaded-file]: failed to open stream: Permission denied in D:\eoffice\webroot\inc\reg_submit.php on line 57rnrnWarning: move_uploaded_file() [function.move-uploaded-file]: Unable to move 'D:\eoffice\tmp\phpD077.tmp' to 'D:/EOFFICE/webroot/register.inc' in D:\eoffice\webroot\inc\reg_submit.php on line 57[img=https://forum.csdn.net/PointForum/ui/scripts/csdn/Plugin/003/onion/3.gif][/img]
上传图片时出现错误
[code=csharp]public bool SaveFile(byte[] binData,string fileName)rnbool success=false; rnrnstring savePath=System.Configuration.ConfigurationSettings.AppSettings["UploadDirectory"];rnif(savePath==null) savePath="Photo";rnsavePath=Server.MapPath(savePath);rnif(!savePath.EndsWith("\\")) savePath += "\\";rnrnif(!Directory.Exists(savePath))rnthrow new Exception("服务器端没有找到有效的保存路径!");rnrnrnFileStream fileStream=null;rntryrnfileStream=new FileStream(savePath + fileName,FileMode.Create,FileAccess.Write);rn//write the filernfileStream.Write(binData,0,binData.Length);rnfileStream.Flush();//clear the buffer,write the data to the hard diskrnsuccess=true;rncatch(Exception ex)rnthrow new Exception(ex.Message); rnfinallyrnfileStream.Close();rnrnreturn success;rnrn rn[/code]rnrn这个是我写的保存图片的代码,但是上传的时候说找不到此路径,为什么啊?
提交时出现错误!
rnrn rn当提交时,document.frmProfile.PName.value.length有<em>错误</em>提示,没有找到对象,这是怎么回事?
项目发布时出现错误~~
如何解决这<em>错误</em>??rnrn严重: Servlet /niubi threw load() exceptionrnjava.lang.ClassFormatError: Invalid pc in LineNumberTable in class file org/apache/commons/digester/Digesterrn at java.lang.ClassLoader.defineClass1(Native Method)rn at java.lang.ClassLoader.defineClass(Unknown Source)rn at java.security.SecureClassLoader.defineClass(Unknown Source)rn at org.apache.catalina.loader.WebappClassLoader.findClassInternal(WebappClassLoader.java:1815)rn at org.apache.catalina.loader.WebappClassLoader.findClass(WebappClassLoader.java:872)rn at org.apache.catalina.loader.WebappClassLoader.loadClass(WebappClassLoader.java:1325)rn at org.apache.catalina.loader.WebappClassLoader.loadClass(WebappClassLoader.java:1204)rn at java.lang.ClassLoader.loadClassInternal(Unknown Source)rn at java.lang.Class.getDeclaredFields0(Native Method)rn at java.lang.Class.privateGetDeclaredFields(Unknown Source)rn at java.lang.Class.getDeclaredFields(Unknown Source)rn at org.apache.catalina.util.DefaultAnnotationProcessor.processAnnotations(DefaultAnnotationProcessor.java:131)rn at org.apache.catalina.core.StandardWrapper.loadServlet(StandardWrapper.java:1108)rn at org.apache.catalina.core.StandardWrapper.load(StandardWrapper.java:981)rn at org.apache.catalina.core.StandardContext.loadOnStartup(StandardContext.java:4044)rn at org.apache.catalina.core.StandardContext.start(StandardContext.java:4350)rn at org.apache.catalina.startup.HostConfig.checkResources(HostConfig.java:1105)rn at org.apache.catalina.startup.HostConfig.check(HostConfig.java:1203)rn at org.apache.catalina.startup.HostConfig.lifecycleEvent(HostConfig.java:293)rn at org.apache.catalina.util.LifecycleSupport.fireLifecycleEvent(LifecycleSupport.java:120)rn at org.apache.catalina.core.ContainerBase.backgroundProcess(ContainerBase.java:1307)rn at org.apache.catalina.core.ContainerBase$ContainerBackgroundProcessor.processChildren(ContainerBase.java:1571)rn at org.apache.catalina.core.ContainerBase$ContainerBackgroundProcessor.processChildren(ContainerBase.java:1580)rn at org.apache.catalina.core.ContainerBase$ContainerBackgroundProcessor.run(ContainerBase.java:1560)rn at java.lang.Thread.run(Unknown Source)rn
提交数据时出现错误
我在向数据库添加数据的时候<em>出现</em>了“Grid index out of range!”的<em>错误</em>rn我在第一次添加数据的时候正常,但添加第二个数据的时候就<em>出现</em>这样的<em>错误</em>!rn我想问一下是什么原因,如何解决?
附加数据库时出现错误
use masterrngorn rnrnEXEC sp_attach_db 'AdventureWorks', rn 'e:\database\AdventureWorks_data.mdf', rn 'e:\database\AdventureWorks_Log.ldf' rn运行后提示为:rnMsg 1813, Level 16, State 2, Line 1rn未能打开新数据库 'AdventureWorks'。CREATE DATABASE 将终止。rnMsg 602, Level 21, State 50, Line 1rn未能在 sysindexes 中找到数据库 ID 14 中对象 ID 1 的索引 ID 1 对应的行。请对 sysindexes 运行 DBCC CHECKTABLE。rnMsg 602, Level 21, State 50, Line 1rnCould not find row in sysindexes for database ID 14, object ID 1, index ID 1. Run DBCC CHECKTABLE on sysindexes.rn望高手们能告诉我怎么解决这个问题。谢谢。rn
调试时出现错误!!!
我在调试程序时<em>出现</em>如下<em>错误</em>:rnrnrn “试图运行项目时出错,无法在WEB服务器上启动调试,您不具备调试此应用程序的权限,此项目URL位于INTERNET区域。”rnrnrn这是怎么回事?》rn
连接数据库时出现错误
TDatabase和TQuery连接数据库时<em>出现</em>下面的<em>错误</em>提示rnrnColumn unknownrnZJRQrnClient SQL dialect 1 does not support reference to DATE datatypernrn我本身的数据库是INTERBASE的SQL dialect 是3rn请问应该怎样设置TDatabase和TQuery
插入数据时出现错误??
strsql4:= 'INSERT INTO tb_dovou'||voucher_name||' rn(fd_dovou_dealnum , fd_dovou_deptid ,fd_dovou_memo)rnvaluesrn( '||dealnum||' ,'||dept_login||' ,'||memos||')';rnexecute immediate strsql4;rn执行的时候会出错rnWarning: ociexecute(): OCIStmtExecute: ORA-00984: 列在此处不允许 ORA-06512: 在"TEST.PRO_PZ_ADD", line 34 ORA-06512: 在line 1 in C:\Program Files\Apache Group\Apache2\htdocs\banking\ck\pz_add.php on line 37rnrn但是我将'||memos||'改为随便插入一个字符窜“sdfsd”就不会出错,memos是一个输入参数,我确认过它是有值的rn
使用RandomAccessFile类时出现了“java.io.EOFException”错误
下面这段代码: package test; import java.io.File; import java.io.FileNotFoundException; import java.io.IOException; import java.io.RandomAccessFile; public class TestRandomAccessFile { String pathOfFile=
opencv2411使用接口时出现的几个错误
前提是配置好了环境变量,且在属性编辑器中添加了include,lib等 1、error C2039: 'SurfFeatureDetector' : is not a member of 'cv'      经查发现,SurfFeatureDetector在nonfree中的features2d.hpp中,在源文件中添加#include 2、error C2039: 'SurfDescri
使用eclpise创建maven时出现错误
在创建根据https://blog.csdn.net/qjyong/article/details/9098213这位博主的指导,创建maven项目时<em>出现</em>了Unable to create project from archetype [org.apache.maven.archetypes:maven-archetype-quickstart:1.1这个<em>错误</em>。 我尝试了http://blog.c...
python 使用Join时出现错误
<em>使用</em>Join时<em>出现</em><em>错误</em> TypeError: sequence item 1: expected str instance, int found 原因是:应该将list转为string 即<em>使用</em>str() result3 = join(str(['',1,3,4]))
使用in.readObject()时出现如下错误:java.io.OptionalDataException
在<em>使用</em>in.readObject()时<em>出现</em>如下<em>错误</em>:java.io.OptionalDataException rnrnmsdn中有如下帮助,但是我不理解其中的primitive data的意思,请帮我解释一下,谢谢!rnrnUnexpected data appeared in an ObjectInputStream trying to read an Object. This exception occurs when the stream contains primitive data instead of the object expected by readObject. The eof flag in the exception is true to indicate that no more primitive data is available. The count field contains the number of bytes available to read. rn
错误"?">使用treeview控件时出现"分析器错误"?
“/”应用程序中的服务器<em>错误</em>。rn--------------------------------------------------rnrn分析器<em>错误</em> rn说明: 在分析向此请求提供服务所需资源时出错。请检查下列特定分析<em>错误</em>详细信息并适当地修改源文件。 rnrn分析器<em>错误</em>信息: 找不到文件或程序集名称“Microsoft.Web.UI.WebControls”,或找不到它的一个依赖项。rnrn源<em>错误</em>: rnrn行 1: rn行 2: rn行 3: rnrn源文件: c:\inetpub\wwwroot\leftmenu.aspx 行: 1 rnrn程序集加载跟踪: 下列信息有助于确定程序集“Microsoft.Web.UI.WebControls”无法加载的原因。rnrn但是我已安装了webcontrols而且我在vs.net工具栏里面已经加入了treeview,把它拖到aspx文件,再用ie浏览时就出上面的<em>错误</em>。求帮忙。
使用openssl时出现结构体未定义错误
在添加 openssl engine公钥方法时,<em>出现</em>结构体未定义<em>错误</em>,本来ossl_typ.h中命名声明了了各种结构体类型,但在<em>使用</em>时确报错说未定义,仔细一看,要<em>使用</em>的类型EVP_PKEY_CTX是存在的,但发现结构体部分为黑色, typedef struct evp_pkey_ctx_st EVP_PKEY_CTX; 也就是说该文件没有看到struct evp_pkey_ctx_st的定义,但仔...
使用vim编辑时出现错误 E484
1、卸载Vim GVIM sudo apt-get remove --purge vim (–purge 是完全删除,会连配置文件一起删除) sudo apt-get remove --purge vim-gtk vim-doc cscope sudo apt-get clean 2、安装Vim GVIM sudo apt-get install vim sudo apt-get install ...
使用Mybatis时出现了一个错误
## 在<em>使用</em>Mybatis时<em>出现</em>了一个<em>错误</em> Error building SqlSession. The error may exist in com/imooc/conf/sqlxml/Message.xml The error occurred while processing mapper_resultMap[MessageResult] 当时我遇到的时候百思不得其解,完全看不懂当时出了什...
Android 使用ImageView控件时出现错误
08-10 10:08:42.701 21576-21612/com.example.uiwidgettest E/libEGL: load_driver(/system/lib/egl/libGLES_emulation.so): dlopen failed: library "/system/lib/egl/libGLES_emulation.so" not foundn 请问这是什么问题啊 我觉得好像是图片资源的问题,但是不知道该怎么解决
使用MyEclipse时出现了这样的错误……求教!
[url=http://hi.csdn.net/space-2709724-do-album-picid-541040.html][/url]rn这是<em>错误</em>截图rn请高手指教……
使用RasDial时出现632错误
我最近在写个拨号连接,用的是 RasSetEntryProperties成功的创建了拨号连接,但是我用RasDial时<em>出现</em>了632<em>错误</em>,不知道怎么解决,希望各路大侠帮帮忙!(windows下的)
求助:使用EJB-QL时出现weblogic.jdbc.rmi.SerialResultSet的错误
我用的ACCESS ODBC作为数据源,用EJB-QL作查询时<em>出现</em>一下<em>错误</em>:rnjavax.ejb.FinderException: Exception in 'findAvilableCxsdms' rnwhile using result set: 'weblogic.jdbc.rmi.SerialResultSet@78b3c1'rnjava.sql.SQLException: No data foundrnjava.sql.SQLException: No data foundrn at sun.jdbc.odbc.JdbcOdbc.standardError(JdbcOdbc.java:6212)rn at sun.jdbc.odbc.JdbcOdbc.SQLGetDataString(JdbcOdbc.java:3266)rn at sun.jdbc.odbc.JdbcOdbcResultSet.getDataString(JdbcOdbcResultSet.java:5398)rn......rnrnjbuilder中ejbmodule部署到weblogic7.0时是正常的,我的EJB-QL语句如下:rnSELECT OBJECT(c) FROM Cxsdm AS c WHERE c.gzdm = ?1 rnrn我的调用代码如下:rnpublic java.lang.String helloWorld(String p) rn CxsdmHome home =null;rn String ret = "";rn tryrn rn Context ctx = getInitialContext();rnrn home = (CxsdmHome) ctx.lookup("java:comp/env/ejb/CxsdmRef");rn rn //我想返回查询结果的记录条数rn ret = "for gzdm="+p+", Collection size="+new Integer(home.findAvilableCxsdms(p).size()).toString();rn rn catch(Exception ex)rn rn ex.printStackTrace();rn rn return ret;rn rnrn看到以前的帖子中提到过修改weblogic-ejb-jar.xml中关于元素finders-load-bean的值。把这个值改为false就可以了。rn我尝试这么作,但是每次我将该元素加到weblogic-ejb-jar.xml后,只要通过jbuilder编译,这个刚加入的元素就会立即rn被删除掉,而且这个文件好像根本没有办法去修改,请问这是为什么。非常感谢!
使用双缓冲绘图时出现错误!
按:http://community.csdn.net/Expert/topic/3119/3119399.xml?temp=.4067957rn<em>使用</em>了双缓冲,但是不知道为什么我的代码<em>出现</em>如下<em>错误</em>:rn=======================================================rn应用程序发生异常 unknown software exception(0x80000003),位置0x77f813b1.rn========================================================rn源代码如下:rn/////////////////////////////////////////////////////////////////////////////rn// CFootBallGMView drawingrnrnvoid CFootBallGMView::OnDraw(CDC* pDC)rnrn CFootBallGMDoc* pDoc = GetDocument();rn ASSERT_VALID(pDoc);rnrn CDC MemDC;rn CBitmap MemBitmap;rn //CRectangle rect;rn CRect rc;rn GetClientRect( rc );rnrn int nWidth, nHeight; // 取用户区大小rn nWidth = rc.Width();rn nHeight = rc.Height();rnrnrn MemDC.CreateCompatibleDC( NULL );rn MemBitmap.CreateCompatibleBitmap( pDC, nWidth, nHeight );rn CBitmap *pOldBit = MemDC.SelectObject( &MemBitmap );rn MemDC.FillSolidRect( 0, 0, nWidth, nHeight, RGB(255, 255, 255) );rnrn POINT point;rn POINT lpoint;rn point.x = 100;rn point.y = 100;rn lpoint.x = 200;rn lpoint.y = 200;rnrn while(1)rn rn Invalidate();rn MemDC.MoveTo( point );rn MemDC.LineTo( lpoint );rnrn pDC->BitBlt(0,0,nWidth,nHeight,&MemDC,0,0,SRCCOPY);rn MemBitmap.DeleteObject();rn MemDC.DeleteDC();rn rn
aspnet_regiis时出现错误
运行aspnet_regiis.exe -irn显示rnSetup has detected some errors during the operation.For details,plplease read th e setup log file C:\DOCUME~1\ah\LOCALS~1\Temp\ASPNETSetup_00001.log ...rnrn请问这是怎么回事?以前从来没遇到过。都是一次成功的。
QMAKE时出现错误
gmake[1]: *** [../../lib/libQtCore.so.4.7.0] Error 1rngmake[1]: Leaving directory `/home/geoway/qtsdk-2010.05/qt/src/corelib'rngmake: *** [sub-corelib-make_default-ordered] Error 2rnrn这个问题 如何解决
上传时,出现错误
[code=Assembly]rnexception rnrnjavax.servlet.ServletException: There is no statement named createFile in this SqlMap.rn org.apache.struts2.dispatcher.Dispatcher.serviceAction(Dispatcher.java:515)rn org.apache.struts2.dispatcher.FilterDispatcher.doFilter(FilterDispatcher.java:419)rn org.apache.struts2.dispatcher.ActionContextCleanUp.doFilter(ActionContextCleanUp.java:99)rnrnrnroot cause rnrncom.ibatis.sqlmap.client.SqlMapException: There is no statement named createFile in this SqlMap.rn com.ibatis.sqlmap.engine.impl.SqlMapExecutorDelegate.getMappedStatement(SqlMapExecutorDelegate.java:293)rn com.ibatis.sqlmap.engine.impl.SqlMapExecutorDelegate.update(SqlMapExecutorDelegate.java:496)rn com.ibatis.sqlmap.engine.impl.SqlMapSessionImpl.update(SqlMapSessionImpl.java:90)rn org.springframework.orm.ibatis.SqlMapClientTemplate$10.doInSqlMapClient(SqlMapClientTemplate.java:383)rn org.springframework.orm.ibatis.SqlMapClientTemplate.execute(SqlMapClientTemplate.java:193)rn org.springframework.orm.ibatis.SqlMapClientTemplate.update(SqlMapClientTemplate.java:381)rn com.daewoobrenic.jcf.dao.BaseSqlMapClientDAO.executeUpdate(BaseSqlMapClientDAO.java:119)rn com.daewoobrenic.jcf.file.dao.FileDAOiBatis.createFile(FileDAOiBatis.java:24)rn client.service.ClientService.addClient(ClientService.java:20)rn client.action.ClientAction.addClient(ClientAction.java:25)rn sun.reflect.NativeMethodAccessorImpl.invoke0(Native Method)rn sun.reflect.NativeMethodAccessorImpl.invoke(NativeMethodAccessorImpl.java:39)rn sun.reflect.DelegatingMethodAccessorImpl.invoke(DelegatingMethodAccessorImpl.java:25)rn java.lang.reflect.Method.invoke(Method.java:597)rn com.opensymphony.xwork2.DefaultActionInvocation.invokeAction(DefaultActionInvocation.java:404)rn[/code]rnrn其实<em>出现</em>这个错的代码是在这rn[code=Java]fileDao.createFile(fileInfo);[/code]rn可是这个代码fileDao这个类,我只能看见class文件,class文件的内容是下面这些rnrn能看见的也就是这些 rn// Compiled from IFileDAO.java (version 1.5 : 49.0, no super bit) rnpublic abstract interface com.daewoobrenic.jcf.file.dao.IFileDAO rn rn // Method descriptor #6 (Lcom/daewoobrenic/jcf/file/FileInfo;)I rn public abstract int createFile(com.daewoobrenic.jcf.file.FileInfo arg0); rn rn // Method descriptor #6 (Lcom/daewoobrenic/jcf/file/FileInfo;)I rn public abstract int deleteFile(com.daewoobrenic.jcf.file.FileInfo arg0); rn rn // Method descriptor #9 (Ljava/lang/String;)I rn public abstract int deleteFileById(java.lang.String arg0); rn rn // Method descriptor #11 (Ljava/lang/String;)Ljava/util/List; rn public abstract java.util.List findFilesById(java.lang.String arg0); rn rnrnstrits2+ibatis+spring的一个框架 rnrn不知道怎么解决,,,,不知道问题是什么地方啊
调试时出现错误
.net 调试时<em>出现</em><em>错误</em>如下:rn 无法在web服务器上启动调试。发送调试http请求时发生服务器端<em>错误</em>。rn确保服务器操作正确。rn然后我通过执行 “调试” ->“开始执行(不调试)”验证web.config<em>出现</em>如下rn提示:“/lf2004”应用程序中的服务器<em>错误</em> C:\INETPUB\WWWROOT\LF2004目录的访问被拒绝。未能开始监视目录更改。rn 我在启动时发现“asp.net state server”<em>出现</em>了<em>错误</em>:2147942402:系统找不到指定的文件,我想是不是这个原因造成了不能调试?如果是该如何解决?
查询时出现错误
Spring+Hibernate+Struts在进行数据查找时<em>出现</em>的<em>错误</em>rnrnorg.springframework.beans.PropertyAccessExceptionsException: PropertyAccessExceptionsExceptionrn(1 errors); nested propertyAccessExceptions are: [org.springframework.beans.TypeMismatchException:rnFailed to convert property value of type [$Proxy1] to required type [com.boyasi.service.MovieMonthService]rnfor property 'movieMonthService']rn at org.springframework.beans.BeanWrapperImpl.setPropertyValues(BeanWrapperImpl.java:670)rn at org.springframework.beans.BeanWrapperImpl.setPropertyValues(BeanWrapperImpl.java:642)rn at org.springframework.beans.factory.support.AbstractAutowireCapableBeanFactory.applyPropertyValues(AbstractAutowireCapableBeanFactory.java:1023)rn at org.springframework.beans.factory.support.AbstractAutowireCapableBeanFactory.populateBean(AbstractAutowireCapableBeanFactory.java:824)rn at org.springframework.beans.factory.support.AbstractAutowireCapableBeanFactory.createBean(AbstractAutowireCapableBeanFactory.java:345)rn at org.springframework.beans.factory.support.AbstractBeanFactory.getBean(AbstractBeanFactory.java:239)rn at org.springframework.beans.factory.support.AbstractBeanFactory.getBean(AbstractBeanFactory.java:151)rn at org.springframework.context.support.AbstractApplicationContext.getBean(AbstractApplicationContext.java:559)rn at org.springframework.web.struts.DelegatingActionProxy.getDelegateAction(DelegatingActionProxy.java:122)rn at org.springframework.web.struts.DelegatingActionProxy.execute(DelegatingActionProxy.java:105)rn at org.apache.struts.action.RequestProcessor.processActionPerform(RequestProcessor.java:484)rn at org.apache.struts.action.RequestProcessor.process(RequestProcessor.java:274)rn at org.apache.struts.action.ActionServlet.process(ActionServlet.java:1482)rn at org.apache.struts.action.ActionServlet.doPost(ActionServlet.java:525)rn at javax.servlet.http.HttpServlet.service(HttpServlet.java:154)rn at javax.servlet.http.HttpServlet.service(HttpServlet.java:92)rn at com.caucho.server.dispatch.ServletFilterChain.doFilter(ServletFilterChain.java:99)rn at org.springframework.orm.hibernate3.support.OpenSessionInViewFilter.doFilterInternal(OpenSessionInViewFilter.java:174)rn at org.springframework.web.filter.OncePerRequestFilter.doFilter(OncePerRequestFilter.java:76)rn at com.caucho.server.dispatch.FilterFilterChain.doFilter(FilterFilterChain.java:70)rn at org.springframework.web.filter.CharacterEncodingFilter.doFilterInternal(CharacterEncodingFilter.java:75)rn at org.springframework.web.filter.OncePerRequestFilter.doFilter(OncePerRequestFilter.java:76)rn at com.caucho.server.dispatch.FilterFilterChain.doFilter(FilterFilterChain.java:70)rn at com.caucho.server.webapp.WebAppFilterChain.doFilter(WebAppFilterChain.java:163)rn at com.caucho.server.dispatch.ServletInvocation.service(ServletInvocation.java:208)rn at com.caucho.server.http.HttpRequest.handleRequest(HttpRequest.java:259)rn at com.caucho.server.port.TcpConnection.run(TcpConnection.java:363)rn at com.caucho.util.ThreadPool.runTasks(ThreadPool.java:490)rn at com.caucho.util.ThreadPool.run(ThreadPool.java:423)rn at java.lang.Thread.run(Thread.java:595)rnrnrnMovieMonthServiceImp.javarnrn public MovieMonth findMoveMonthByUserId(int userId) rn return this.getMovieMonthDAO().findMoveMonthByUserId(userId);rn rnrnMovieMonthHibernateDAO.javarnrn private static final String LOAD_BY_USERID ="from movie_Month where userID = ?";rn /**rn * 默认构造函数rn */rn public MovieMonthHibernateDAO()rn super();rn rn /**rn * 根据UserId查找MoveMonth对象rn * @param userIdrn * @return MovieMonthrn */rn public MovieMonth findMoveMonthByUserId(int userId) rn Object[] o = new Integer(userId);rn List l = this.getHibernateTemplate().find(LOAD_BY_USERID,o);rn if(l == null || l.isEmpty())rn return null;rn elsern return (MovieMonth) l.get(0);rn rn
使用Hibernate和Struts2时出现错误
在调用save方法存储数据时<em>出现</em><em>错误</em>rn调试后发现是HibernateUtil的openSession和getCurrentSession方法的<em>错误</em>...rn大哥们可以指教一下吗rn[img=https://img-bbs.csdn.net/upload/201804/10/1523352721_502143.png][/img]rnrn[img=https://img-bbs.csdn.net/upload/201804/10/1523352374_284653.png][/img]rnrn异常:rnognl.MethodFailedException: Method "add" failed for object web.action.artAction@6633c36d [java.lang.NoClassDefFoundError: Could not initialize class Util.HibernateUtil]rnrn[img=https://img-bbs.csdn.net/upload/201804/10/1523352315_495371.png][/img]rnrn
使用gdate包时出现错误
rn小弟才自学的Java,第一次发帖。想在JSP上完成Google联系人导出功能,遇到如下异常,求教各位了rnrnexception rnrnorg.apache.jasper.JasperException: Could not initialize class com.google.gdata.client.contacts.ContactsServicern org.apache.jasper.servlet.JspServletWrapper.handleJspException(JspServletWrapper.java:460)rn org.apache.jasper.servlet.JspServletWrapper.service(JspServletWrapper.java:355)rn org.apache.jasper.servlet.JspServlet.serviceJspFile(JspServlet.java:329)rn org.apache.jasper.servlet.JspServlet.service(JspServlet.java:265)rn javax.servlet.http.HttpServlet.service(HttpServlet.java:729)rnrnrnroot cause rnrnjavax.servlet.ServletException: Could not initialize class com.google.gdata.client.contacts.ContactsServicern org.apache.jasper.runtime.PageContextImpl.doHandlePageException(PageContextImpl.java:841)rn org.apache.jasper.runtime.PageContextImpl.handlePageException(PageContextImpl.java:774)rn org.apache.jsp.index_jsp._jspService(index_jsp.java:116)rn org.apache.jasper.runtime.HttpJspBase.service(HttpJspBase.java:98)rn javax.servlet.http.HttpServlet.service(HttpServlet.java:729)rn org.apache.jasper.servlet.JspServletWrapper.service(JspServletWrapper.java:331)rn org.apache.jasper.servlet.JspServlet.serviceJspFile(JspServlet.java:329)rn org.apache.jasper.servlet.JspServlet.service(JspServlet.java:265)rn javax.servlet.http.HttpServlet.service(HttpServlet.java:729)rnrnroot cause rnrnjava.lang.NoClassDefFoundError: Could not initialize class com.google.gdata.client.contacts.ContactsServicern googleFriend.GoogleImporter.getContacts(GoogleImporter.java:44)rn googleFriend.GoogleImporter.getGoogleFriend(GoogleImporter.java:87)rn org.apache.jsp.index_jsp._jspService(index_jsp.java:67)rn org.apache.jasper.runtime.HttpJspBase.service(HttpJspBase.java:98)rn javax.servlet.http.HttpServlet.service(HttpServlet.java:729)rn org.apache.jasper.servlet.JspServletWrapper.service(JspServletWrapper.java:331)rn org.apache.jasper.servlet.JspServlet.serviceJspFile(JspServlet.java:329)rn org.apache.jasper.servlet.JspServlet.service(JspServlet.java:265)rn javax.servlet.http.HttpServlet.service(HttpServlet.java:729)rnrnrnnote The full stack trace of the root cause is available in the Apache Tomcat/5.5.28 logs.rnrn
使用oracle数据库连接时出现错误,求解~
我打算<em>使用</em>VC6+SQLAPI++连接oracle数据库。我刚装了一个oracle instant client。程序运行时捕捉到这样的<em>错误</em>信息。 rnrnrnDBMS API Library 'ociw32.dll' loading fails rnThis library is a part of DBMS client installation, not SQLAPI++ rnMake sure DBMS client is installed and rnthis required library is available for dynamic loading rnrnWin32: rn1) The directory from which the application loaded rn2) The current directory rn3) The Windows, Windows system or 32-bit Windows system directory rn4) The directories in the PATH environment variable rnrn请问会是什么原因呢?应该怎么解决?谢谢。
使用javamail发送邮件时出现错误?(急)
<em>错误</em>信息如下:rnrnjava.lang.SecurityException: invalid SHA1 signature file digest for javax/mail/internet/ContentDisposition.classrn at sun.security.util.SignatureFileVerifier.verifySection(Unknown Source)rn at sun.security.util.SignatureFileVerifier.processImpl(Unknown Source)rn at sun.security.util.SignatureFileVerifier.process(Unknown Source)rn at java.util.jar.JarVerifier.processEntry(Unknown Source)rnrn这里什么原因?
linux F7 使用pppoe-start时出现错误
这几天新装了个linux f7,一切顺利,不过我在用pppoe上网时,遇到问题!rn把rp-pppoe安装好以后,输入pppoe-start是<em>出现</em>下面这些看不懂的东西:rn/sbin/pppoe-start: line 217: 6968 Terminated $CONNECT "$@" > /dev/null 2>&1rn似乎是什么设备为空??e文不是很好,请问这个到底是什么问题?rn补充:后来我用图形化的网络设置与配置向导也做了一次,还是<em>出现</em>这个问题。新手ing!rnrn
使用Iterator时出现的一个错误
[code=Java]rnrnpackage TestIterator;rnrnimport java.util.*;rnrnrnpublic class TestIterator rnrn public static void main(String[] args) rn Collection c = new HashSet();rn c.add(new Name("f1", "L1"));rn c.add(new Name("f3", "L3"));rn c.add(new Name("f2", "L2"));rn c.add(new Name("f4", "L4"));rn c.add(new Name("f41111111111111", "L5"));rn c.add("Hello");rnrnrn Iterator i = c.iterator();rn rn while (i.hasNext()) rn Name n = (Name) i.next();rn if(n.getFirstName().length()>3)rn i.remove();rn rn rnrn System.out.println(n.getFirstName() + " " + n.getLastName());rn rnrn rn rnrnrnrnclass Name rn public String getFirstName() rn return FirstName;rn rnrn public String getLastName() rn return LastName;rn rnrn public Name(String FirstName, String LastName) rn this.FirstName = FirstName;rn this.LastName = LastName;rn rnrn @Overridern public int hashCode() rn final int prime = 31;rn int result = 1;rn result = prime * resultrn + ((FirstName == null) ? 0 : FirstName.hashCode());rn result = prime * resultrn + ((LastName == null) ? 0 : LastName.hashCode());rn return result;rn rnrn @Overridern public boolean equals(Object obj) rn if (this == obj)rn return true;rn if (obj == null)rn return false;rn if (getClass() != obj.getClass())rn return false;rn Name other = (Name) obj;rn if (FirstName == null) rn if (other.FirstName != null)rn return false;rn else if (!FirstName.equals(other.FirstName))rn return false;rn if (LastName == null) rn if (other.LastName != null)rn return false;rn else if (!LastName.equals(other.LastName))rn return false;rn return true;rn rnrn public String toString() rn return FirstName + " " + LastName;rnrn rnrn private String FirstName, LastName;rnrn[/code]rnrn运行结果为:rnf3 L3rnf2 L2rnException in thread "main" java.lang.ClassCastException: java.lang.Stringrn at TestIterator.TestIterator.main(TestIterator.java:32)rnrn我没用那个泛型。不过我觉得这样也可以吧,这个<em>错误</em>时为什么呢?谢谢回答!
使用 嵌套Repeater时, Relations.Add出现错误.
http://support.microsoft.com/kb/326338/EN-US/rn这是MS的例子, 我已经试过了, 没问题.rn我的情况差不多, 想试验一下这种方式.rn换成我自己的表时, <em>出现</em>如下<em>错误</em>:rnThis constraint cannot be enabled as not all values have corresponding parent values. rnrnSource Error: rnrnLine 30: Dim cmd2 As SqlDataAdapter = New SqlDataAdapter("select * from stumodules", cnn)rnLine 31: cmd2.Fill(ds, "stumodules")rnLine 32: ds.Relations.Add("myrelation", _rnLine 33: ds.Tables("STUaddress").Columns("adm_no"), _rnLine 34: ds.Tables("stumodules").Columns("STUDENTID"))rnrn表: STUaddress中的adm_no(唯一) -> 表: stumodules中的STUDENTID(不唯一)rnrn求原因及解决方式.rnrn我还是初学, 希望大家指点一下, 谢谢!:)rnrn rn
求助:使用多个站点地图时出现错误
配置<em>错误</em> rn说明: 在处理向该请求提供服务所需的配置文件时出错。请检查下面的特定<em>错误</em>详细信息并适当地修改配置文件。 rnrn[color=#0000FF]分析器<em>错误</em>信息: 未能加载类型“Systey.Web.XmlSiteMapProvider”。[/color]rnrn源<em>错误</em>: rnrnrn行 46: rn行 47: rn[color=#FF0000]行 48: [/color]行 49: rn行 50: rn rn我的站点地图都在应用程序根目录,每次都<em>出现</em>未能加载类型的<em>错误</em>,求各位帮忙
activiti在使用oracle数据库时出现建表错误
activiti在<em>使用</em>oracle数据库时<em>出现</em>建表<em>错误</em> <em>错误</em><em>出现</em>环境 在activiti中配置了oracle作为数据源,刚开始的时候没有在ProcessEngineConfiguration或SpringProcessEngineConfiguration中配置DatabaseSchema属性,导致创建数据库出错(该<em>错误</em>在mysql中没有<em>出现</em>),后来参考网上的方法添加了该属性,具体原因请点击这里
使用SMTP发信时出现以下错误
我在测试往我的hotmail.com的信箱发信时<em>出现</em>以下<em>错误</em>(asp.net,用IIS自带的stmp服务器)rn:rnrn由于原因 An internal DNS error caused a failure to find the remote server.rn,向远程域 'hotmail.com' 传递邮件失败。 rnrn不知道该如何解决,谢谢!rn我发往21cn等信箱也是<em>出现</em>这样的<em>错误</em>...
使用rs.next()时jsp页面会出现错误
ResultSet answerrs = answer.answer_all(question_id);rnif(answerrs!=null)rn while(answerrs.next())rn Date currentTime = answerrs.getDate("Restore_date");//处理时间rnrnrnjsp<em>出现</em>如下<em>错误</em>,还请高手指点:rnHTTP Status 500 - rnrn--------------------------------------------------------------------------------rnrntype Exception reportrnrnmessage rnrndescription The server encountered an internal error () that prevented it from fulfilling this request.rnrnexception rnrnjavax.servlet.ServletException: ??? Resultset: nextrn org.apache.jasper.runtime.PageContextImpl.doHandlePageException(PageContextImpl.java:867)rn org.apache.jasper.runtime.PageContextImpl.handlePageException(PageContextImpl.java:800)rn org.apache.jsp.answer_005fquestion_jsp._jspService(answer_005fquestion_jsp.java:143)rn org.apache.jasper.runtime.HttpJspBase.service(HttpJspBase.java:133)rn javax.servlet.http.HttpServlet.service(HttpServlet.java:856)rn org.apache.jasper.servlet.JspServletWrapper.service(JspServletWrapper.java:311)rn org.apache.jasper.servlet.JspServlet.serviceJspFile(JspServlet.java:301)rn org.apache.jasper.servlet.JspServlet.service(JspServlet.java:248)rn javax.servlet.http.HttpServlet.service(HttpServlet.java:856)rnrnrnroot cause rnrnjava.sql.SQLException: ??? Resultset: nextrn oracle.jdbc.dbaccess.DBError.throwSqlException(DBError.java:134)rn oracle.jdbc.dbaccess.DBError.throwSqlException(DBError.java:179)rn oracle.jdbc.dbaccess.DBError.check_error(DBError.java:1130)rn oracle.jdbc.driver.OracleResultSetImpl.next(OracleResultSetImpl.java:196)rn org.apache.commons.dbcp.DelegatingResultSet.next(DelegatingResultSet.java:196)rn org.apache.jsp.answer_005fquestion_jsp._jspService(answer_005fquestion_jsp.java:115)rn org.apache.jasper.runtime.HttpJspBase.service(HttpJspBase.java:133)rn javax.servlet.http.HttpServlet.service(HttpServlet.java:856)rn org.apache.jasper.servlet.JspServletWrapper.service(JspServletWrapper.java:311)rn org.apache.jasper.servlet.JspServlet.serviceJspFile(JspServlet.java:301)rn org.apache.jasper.servlet.JspServlet.service(JspServlet.java:248)rn javax.servlet.http.HttpServlet.service(HttpServlet.java:856)rnrnrnnote The full stack trace of the root cause is available in the Tomcat logs.rnrnrn--------------------------------------------------------------------------------rnrnApache Tomcat/5.0.16
使用hibernate进行数据操作时出现错误
HTTP Status 500 - Position beyond number of declared ordinal parameters. Remember that ordinal parameters are 1-based! Position: 1; nested exception is org.hibernate.QueryParameterException: Position beyond number of declared ordinal parameters. Remember that ordinal parameters are 1-based! Position: 1rntype Exception reportrnrnmessage Position beyond number of declared ordinal parameters. Remember that ordinal parameters are 1-based! Position: 1; nested exception is org.hibernate.QueryParameterException: Position beyond number of declared ordinal parameters. Remember that ordinal parameters are 1-based! Position: 1rnrndescription The server encountered an internal error that prevented it from fulfilling this request.rnrnexceptionrnrnorg.springframework.orm.hibernate3.HibernateQueryException: Position beyond number of declared ordinal parameters. Remember that ordinal parameters are 1-based! Position: 1; nested exception is org.hibernate.QueryParameterException: Position beyond number of declared ordinal parameters. Remember that ordinal parameters are 1-based! Position: 1rn org.springframework.orm.hibernate3.SessionFactoryUtils.convertHibernateAccessException(SessionFactoryUtils.java:656)rn org.springframework.orm.hibernate3.HibernateAccessor.convertHibernateAccessException(HibernateAccessor.java:412)rn org.springframework.orm.hibernate3.HibernateTemplate.doExecute(HibernateTemplate.java:411)rn org.springframework.orm.hibernate3.HibernateTemplate.executeWithNativeSession(HibernateTemplate.java:374)rn org.springframework.orm.hibernate3.HibernateTemplate.find(HibernateTemplate.java:912)rn org.springframework.orm.hibernate3.HibernateTemplate.find(HibernateTemplate.java:908)rn com.itcast.shop.order.dao.OrderDao.findByCountUid(OrderDao.java:27)rn com.itcast.shop.order.service.OrderService.findByPageUid(OrderService.java:40)rn com.itcast.shop.order.service.OrderService$$FastClassByCGLIB$$620df4e1.invoke()rn org.springframework.cglib.proxy.MethodProxy.invoke(MethodProxy.java:204)rn org.springframework.aop.framework.CglibAopProxy$CglibMethodInvocation.invokeJoinpoint(CglibAopProxy.java:698)rn org.springframework.aop.framework.ReflectiveMethodInvocation.proceed(ReflectiveMethodInvocation.java:150)rn org.springframework.transaction.interceptor.TransactionInterceptor.invoke(TransactionInterceptor.java:110)rn org.springframework.aop.framework.ReflectiveMethodInvocation.proceed(ReflectiveMethodInvocation.java:172)rn org.springframework.aop.framework.CglibAopProxy$DynamicAdvisedInterceptor.intercept(CglibAopProxy.java:631)rn com.itcast.shop.order.service.OrderService$$EnhancerByCGLIB$$ea996e94.findByPageUid()rn com.itcast.shop.order.action.OrderAction.findByUid(OrderAction.java:99)rn sun.reflect.NativeMethodAccessorImpl.invoke0(Native Method)rn sun.reflect.NativeMethodAccessorImpl.invoke(NativeMethodAccessorImpl.java:57)rn sun.reflect.DelegatingMethodAccessorImpl.invoke(DelegatingMethodAccessorImpl.java:43)rn java.lang.reflect.Method.invoke(Method.java:601)rn com.opensymphony.xwork2.DefaultActionInvocation.invokeAction(DefaultActionInvocation.java:450)rn com.opensymphony.xwork2.DefaultActionInvocation.invokeActionOnly(DefaultActionInvocation.java:289)rn com.opensymphony.xwork2.DefaultActionInvocation.invoke(DefaultActionInvocation.java:252)rn org.apache.struts2.interceptor.debugging.DebuggingInterceptor.intercept(DebuggingInterceptor.java:256)rn com.opensymphony.xwork2.DefaultActionInvocation.invoke(DefaultActionInvocation.java:246)rn com.opensymphony.xwork2.interceptor.DefaultWorkflowInterceptor.doIntercept(DefaultWorkflowInterceptor.java:167)rn com.opensymphony.xwork2.interceptor.MethodFilterInterceptor.intercept(MethodFilterInterceptor.java:98)rn com.opensymphony.xwork2.DefaultActionInvocation.invoke(DefaultActionInvocation.java:246)rn com.opensymphony.xwork2.validator.ValidationInterceptor.doIntercept(ValidationInterceptor.java:265)rn org.apache.struts2.interceptor.validation.AnnotationValidationInterceptor.doIntercept(AnnotationValidationInterceptor.java:68)rn com.opensymphony.xwork2.interceptor.MethodFilterInterceptor.intercept(MethodFilterInterceptor.java:98)rn com.opensymphony.xwork2.DefaultActionInvocation.invoke(DefaultActionInvocation.java:246)rn com.opensymphony.xwork2.interceptor.ConversionErrorInterceptor.intercept(ConversionErrorInterceptor.java:138)rn com.opensymphony.xwork2.DefaultActionInvocation.invoke(DefaultActionInvocation.java:246)rn com.opensymphony.xwork2.interceptor.ParametersInterceptor.doIntercept(ParametersInterceptor.java:239)rn com.opensymphony.xwork2.interceptor.MethodFilterInterceptor.intercept(MethodFilterInterceptor.java:98)rn com.opensymphony.xwork2.DefaultActionInvocation.invoke(DefaultActionInvocation.java:246)rn com.opensymphony.xwork2.interceptor.ParametersInterceptor.doIntercept(ParametersInterceptor.java:239)rn com.opensymphony.xwork2.interceptor.MethodFilterInterceptor.intercept(MethodFilterInterceptor.java:98)rn com.opensymphony.xwork2.DefaultActionInvocation.invoke(DefaultActionInvocation.java:246)rn com.opensymphony.xwork2.interceptor.StaticParametersInterceptor.intercept(StaticParametersInterceptor.java:191)rn com.opensymphony.xwork2.DefaultActionInvocation.invoke(DefaultActionInvocation.java:246)rn org.apache.struts2.interceptor.MultiselectInterceptor.intercept(MultiselectInterceptor.java:73)rn com.opensymphony.xwork2.DefaultActionInvocation.invoke(DefaultActionInvocation.java:246)rn org.apache.struts2.interceptor.CheckboxInterceptor.intercept(CheckboxInterceptor.java:91)rn com.opensymphony.xwork2.DefaultActionInvocation.invoke(DefaultActionInvocation.java:246)rn org.apache.struts2.interceptor.FileUploadInterceptor.intercept(FileUploadInterceptor.java:252)rn com.opensymphony.xwork2.DefaultActionInvocation.invoke(DefaultActionInvocation.java:246)rn com.opensymphony.xwork2.interceptor.ModelDrivenInterceptor.intercept(ModelDrivenInterceptor.java:100)rn com.opensymphony.xwork2.DefaultActionInvocation.invoke(DefaultActionInvocation.java:246)rn com.opensymphony.xwork2.interceptor.ScopedModelDrivenInterceptor.intercept(ScopedModelDrivenInterceptor.java:141)rn com.opensymphony.xwork2.DefaultActionInvocation.invoke(DefaultActionInvocation.java:246)rn com.opensymphony.xwork2.interceptor.ChainingInterceptor.intercept(ChainingInterceptor.java:145)rn com.opensymphony.xwork2.DefaultActionInvocation.invoke(DefaultActionInvocation.java:246)rn com.opensymphony.xwork2.interceptor.PrepareInterceptor.doIntercept(PrepareInterceptor.java:171)rn com.opensymphony.xwork2.interceptor.MethodFilterInterceptor.intercept(MethodFilterInterceptor.java:98)rn com.opensymphony.xwork2.DefaultActionInvocation.invoke(DefaultActionInvocation.java:246)rn com.opensymphony.xwork2.interceptor.I18nInterceptor.intercept(I18nInterceptor.java:161)rn com.opensymphony.xwork2.DefaultActionInvocation.invoke(DefaultActionInvocation.java:246)rn org.apache.struts2.interceptor.ServletConfigInterceptor.intercept(ServletConfigInterceptor.java:164)rn com.opensymphony.xwork2.DefaultActionInvocation.invoke(DefaultActionInvocation.java:246)rn com.opensymphony.xwork2.interceptor.AliasInterceptor.intercept(AliasInterceptor.java:193)rn com.opensymphony.xwork2.DefaultActionInvocation.invoke(DefaultActionInvocation.java:246)rn com.opensymphony.xwork2.interceptor.ExceptionMappingInterceptor.intercept(ExceptionMappingInterceptor.java:189)rn com.opensymphony.xwork2.DefaultActionInvocation.invoke(DefaultActionInvocation.java:246)rn org.apache.struts2.impl.StrutsActionProxy.execute(StrutsActionProxy.java:54)rn org.apache.struts2.dispatcher.Dispatcher.serviceAction(Dispatcher.java:563)rn org.apache.struts2.dispatcher.ng.ExecuteOperations.executeAction(ExecuteOperations.java:77)rn org.apache.struts2.dispatcher.ng.filter.StrutsPrepareAndExecuteFilter.doFilter(StrutsPrepareAndExecuteFilter.java:99)rnrnrn
在恢复数据时出现错误~~~
rnrn 在企业管理器中:数据库:还原数据<em>出现</em>如下<em>错误</em>:(备份的数据库文件也是在企业管理器中备份的!)rnrn 当试图还原master数据库时,必须以单用户模式<em>使用</em>RESTORE DATABASE。rnRESTORE DATABASE操作异常终止。
g_conn.BeginTrans时出现错误
我在<em>使用</em>connection的事务时遇到一问题想请高手解答rn在模块中定义了一connectionrnpublic g_cnn as new adodb.connectionrnrn用g_conn.BeginTrans时<em>出现</em><em>错误</em>-2147467259 ODBC 无法设置属性
远程连接时出现错误
两台电脑都是ghost装的xp系统。点击“开始”-“程序”-“附件”-“通信”-“远程桌面连接”时<em>出现</em>如图所示的<em>错误</em>,请问怎么解决?rn
安装时出现错误
1、无法装载与语言相关的资源文件rn2、search stp.exe应用程序初始化失败rnrnsql server2000标准版,win2000 serverrn
在线电影时出现错误
我在自己局域网上想看在线电影,结果<em>出现</em>一个脚本<em>错误</em>:"SplashWin"为空或不是对象.这是什么<em>错误</em>啊,该怎么操作,去纠正这个<em>错误</em>呢? 谢谢各位大哥大姐.
DataBind()时出现错误
DataBind()时总是说无法在选定数据源上未能找到名称为“Member”的字段或属性。rnsql语句为:select * from Member where Village like '%2%'rn在查询分析器中<em>使用</em>该语句能查出数据来,但是rnSqlDataAdapter sqlapt=new SqlDataAdapter(strSql,sqlcnt);rnDataSet dtst=new DataSet();rnsqlapt.Fill(dtst,strTable); rnthis.DataGrid1.DataSource=dtst.Tables["Member"].DefaultView;rnthis.DataGrid1.DataBind();//运行到这里就报告说,选定数据源上未能找到名称为“Member”的字段或属性。 rnrn请问怎么样才能把这个<em>错误</em>解决啊?着急中!!!!!!!!
release时出现错误
debug没问题,release时有以下<em>错误</em>和警告,最奇怪的是再编译还能通过,但程序执行会出错,<em>错误</em>中的dlg都是我程序中生成的对话框,在stdafx.h中包含了#include 和#include rn不知道为什么atof和strok还是不识别呢?rnLINK : warning LNK4049: locally defined symbol "_atoi" importedrnLINK : warning LNK4049: locally defined symbol "__mbscmp" importedrnLINK : warning LNK4049: locally defined symbol "_free" importedrnLINK : warning LNK4049: locally defined symbol "_strrchr" importedrnLINK : warning LNK4049: locally defined symbol "_malloc" importedrnLINK : warning LNK4049: locally defined symbol "_vsprintf" importedrnDataDlg.obj : error LNK2001: unresolved external symbol __imp__atofrnFORCEDLG.obj : error LNK2001: unresolved external symbol __imp__atofrnform.obj : error LNK2001: unresolved external symbol __imp__atofrnSTABDLG.obj : error LNK2001: unresolved external symbol __imp__atofrnFORCEDLG.obj : error LNK2001: unresolved external symbol __imp__strtokrnSTABDLG.obj : error LNK2001: unresolved external symbol __imp__strtok
数据库备份时出现错误
我用SQLDMO备份数据时出错rn提示如下rn[Microsoft][ODBC SQL Server Driver][DBNETLIB]SQL Server 不存在或访问被拒绝rn[Microsoft][ODBC SQL Server Driver][DBNETLIB]ConnectionOpen (Connect()). rnrn我的连接字符串如下server=localhost\sqlexpress;uid=best;pwd=123456;database=sqltest;rn单独连接数据库是没有问题的rn但在备份时就会<em>出现</em>上面的<em>错误</em>rnrn
使用gps_umd时出现错误的解决办法
问题截图 sudo apt-get install libgps-dev
使用django登陆mysql5.6时出现错误
如下 django.db.utils.OperationalError: (1045, &quot;Access denied for user 'root'@'localhost' (using password: NO)&quot;) 为什么会<em>出现</em>“using password: NO”呢?
安装 使用vue时出现错误
C:\Users\admin\AppData\Roaming\npm\node_modules\vue-cli\bin\vue-init:60let template = program.args[0]^^^SyntaxError: Block-scoped declarations (let, const, function, class) not yet supported outside s...
请教使用bcp时出现了下面错误
在查询分析器中<em>使用</em>命令xp_cmdshell 'bcp pubs.dbo.titles out d:\titles.txt -c -Srelax\abc -Usa -Psql'<em>出现</em>以下<em>错误</em>:rnoutput rn--------------------------------------------------------------------------------------------------------------------------------------------------------------------------------------------------------------------------------------------------------------- rnCTLIB Message: - L6/O8/S5/N3/5/0:rnct_connect(): directory service layer: internal directory control layer error: Requested server name not found.rnEstablishing connection failed.rnNULLrnrn运行环境:Sql Server2000
使用gem命令时出现的几种错误
在终端用gem命令的时候,时常遇到的问题: 墙墙墙 通过 gem source 查看你的当前的gem资源库位置,如果你的当前资源库的位置为: https://rubygems.org/,不好意思,你是无法安装成功的,因为这个资源库在国外,所以你需要安装的githug是无法下载成功的,那我们怎么办呢,其实方法很简单,修改当前资源库的位置:1- gem sources -r https://ruby
使用Tornado,启动VxSim时出现错误
启动VxSim时,<em>出现</em>rn Connecting to target agent... rn Error: rpccore backend client Timed outrnfailed.rn 请问,这个问题我应该如何解决??
求教在使用Repeater时出现错误
前台rnrnrn后台rnprotected void Repeater1_ItemCommand(object source, RepeaterCommandEventArgs e)rn rn Int64 hid = Convert.ToInt64(e.CommandArgument.ToString()); rn if (e.CommandName == "TJ")rn rn Response.Write("信息操作出错,请联系客服人员!" + hid.ToString());rn rn rnrnrn网页<em>错误</em>详细信息rnrn用户代理: Mozilla/4.0 (compatible; MSIE 8.0; Windows NT 5.1; Trident/4.0)rn时间戳: Thu, 5 Mar 2009 11:29:46 UTCrnrnrn消息: Sys.WebForms.PageRequestManagerParserErrorException: 无法分析从服务器收到的消息。之所以<em>出现</em>此<em>错误</em>,常见的原因是: 在通过调用 Response.Write() 修改响应时,将启用响应筛选器、HttpModule 或服务器跟踪。rn详细信息: 分析附近的“信息操作出错,请联系客服人员!26672”时出错。rn行: 4723rn字符: 21rn代码: 0rnURI: http://zky/yz/ScriptResource.axd?d=0kvAvxnasa0dqLM60jLMMxyL5AHXfDzmHCCLLU VoC0nmfcAgKoWEJ2qDkpesEYDdcwajXoR5yBeyU8ZeOP1N3-PqhsGfSDq_WWbrIsi5k1s1&t=17ab21c0rnrn
【css】使用margin时易出现错误
前言:margin在布局的时候还是蛮常用到,不过margin还是容易产生一些问题的。   一、margin-top传递给了父级。 &amp;lt;body&amp;gt; &amp;lt;style&amp;gt; body { margin:0; background:pink; } .box1 { width:200px; height:200px; background:#333;} .box2 { width:1...
为什么使用yum时出现如下错误?
Traceback (most recent call last):rn File "/usr/bin/yum", line 22, in ?rn import yummainrnImportError: Bad magic number in /usr/share/yum/yummain.pycrn
make时出现错误
makefile文件执行出错
安装插件时出现错误
Cannot find a solution satisfying the following requirements org.eclipse.swt [3.4.0.v3448f].
insmod 时出现错误
情况1.   从另外一个版本中为了测试模块拷贝到本系统中 现象: sudo insmod ft52x6_ts.koinsmod: error inserting 'ft52x6_ts.ko': -1 Invalid module format 原因: (1). 所用内核源码版本号与目前<em>使用</em>的内核不同;(2). 编译目标不同,比如编译的是i686,装好的是i386;(3). <em>使用</em>编译器版本不同;...
订阅时出现错误
为过程或函数 sp_MSset_subscription_properties 指定的参数太多。
使用jdbc连接mysql数据库时出现错误!!
IE运行时提示<em>错误</em>如下:(只是一个简单的struts程序)rntype Status reportrnrnmessage Servlet action is not availablernrndescription The requested resource (Servlet action is not available) is not available.rnrnrnrnrnstruts-config.xml中的项配置如下:rn rn rn rn rn rn rn rn rn rn rn rn rn rn rn rnrn如果在struts-config.xml中去掉配置,程序运行正常!!rn但如果加上配置项,程序会<em>出现</em>上面提示的<em>错误</em>!!!rnrn但是为了连接mysql数据库,必须这么配置啊,兄弟们帮助me解决问题啊!!rnrn非常感谢了!! :)
使用class.FastTemplate.php3文件时出现错误~
学习PHP中…运行下面代码…rndefine(array(foo => "foo.tpl", bar => "bar.tpl")); rnrn$tpl->assign(NAME, "me"); rn$tpl->parse(PAGECONTENT, "foo"); rnrn$tpl->assign(PAGETITLE, "Welcome!"); rn$tpl->parse(MAIN, "bar"); rnrn$tpl->FastPrint(MAIN); rnrn?> rnrn<em>出现</em>此<em>错误</em>:rnFatal error: Cannot redeclare clear_parse() in E:\work\php\query\fasttemplate\class.FastTemplate.php3 on line 666rnrn先谢…rn
使用MultipartFile时出现了这个错误
![图片说明](https://img-ask.csdn.net/upload/201807/18/1531906795_80842.png)n网上找了好长时间就是没有解决方案,求大神指点迷津!!
利用插件扩展应用程序的范例程序下载
1、工程组文件为PlugInGroup.bpg<br> 2、应用程序工程文件为PlugIn.dpr<br> 3、三个插件工程分别为ChangeAll.dpr、ChangeColor.dpr、ChangeName.dpr<br> 4、插件工程编译后为动态链接库<br> 5、其中改变字体名的工程ChangeName.dpr中有一个窗体,相应文件名为FontNameList.pas<br> 相关下载链接:[url=//download.csdn.net/download/chenxh/188?utm_source=bbsseo]//download.csdn.net/download/chenxh/188?utm_source=bbsseo[/url]
vb6.0+access 实例案例 学员信息系统下载
vb6.0+access(MDB) 实例案例例子 学员信息系统 相关下载链接:[url=//download.csdn.net/download/cjjxcn/4030487?utm_source=bbsseo]//download.csdn.net/download/cjjxcn/4030487?utm_source=bbsseo[/url]
pps去广告补丁下载
pps 去广告 直接运行就可以了 相关下载链接:[url=//download.csdn.net/download/nhw984291867/4824683?utm_source=bbsseo]//download.csdn.net/download/nhw984291867/4824683?utm_source=bbsseo[/url]
相关热词 c#检测非法字符 c#双屏截图 c#中怎么关闭线程 c# 显示服务器上的图片 api嵌入窗口 c# c# 控制网页 c# encrypt c#微信网页版登录 c# login 居中 c# 考试软件
我们是很有底线的