CSDN论坛 > CUDA > CUDA编程

cuda编译错误 [问题点数:40分]

Bbs1
本版专家分:0
结帖率 50%
CSDN今日推荐
匿名用户不能发表回复!
其他相关推荐
Delphi编译错误中文手册
Delphi编译错误中文手册Delphi编译错误中文手册Delphi编译错误中文手册
win10 安装cuda成功后 test sample 错误合集
Win10+VS2013+CUDA8.0编译运行例程(.cu)出现error MSB4062:未能从程序集…问题的解决 Win10离线安装.NET Framework 3.5的方法技巧(附离线安装包下载)
CUDA编程的错误处理
转载于CUDA编程的错误处理关于错误处理无论是基于CPU的编程还是基于GPU的编程,当我们调用了一个API运行程序产生了错误,就会导致程序运行结果有悖于理论结果,甚至导致程序崩溃。因此,错误的检测和错误的处理在编程中是极为重要的。当我们能够定位错误的原因,错误的纠正才能更快更准确。Linux C系统编程错误处理我们来回顾一下在Linux系统编程中的错误处理(基于CPU)。在Linux系统编程中,错误
Win10+cuda9.0+cudnn7源码编译tensorflow1.4.0教程(AVX/AVX2指令集支持)
Win10+cuda9.0+cudnn7源码编译tensorflow1.4.0教程。支持AVX/AVX2指令集,支持Compute Capability3.0-6.1
make: *** [.build_release/cuda/src/caffe/layers/detection_output_layer.o] Error 1解决
/usr/include/boost/property_tree/detail/json_parser_read.hpp:257:264: error: ‘type name’ declared as function returning an array 方法:因为gcc版本太低了,升级到5.3即可解决 [html] view plain copy sudo 
opencv3.1.0+cuda8.0+vs2013+win7编译过程错误及解决方法
1.opencv3.1.0与cuda8.0不兼容问题 modules/cudalegacy/src/graphcuts.cpp:120:54: error: ‘NppiGraphcutState’ has not been declared typedef NppStatus (*init_func_t)(NppiSize oSize, NppiGraphcutState** ppSta
Ubuntu 15.04 下编译Caffe2
深度学习大神贾扬清在四月底发布了最新框架Caffe2,最近在Ubuntu15.04下编译了它的源代码,遇到一些坑,记录下来以供参考。 基本安装次序如官网所述。https://caffe2.ai/docs/getting-started.html?platform=ubuntu&configuration=compile 大概就是先装一些底层支持库,装GPU显卡驱动,装CUD
theano编程错误及解决方法
最近在做科研过程中,用到了theano符号计算框架,我在原有程序的基础上做了改动,但程序一直报错,而theano程序又比较难调试,甚是纠结,在反复测试了好久后才弄明白,故在这里把它们记录下来,以免自己以后可能陷入同一个“坑”。(1)错误提示“UnboundLocalError: local variable ‘e0’ referenced before    assignment”;    错误样
VS2013 CUDA的语法高亮和语法检查错误问题
1. 在vs2013里面设置vc++文件支持.cu;cuh;文件高亮。方法:工具->选项->文本编辑器->文件扩展名。 添加扩展名cu和cuh,对应编辑器是C++。 2.在工程属性的VC++目录->包含目录中添加:C:\Program Files\NVIDIA GPU Computing Toolkit\CUDA\v7.5\include和C:\ProgramData\NVIDIA Cor
CUDA 遇到错误代号error MSB3721
最近在整CUDA编程,VS及cuda装好以后,
关闭