编绎 时提示 -1错误 [问题点数:20分]

Bbs1
本版专家分:0
结帖率 0%
Bbs1
本版专家分:86
Bbs1
本版专家分:86
Bbs1
本版专家分:0
数据库损坏, 附加时出现 '错误: 9003:LSN(14:86:2)无效'
如果排除了权限问题.         就用下面的方法:     1.新建一个同名的数据库     2.停止SQL服务     3.复制要附加的数据文件覆盖新建的数据库的数据文件     4.重新启动SQL     5.此时数据库应该置疑   6.执行SQL语句   7.最好停一次SQL再开, 看是此数据库已可以正常使用(有时会在修复后重启SQL时, 数据会不见了)
oracle 无法删除用户 递归 SQL 级别 1 出现错误
遇到问题: 表空间无法删除。 用户也无法删除,<em>提示</em>: SQL> drop  user user_test cascade; drop  user user_test cascade * 第 1 行出现<em>错误</em>: ORA-00604: 递归 SQL 级别 1 出现<em>错误</em> ORA-00942: 表或视图不存在 ORA-06512: 在 line 7 通过select user
删除表空间,提示:ORA-00604: 递归 SQL 级别 1 出现错误,如何解决
删除表空间<em>提示</em>如下<em>错误</em>: ORA-00604: 递归 SQL 级别 1 出现<em>错误</em> ORA-04045: 在重新编译/重新验证 SDE.DB_EV_DROP_ST_METADATA 时出错 ORA-04098: 触发器 'SDE.DB_EV_ALTER_ST_METADATA' 无效且未通过重新验证  最终把'SDE.DB_EV_ALTER_ST_METADATA' 删除,再删
SQL附加数据库时错误9003:LSN无效的处理方法
是否因为你的数据没有备份或者只有LDF和MDF文件,在电脑死机或重启时数据出错,无法附加,SQL附加数据库时<em>错误</em>9003:LSN(26555:2549:1)无效。该LSN是传递给数据库***中的日志扫描操作的,这种情况呢?像<em>错误</em> 9003:LSN(xx:xx:x)无效是最常见的问题。那我们怎么才能够恢复LDF和MDF文件?   这种情况是数据库的日志文件(LDF)数据不同步造成的,可以根据数据库
PB常见编译出错及解决办法(一)
Error: Ram start overlaps rom binary   Rom end  : 0x8df9ba1c   Ram start: 0x8de29000   NK   physfirst 8c200000   physlast  8df9ba1c   ulRAMFree 8de29000   Fatal error hit, exiting...   makeimg: FATAL
netboxdex V0.1
netbox反<em>编绎</em>源码netbox反<em>编绎</em>源码netbox反<em>编绎</em>源码netbox反<em>编绎</em>源码netbox反<em>编绎</em>源码netbox反<em>编绎</em>源码netbox反<em>编绎</em>源码
安装Photoshop时提示安装过程中出现错误的解决办法
应该是C盘中残留之前版本的Photoshop文件,导致当前版本安装不了。 使用工具Search Everything搜索,把C盘中所有Photoshop的文件文件夹都删除,然后就可以了。 同理,Adobe Acrobat之类的不能安装也能够用此方法解决。
win2003安装oracle 11g出现错误:启动服务 OracleMTSRecoveryService 时出现操作系统错误
在注册表 HKEY_LOCAL_MACHINE\SYSTEM\CurrentControlSet\Services\OracleMTSRecoveryService 修改 ImagePath 的对应的安装路径路径,如: D:\app\tina\product\11.2.0\dbhome_1\BIN\omtsreco.exe "OracleMTSRecoveryService"
powerBuilder编绎成DLL格式需要的EN32T.H头文件
powerBuilder<em>编绎</em>成DLL格式需要的EN32T.H头文件 PB<em>编绎</em>成DLL文件时,<em>提示</em> "Error opening file 'c:\windows\system32\cgen\en32t.h'" 这个<em>错误</em>的解决方法 下载这个文件后,说明看我的博文: http://blog.csdn.net/aasmfox/archive/2010/12/25/6097561.aspx 希望对需要的菜鸟有所帮助 哈哈,想不到真的有人下载这个东西。还是用PB12的版本好啦。
VS2008生成安装包问题:验证时出错。HRESULT = '80004005'
原文链接:http://bgl-cf.blog.163.com/blog/static/35411171201222313711669/ 【问题描述】 在生成安装包解决方案时报错: <em>错误</em> 15 验证时出错。HRESULT= '80004005' 生产过程中,输出如下信息: ------ 已启动全部重新生成: 项目: {关注此项目名字}, 配置: Release An
SqlServer2000中附加数据库的时候出现错误9003的解决
SQL 2000,附加数据库的时候出现<em>错误</em><em>提示</em>:“<em>错误</em>9003:LSN(39:431:1)无效,该LSN是传递给数据库’XXX’中的日志扫描操作的”,如图:出现这个<em>错误</em>一般是因为此数据库有损坏,导致不能做数据库的附件操作。解决步骤: 停止SQL Server服务器,将旧数据库文件和相应的日志文件拷贝到其他地方以备份 启动SQL Server服务器,新建一个全新的和旧数据库同名的数据库 停止SQL S
C#导入Excel时到数据库,报外部数据库驱动程序中(1)的意外错误
解决办法:卸载系统更新的补丁 删除一下更新,即可。 win7                          KB4041678  KB4041681 SERVER 2008 R2 KB4041678  KB4041681 WIN10                      KB4041676  KB4041691 SERVER 2016       KB4041691
MYSQL++类库for vc2010_Release
MYSQL++的类库,VC2010正式<em>编绎</em>, 以前用VC2008导出STL有警告<em>提示</em>,搞不定。 现在用VC2010<em>编绎</em>就通过了,放在这里做备份。
安装DB2数据库时出现的问题及解决方式
1. 注意问题 安装完DB2数据库后,需要将运行DB2本地应用程序或工具的DB2用户添加至DB2管理员组或DB2用户组。 操作:管理工具--计算机管理--本地用户和组   2. 出现的问题   (1)问题描述:新建数据库时<em>提示</em>“SQL1219N  因为未能分配专用虚拟内存,所以请求失败。”  产生原因:大量的应用程序过度的使用内存,导致虚拟内存的产生;数据库死锁;安全机制
make时,提示“[libsql.la] 错误 1” 和 “[all-recursive] 错误 1”
在CentOS5(64位)中安装cyrus-sasl-2.1.22.tar.gz时,<em>提示</em>:rnrn……rnrn……rngcc -shared sql.lo sql_init.lo plugin_common.lo -L/usr/lib/mysql -lmysqlclient -lresolv -lc -Wl,-soname -Wl,libsql.so.2 -o .libs/libsql.so.2.0.22rn/usr/bin/ld: skipping incompatible /usr/lib/mysql/libmysqlclient.so when searching for -lmysqlclientrn/usr/bin/ld: skipping incompatible /usr/lib/mysql/libmysqlclient.a when searching for -lmysqlclientrn/usr/bin/ld: cannot find -lmysqlclientrncollect2: ld returned 1 exit statusrnmake[2]: *** [libsql.la] <em>错误</em> 1rnmake[2]: Leaving directory `/opt/cyrus-sasl-2.1.22/plugins'rnmake[1]: *** [all-recursive] <em>错误</em> 1rnmake[1]: Leaving directory `/opt/cyrus-sasl-2.1.22'rnmake: *** [all] <em>错误</em> 2rnrnrn=====================================rnmysql是安装系统时选择安装的。rnrn请问以上<em>错误</em>是怎么回事?rn谢谢!!
maven打包项目时候报错 java:1:非法字符: \65279
[ERROR] [解析开始时间D:\workspace\src\main\java\com\service\ProcessCenterUpdateServiceImpl.java] [ERROR]D:\workspace\\src\main\java\com\\service\ProcessCenterUpdateServiceImpl.java:1:非法字符: \65279 [ERROR]
安装Adobe 全线产品时出现提示错误终极解决方案
今天,无重要事情做,我特地写个简单的教程。目的就是为了让大家能更好的使用计算机和解决计算机带来的种种问题等!         我遇见很多网友都在问同一个问题,为什么全新安装(或者卸载重装)会出现<em>提示</em><em>错误</em>?!   因为大多数网友都是曾经使用过其他版本!(盗版,精简版那些“浓缩”版本)那些版本所残留下的一些“根源体”无法得到彻底的清除,才出现以下的那些问题!这让许多网友都头疼不已,甚至让许多网友都
JAVA初学者第一个程序“Hello World”常见的错误及处理方法
1、System第一个单词没有大写,String args[],中第一个字母没有大写。 2、System.out.print中间的点其实是:调用的意思。 3、单词的拼写<em>错误</em>。 4、public static void main(String []args){}    public static void main(String args[]){}两种表达方式是同一种意思。 5、每一句编程
在linux4.7上安装net-snmp编译遇到的问题
#wget http://nchc.dl.sourceforge.net/sourceforge/net-snmp/net-snmp-5.4.2.1.tar.gz#cd net-snmp-5.4.2.1#./configure --prefix=/usr/local/net-snmp --enable-developer#make   这个时候报错如下:grep: /usr/lib/libbe
SOS VC编绎错误不解!! T_T
小弟刚学类rn学着做了一个栈的类rn是这样做的rn新建一个工程:rnstack_.h //栈类的文件rnsNode.h //栈的结点类文件rn---------------------------------------rnstack.cpp //栈的mian()函数在这里面rnstack_.cpp //栈类的成员函数地这里面rnsNode.cpp //栈的结点类成员函数在这里面rnrn可是我怎么一<em>编绎</em> sNode.cpp 就出错了:rnrnsNode.h:rn/////////////////////////////////////////////////rn#ifndef sNode_rn#define sNode_rnrnclass sNodernrnpublic:rn sNode()rnrn sNode(int itemp=0)rn Value=itemp;Prior=Next=NULL;rnrn sNode(int itemp,sNode *ptemp);rnrnprivate:rn int Value;rn sNode *Prior, *Next;rn;rnrn#endif //sNode_rn//////////////////////////////////////////////////////////rnsNode.cpp:rnrn#include "Node.h"rnrnsNode::sNode(int itemp,sNode *ptemp)rnrn Value=itemp;rn Prior=NULL;rn Next=ptemp;rn ptemp->Prior=this; rnrnrn//////////////////////////////////////////////////////////rnstack.cpp:rnrn#include rnusing namespace std;rnrnint main()rnrn cout<<
java反编绎工具
java反<em>编绎</em>工具,java反<em>编绎</em>工具,java反<em>编绎</em>工具,java反<em>编绎</em>工具!
系统服务启动tomcat报错,特定错误代码1
1.通过系统事件查看器查看<em>错误</em>原因。 2.通过tomcat<em>错误</em>日志查看报错的地方。 3.这个方法是在论坛上偶然看到的,不知道原理,不过这的解决了问题: Tomcat目录下的bin,进入Tomcat8w.exe,进去切换到startup,下面的Mode默认是jvm,把这个jvm换成java就好了。
编绎工具
反<em>编绎</em>工具 反<em>编绎</em>工具 反<em>编绎</em>工具 反<em>编绎</em>工具
黄色加密狗不稳定的解决方法
加密狗注册时<em>提示</em>,leisense<em>错误</em>,或是注册失败
错误:仅当显式请求注释处理时才接受类名称‘HelloWorld’1 个错误
出现这个<em>错误</em>的原因是在编译过程中javac后面文件没有跟上后缀*.java 问题解决啦! 注意编译过程javac后面文件必须要有后缀 而运行java文件时不需要。
Oracle 报错ORA-00845 MEMORY_TARGET not supported on this system
在启动Oracle数据库时<em>提示</em>:ORA-00845 MEMORY_TARGET not supported on this system<em>错误</em>,解决办法
word保存时提示错误的解决方法.txt
word 保存时<em>提示</em><em>错误</em> 解决方法 技巧 语音问题
SQL数据库写入错误 解决方案
SQL 数据库备份时,<em>提示</em>数据冗余<em>错误</em>,数据文件也不能COPY。
清除SQL SERVER数据库挂起工具
用于清除SQL SERVER 安装时<em>提示</em>的‘数据库挂起’<em>错误</em>
瑞星卸载。
可以卸载瑞星自动卸载时<em>提示</em>版本<em>错误</em>的
FPascal错误一览表
适应于fpascal程序编辑时系统<em>提示</em><em>错误</em>的对照。
make时出现错误
makefile文件执行出错
“apt-get -f install” 错误与解决方法
​ apt-get -f install = apt-get install -f ,是修复依赖关系(depends)的命令,就是假如你的系统上有某个package不满足依赖条件,这个命令就会自动修复,安装那个package依赖的package。 ​ 1、sudo命令:sudo命令用来以其他身份来执行命令,预设的身份为root,简单来说就是提升权限,因为apt-get ins...
远程桌面错误:为Administrator连接到现存会话发生错误(Id 0) 操作成功
在使用mstsc /console连接远程桌面时发生<em>错误</em>: 为Administrator连接到现存会话发生<em>错误</em>(Id 0) 操作成功 如果去掉console参数就能连接成功!
导入excel 到sqlserver数据库 外部数据库驱动程序中(1)的意外错误 [问题点数:40分]
https://www.baidu.com/s?ie=utf-8&f=8&rsv_bp=0&rsv_idx=1&ch=&tn=baidu&bar=&wd=%E5%A4%96%E9%83%A8%E6%95%B0%E6%8D%AE%E5%BA%93%E9%A9%B1%E5%8A%A8%E7%A8%8B%E5%BA%8F%E4%B8%AD%281%29%E7%9A%84%E6%84%8F%E5%A4%9
[ODBC]读Excel时报错:外部数据库驱动程序(1)中的意外错误解决方案
在MFC下使用ODBC读取Excel数据库,之前用着还好好的,突然就用不了了,几经查找发现是Windows安全更新的补丁搞的鬼。出现<em>错误</em>: 解决方案: 1. 在控制面板——卸载——已安装更新,找到并删除以下安全更新: 2. 修改注册表的dll指向 3. 更新数据库驱动引擎
终于解决Visio在WIN7下复制粘贴时崩溃的问题
这几天写方案,使用visio2007画图,然后粘贴到word2007中,然后使用ctrl+c,ctrl+V时,不时的崩溃,我也快被搞崩溃了!微软的软件不兼容自己的东西?晕!   经过查找,最终发现是因为BlueTooth这个COM加载项不兼容的缘故,此加载项是启动时加载。 具体的解决方法: 打开注册表:HKEY_LOCAL_MACHINE\SOFTWARE\Microsoft\Visio\A
装系统时总是提示 保存分区表时出现错误(0000000001)函数不正确
启动硬盘分区软件diskgenius(一般都是这个分区软件,这个PE系统自带的居多),将现有的分区全部删掉。选择  “硬盘”   选择 “转换分区表类型为MBR格式”,转换完成。快速分区。格式化。重新进行你想要的操作就行了。收工
ASP导入Excel数据提示:外部数据库驱动程序(1)中的意外错误 解决办法
ASP导入Excel数据<em>提示</em>:外部数据库驱动程序(1)中的意外<em>错误</em> 解决办法最近拿起很久以前写的ASP导入excel数据程序测试时,发现好好的程序出现运行问题,之前都是好好的。真是怪事。怎么回事呢?程序没有动它,好好的就突然不能用了,为此,我一步一步去测试程序。获取的参数都没有问题,唯一出现问题的地方就是conn.open excel打开excel数据驱动源代码那行,以前都是正常打开的,现在却...
javac编译提示错误需要为 class、interface 或 enum
转载自https://www.cnblogs.com/nbalive2001/p/4514342.htmlHelloWorld.java:1: 需要为 class、interface 或 enum锘缝ublic class HelloWorld{^1 <em>错误</em>这个<em>错误</em>出现的原因主要是在中文操作系统中,使用一贯的“javac HelloWorld.java”方式编译UTF-8(带BOM)编码的.java...
软件安装时Error 1335 - cannot copy错误的解决方法
原文地址::http://www.jysls.com/thread-232584-1-1.html 相关文章地址::http://www.hackbase.com/subject/2009-07-14/14558.html                 http://wenwen.soso.com/z/q165169212.htm?pid=wenwen.autologin   在安装
asp.net编绎运行时 错误
asp.net<em>编绎</em>运行时config198<em>错误</em>右击我的电脑选择管理>---- 点击[服务和应用程序前面的加号]----选中[索引服务]----------右击选择[停止]-----------然后再选择[启动]OK
错误提示:需要标识符
菜鸟学习java之路:今天在看java编程思想时,想动手敲敲代码。结果随自己之前学习的基础,敲了个简单程序,没想到出现了运行<em>错误</em>: 代码: class StaticTest{ static int i=7; i++; public static void main (String []args){ StaticTest st1=n
git 编译安装时出现的错误
Can’t locate ExtUtils/MakeMaker.pm in @INC yum install perl-ExtUtils-CBuilder perl-ExtUtils-MakeMaker make: * [http-push.o] Error 1 yum update curl libcurl yum -y install libcurl-devel.x86_6 yu...
svn更新错误提示
1.<em>提示</em>被锁定,需要清理后重新再试即可: 2.<em>提示</em>access...forbidden 不一定是没有权限;可能是目录等级建立不对,或者是数据没有清理缓存。
录制badboy脚本的时候弹出脚本错误
如图: 解决方法:浏览器工具-》Internet选项-》高级属性页-》选中“禁止脚本调试”复选框。之后就不会再收到这些警告了。
一个数组下标错误引起的字符串错误
有个对象 例如  class myClass{ public: CString mName;  } 声明一个对象数组:myClass tObjs[10];  然后有个下标tIndex, 赋值: tObjs[tIndex].mName = "旺旺";  然后就报错了:  (mfc120d.dll)... 处有未经处理的异常:0xC00000005:读取位置0x
配置Tomcat出现错误的时候(通常是发生在第一次)
解决手段: 提供的网址:http://download.eclipse.org/releases/kepler 等待一会儿: 选好后点击“next”等几分钟,正在加载的图: 加载完成后:接着点击“next” 最后“finish”呗, 最好在重启一下“eclipse” ...
关于更新app时出现解析包错误
参考:http://stackoverflow.com/questions/5503487/android-failed-to-open-zip-archive包解析<em>错误</em>因为权限的问题,所以要在安装之前加上如下代码: String path = Environment.getExternalStorageDirectory()+"/download";//此处是你下载的apk存放的文件夹地址
【安卓学习之常见问题】 Eclipse 提示 @Override 错误
通过Eclipse 导入一个工程项目后,<em>提示</em> must override a superclass method
reflector 程序代码反编绎工具
reflector 程序代码反<em>编绎</em>工具reflector 程序代码反<em>编绎</em>工具reflector 程序代码反<em>编绎</em>工具
Excel大数据字段导入SQLserver时报截断错误
一、问题描述: 在导入时报错如下: <em>错误</em> 0xc020901c: 数据流任务 1: 源 - yndata1$.输出[Excel 源输出] 上的 源 - yndata1$.输出[Excel 源输出].列[indications] 出错。返回的列状态是:“文本被截断,或者一个或多个字符在目标代码页中没有匹配项。”。  (SQL Server 导入和导出向导) <em>错误</em> 0xc02090
在安装nodejs时遇到的错误提示
smbd.service - LSB: start Samba SMB/CIFS daemon (smbd) Loaded: loaded (/etc/init.d/smbd; bad; vendor preset: enabled) Active: failed (Result: exit-code) since Mon 2016-04-25 21:43:03 EET; 23min
[转载]Windows 加入域时, 提示参数错误解决方法
原文地址:Windows 加入域时, <em>提示</em>参数<em>错误</em>解决方法作者:flexyou 建议尝试以下操作: 1. 在出现问题的客户端上,点击“开始→运行”并输入“cmd”→Ping域控制器的IP地址加-t参数,察看都否有丢包的现象。 2. 在出现问题的客户端上,点击“开始→运行”并输入“cmd”→Ping域控制器的FQDN名称,测试是否正常。 3. 运...
DownloadString”时发生异常:“基础连接已经关闭: 发送时发生错误
win10下安装scoop遇到<em>错误</em>:“DownloadString”时发生异常:“基础连接已经关闭: 发送时发生<em>错误</em>”,记录一下解决过程。   确认powershell版本是3以上,更改powershell执行策略 PS C:\Users\STAR&amp;gt; $PSVersionTable Name Value ---- ...
loanrunner录制脚本时提示证书错误解决方法
1.初学loadrunner,在录制qq邮箱登陆的脚本时出现了证书<em>错误</em>的<em>提示</em>,出现这样的问题不是浏览器本身的证书出错,应该在     loadrunner内部进行设置,具体操作( stard recording-&amp;gt;oprions-&amp;gt;network-&amp;gt;port mapping中的socket level data设置为 winnet level data ,从新录制脚本就可以成功录...
SendInput()在编绎时通不过
帮个忙!rnrn用SendInput() 在<em>编绎</em>时:rn源文件:rnincludern...rnsendinput(...);rnrnCompile:rnc2065: SendInput() :undeclared idendifierrnrn您知道吗?
1、安装Kylix时出现error_code_-10错误.chm
1、安装Kylix时出现error_code_-10<em>错误</em>
mysql导入csv文件出错解决办法
将*.csv文件导入mysql可使用LOAD DATA INFILE, 概要写法: Load data in file  对于本地文件,使用 load data local infile 'D:\\filename.csv' 语法 具体语法使用可参照:http://dev.mysql.com/doc/refman/5.1/zh/sql-syntax.html#load-data 如果一个
sql server还原数据库时报错(错误码:3154)的解决办法
ALTER DATABASE [DatabaseName] SET OFFLINE WITH ROLLBACK IMMEDIATE --断开其他用户与数据库的连接 USE MASTER --这里注意要使用MASTER,以免出现待还原库被占用的情况 RESTORE DATABASE [DatabaseName] --DatabaseName为待还原库名 FROM DISK = 'E:\Data
错误602;未能在sysindexes中找到数据库ID7中对象ID1的索引ID1对应的行">SQL2000附加数据库时提示"错误602;未能在sysindexes中找到数据库ID7中对象ID1的索引ID1对应的行
遇到这种情况首先核对一下51aspx上源码所表明的开发环境(如 VS2005+Sql2005),如果是采用sqlServer2005的话你用Sql2000附加Sql2005的数据库就会出现这种<em>错误</em>(解决方法:改用SqlServer2005附加一下,如果还想用Sql2000格式那就用导出sql语句等方式进行转换)转csdn sql专家邹建的解决办法 直接restore或附加应该是不行的, 用脚本
Java--Mac下终端运行.java文件需要class、interface或enum
在Windows系统下,可以在jdk安装的路径下面直接使用记事本边写一个Java文件,然后编译一下就可以在DOS控制台上运行,那么在Mac系统下也可以对其进行同样的操作,博主使用Mac自带的文本编辑工具编写了一个Hello.java文件,放在桌面上,编译运行时报错 javac Hello.java: <em>错误</em>: 需要class, interface或enum,如下图    这时查询一下错
java编译错误: 非法字符: \65279
在jeckins上使用Ant构建项目的时候报错如图: 几次修改都没解决问题,网上求助了发现原来是这样的: 在eclipse中用ant把项目打包,遇到一个问题:编译java文件的时候,有些java文件报非法字符 \65279<em>错误</em> 在eclipse中根据<em>错误</em><em>提示</em>,找到有【<em>错误</em>: 非法字符: \65279】的java文件,先将文件编码改为:ISO-8859-1, 然后打开这个java文件,
编绎时出错!
game error LNK2019: 无法解析的外部符号 _DirectDrawCreate@12 ,该符号在函数 "int __cdecl DD_Init(struct HWND__ *)" (?DD_Init@@YAHPAUHWND__@@@Z) 中被引用rnrn//用的是Vs.net ---VC7
编绎LAME时链接错误
--------------------Configuration: lame - Win32 Release--------------------rnCompiling...rnfft.crnformatBitstream.crnget_audio.crngpkplotting.crngtkanal.crnid3tag.crnieeefloat.crnl3bitstream.crnlame.crnmain.crnF:\MP3-Enc\AdoEncMp3\lame\main.c(198) : warning C4018: '!=' : signed/unsigned mismatchrnparse.crnportableio.crnpsymodel.crnquantize-pvt.crnquantize.crnreservoir.crntables.crntakehiro.crnF:\MP3-Enc\AdoEncMp3\lame\takehiro.c(700) : warning C4018: ' : unreferenced local variablernVbrTag.crnversion.crnCompiling...rnnewmdct.crnLinking...rnmain.obj : error LNK2001: unresolved external symbol _lame_readframernmain.obj : error LNK2001: unresolved external symbol _lame_init_infilernRelease/lame.exe : fatal error LNK1120: 2 unresolved externalsrnError executing link.exe.rnCreating browse info file...rnrnlame.exe - 3 error(s), 3 warning(s)rnrn===========================rnlame_readframe(),lame_init_infile()都在get_audio.c中,其它的函数在lame.c中实现,上面的所有文件都是在一个工程中,但却找不到?rn如果将其做成一个DLL,再调用的话就没问题了,但这样在一个工程中却链接找不到,求教!谢谢!
VS调试网站时分析器错误
.net项目在VS2013网页运行时总出现 分析器<em>错误</em> 说明: 在分析向此请求提供服务所需资源时出错。请检查下列特定分析<em>错误</em>详细信息并适当地修改源文件。 分析器<em>错误</em>消息: 此实现不是 Windows 平台 FIPS 验证的加密算法的一部分。 源<em>错误</em>: 行 1: using System; 行 2: using System.Data; 行
启动 OracleMTSRecoveryServic 服务。 错误 1:函数不正确。
如果32操作系统: 查看注册表键值: HKEY_LOCAL_MACHINE\SOFTWARE\ORACLE\OracleMTSRecoveryService\Protid_0 键Host的内容要和本机名一致。将Host的值改为本机计算机名   如果是64位操作系统 查看注册表键值: HKEY_LOCAL_MACHINE\SOFTWARE\Wow6432Node\ORACLE\Orac
LoadRunner_LoadRunner 11.0安装提示安装日志无法写入的错误
把以前安装的load runner 8.0彻底删除了,但是遇到的问题是无法安装load runner 11.0,<em>提示</em>安装日志无法写入的<em>错误</em>,鼓捣了半天也没搞定,今天看见说XP系统是由于temp变量没有设置的原因,我查看自己的temp果然是空的,我果断的加入以下变量:C:\Users\Administrator\Local Settings,OK,搞定了,可以安装了哦!
内核模块安装错误:ln: 目标 ”TECHNOLOGY/source“ 不是目录 make: *** [_modinst_] 错误 1
问题: 执行内核模块安装命令: make modules_install INSTALL_MOD_PATH=/home/sbote/Super2440Rootfs 出现<em>错误</em>: ln: 目标 ”TECHNOLOGY/source“ 不是目录 make: *** [_modinst_] <em>错误</em> 1 原因: 内核配置项General setup——》Local version - append
外部数据库驱动程序(1)中的意外错误
c#程序,最近在Excel导入数据时,部分客户会报:外部数据库驱动程序(1)中的意外<em>错误</em>,如下图所示  解决方法:此问题是由于windows系统自动更新造成的。 1.打开控制面板——卸载程序(或者是添加删除程序) 2.查看已安装的更新 3,如果是PC操作系统(一般是服务器)请按以下系统对应补丁进行处理:Windows server 2008 R2卸载微软
关于运行jar包时的一个错误
花了几天时间学习java,今天制作了一个jar包,遇到一个奇怪的问题,打好的jar包使用命令 java -jar test.jar 可以正确运行,但是双击或是在cmd中运行,<em>提示</em>下面的<em>错误</em>: C:\Users\Administrator>D:\work\temp\classes\test.jar Exception in thread "main" java.lang.NoClassDef
向mysql数据库中插入数据时显示“Duplicate entry '1′ for key ‘PRIMARY' ”错误
向mysql数据库中插入数据时显示“Duplicate entry '1′ for key ‘PRIMARY' ”<em>错误</em>的解决办法
打开excel提示:向程序发送命令时出现问题,如何解决
1、以 Office 2007 版的 Excel 为例,首先请点击左上角的【菜单】按钮 2、点击【excel选项】按钮 3、选择【高级】选项 4、在【常规】标签下,取消勾选【忽略使用动态数据交换(DDE)的其他应用程序(o)】即可
删除表空间报错ORA-00604&ORA-02429解决过程
今天在删除表空间时遭遇报错ORA-00604&ORA-02429,下面分享一下解决问题的过程。 测试环境     我在Oracle 10g+Windows Server 2008 Standard R2进行操作。 点击(此处)折叠或打开 SQL> SQL> select * from v$version; BANNER ------
解决IE8安装问题:复制文件 admparse.dll 时出现错误
删除C:\WINDOWS\system32下的dllcache文件,并在该目录建立文件夹dllcache即可
还原数据库时出现的问题 “设备激活错误”的解决办法
一台机器上备份了一个数据库,把备份后的文件打击拷到另一台机器上准备还原时却出了错,<em>提示</em>是:"设备激活<em>错误</em>,物理文件名:d:/program   files/microsoft   sqlserver/MSSQL/finance_data.mdf"可能有误.文件finance_DATA无法还原为d:/program   files/microsoft   sqlserver/MSSQL/fina
返回提示语、返回错误
返回<em>提示</em>语: if (payOrder == null) { logger.info(&quot;没有交易支付单!&quot;); return new BaseResponse(RespConstants.GLOBAL_INNER_ERROR, &quot;没有交易支付单!&quot;); } 返回<em>错误</em>码: if (!iouInfo.getLoanUserId().equals(appUserId)) {// ...
安装谷歌浏览器出现错误代码 0x80004002 解决方法
以前装过一次谷歌浏览器,后来卸载了。再次重装的时候一直出现<em>错误</em>,<em>错误</em>代码 0x80004002 网上介绍的删除注册表,下载离线安装包这些方法都没用。 解决办法很简单:进入安全模式,教程:http://jingyan.baidu.com/article/fdffd1f8335933f3e98ca1db.html 在安全模式下安装。 没了我简直不敢相信我有一天会写这种没有任何技术含量的博
利用命令行编译Java文件时出现“需要<>标识符”的错误
class { public static void main(String[] args) { System.out.println("Hello World!"); } } 如上面那段测试代码所示,编译时就会<em>提示</em>“需要
安装python包出错时的一般解决办法
经常做python开发,大量安装形形色色的python第三方库是在所难免的如:
socket编程入门(1---连接socket,传送数据 出现的错误
1,socket通信最基本的需要两个文件,一个是服务端文件,另外一个是客户端文件。 2,客户端文件client.php : 服务端文件server.php : /* +——————————- * @socket通信整个过程 +——————————- * @socket_create * @socket_bind * @socket_liste
调试程序时,提示错误
我的程序在编译时能够通过,但是在单步调试时<em>提示</em>User breadkpoint called from code at 0x77f9f9dfrn是不是我在一些地方设置了断点,但是我自己已经找不到在那里设置的,有没有办法清除所有的断点?谢谢!
远程桌面控制winsever,复制文件或者文件夹夹时出错提示“未指定的错误
一、背景 单位服务器装的是正版winsever2012R2 标准版,在复制同一个文件夹时,通过远程桌面复制文件夹要比在服务器上直接复制慢很多。最主要的问题是通过远程桌面复制这个文件夹时,会出现如下图的<em>错误</em><em>提示</em>。   二、<em>错误</em> 复制文件或者文件夹夹时出错<em>提示</em>“未指定的<em>错误</em>”   三、分析原因:  1、不支持使用此方法复制大于 2 GB 的文件。   2、复制和粘贴文件: 您...
错误"提示的解决办法">打开word excel ppt 时遇到 "试图打开文件时候遇到错误"提示的解决办法
简介 有时候从邮箱中下载的文件无法正常打开,<em>提示</em>试图打开文件时候遇到<em>错误</em>, 大多时候并不是文件下载中损坏了,而是windows为了防止病毒传播的一种保护方案 解决方法 文件上右键打开属性,点 解锁锁定,ok 文件打开正常 如果是文件损坏,可以尝试打开时修复,在打开对话框的下拉列表中选择打开并修复 ...
VBS脚本运行错误提示的解决方法
VBS 没有在该机执行windows脚本宿主的权限?(1)依次找到HKEY_LOCAL_MACHINE/SOFTWARE/Microsoft/Windows Script Host/Settings这个路径,打开右边的enabled这个键值!把它改成1!or在右边的窗口中是不是有个名为 Enabled的DWORD键值,有的话把它删除或者把值该为 1即可正常运行.(2)Windo
oralce数据库pde导入的时候,报错:递归sql级别1出现错误 超出打开游标的最大数
oralce数据库pde导入的时候,报错:递归sql级别1出现<em>错误</em> 超出打开游标的最大数。 这是因为,油标数超上线了。 同一太数据库服务器(如10.15.18.90服务器上建了好多个数据库,如test1、test2等),连得用户太多了(即打开的pde太多了),需要关掉几个pde。 怎么看游标占用情况,哪些机器占用的特别多?
连接Excel时出现未指定的错误
 使用  strConn = "Provider=Microsoft.Jet.OLEDB.4.0;Data Source=" + filepath + ";Extended Properties=Excel 8.0;HDR=YES;IMEX=1"; OleDbConnection conn = new OleDbConnection(strConn);conn.Open
C#操作xml文档及遇到的各种报错提示
界面               //所有的数据全部在集合中             //dgv控件绑定List集合,List集合中有User类的对象,对象里有属性,把属性绑定到没列的数据上             dgv.DataSource = list;//绑定数据            姓名,密码,性别,年龄列的DataPropertyName分别对应List集合中对象的Name,P...
提示 “用户名密码不匹配” 还是 “用户名不存在” / “密码错误”;才意识到的设计思考
这记录的不是技术问题,而是设计上的考量。 原来我以为<em>提示</em>“用户名密码不匹配”是程序员太懒,懒得去检测到底是不是不存在该用户名还是用户名对了密码没对。 直到今天我才从django文档中得知: 因为我在做密码重置功能的时候看到,email不存在的话,系统是不<em>提示</em>的,这样就能减少被攻击的可能性。如果你<em>提示</em>说该邮箱地址不存在,那么攻击者就能继续尝试。 由此我才知道,为什么许多系统都是<em>提示</em>用户名...
word文档提示在试图打开文件时遇到错误的解决方法
ord2016,我打开下载的文档时<em>提示</em>: 在试图打开文件时遇到<em>错误</em>。 请尝试下列方法检查文档或驱动器的文件权限大确保有足够的内存和磁盘空间。用文本恢复转换器打开文件https://img-blog.csdnimg.cn/20181220005756530.jpg?x-oss-process=image/watermark,type_ZmFuZ3poZW5naGVpdGk,shadow_10,tex...
GHOST时提示A:\GHOSTERR.TXT错误如何解决
出现A:\GHOSTERR.TXT的现象原因也非常复杂但是一般情况下分为以下几类: 1. 硬盘没有分区 2. 你需要GHOST的GHO文件解压后容量比当前硬盘分区容量大 3. 在GHOST光盘出现划伤或光驱出现问题时不能正常读区GHOST里的GHO文件 4. 分区表损坏时(分区表也就是MBR表) 5. 新版本的GHOST程序备份GHO文件用老版本的GHOST程序进行GHO文件安装 6.
使用ubuntu16.04配置linux内核和busybox出现错误的解决方法总结
也许很多人都知道,ARM裸机1期加强版课程用的是ubuntu 16.04,当用这个ubuntu编译内核和制作文件系统的时候会出现一些问题,售后团队用了一天时间找到了如下解决方法。 更多干货关注威信订阅号baiwenkeji 1. 编译busybox-1.23.2:  出现<em>错误</em>: scripts/kconfig/Makefil
Java常见错误整理(一)
1、配置完Java环境变量之后,仍然不能使用java命令。 解决方法: 1.    如果是Windows10系统出现此问题,是因为个别Windows10系统不识别“JAVA_HOME”环境变量,将path中所有的“%JAVA_HOME%”改成JDK的真实文件夹路径。 2.    环境变量配置有误。仔细核对JDK文件夹地址是否正确。 3.    JDK未能正常安装,请重新安装。  
Badboy提示脚本错误解决方法
在使用Badboy录制脚本的时候,弹框<em>提示</em>“当前页面的脚本发生<em>错误</em>”,解决方法
Badboy录制提示脚本错误解决方案
昨天学习JMeter,顺带用了一下badboy,录制的时候总是<em>提示</em>脚本<em>错误</em>: 用着不爽死了,于是找了很多方法,如下: 更新Adobe Flash Player 浏览器—–找到工具 ——Internet选项 ——高级 —-取消禁止脚本调试复选框 我的电脑——属性———–高级——<em>错误</em>报告 很可惜,全部以失败告终 说了一堆废话,切入正题,在临下班之际终于找到了解决方法,如下: bad...
Win 7+Word 2007第一遍打开报错“向程序发送命令时出现错误”的解决方法
前段时间给实验室电脑重新装了一遍Win 7,最近在用的时候,Word 2007打开文件的时候总需要打两次,第一次<em>提示</em>“向程序发送命令时出现<em>错误</em>”,第二次才能正常打开。百度了一下,发现也是一个较为普遍的问题。解决方法也很简单: 将:“C:\Users\当前登陆的用户名\AppData\Roaming\Microsoft\Templates“目录下的“Normal.dotm”和“NormalEmai
冰刀 木马 远程监控 BUG修正版 VC
修正BUG: 1. 局域网搜索<em>提示</em>密码<em>错误</em> 2. 文件传输时,速度格式<em>错误</em> 3. 局域网搜索无法连接
文章热词 机器学习 机器学习课程 机器学习教程 深度学习视频教程 深度学习学习
相关热词 c++ dev 错误1 2017安装提示错误 c++ bootstrap点击登录 提示错误 电脑运行androidstudio安装包提示错误 1个月python培训机构 学习python时遇到的问题
我们是很有底线的