error: no such file or directory: '2'

移动开发 > iOS [问题点数:100分]
等级
本版专家分:0
结帖率 0%
等级
本版专家分:0
勋章
Blank
签到新秀
qq_22638799

等级:

IOError: [Errno 2] No such file or directory的解决方法

https://blog.csdn.net/johinieli/article/details/70855058

关于【error=2,No such file or directory】问题的一种起因与解决方法

error=2,No such file or directory

Python中 IOError: [Errno 2] No such file or directory的解决方法

IOError: [Errno 2] No such file or directory: 'D:\\Users\\daimao\\Desktop\\1.xls' 出现这种情况,首先查看目录是否有错,该目录文件是否存在。 其次在Python中“\”会被自动认为是转义字符,而非目录分隔符,...

FileNotFoundError: [Errno 2] No such file or directory: 'XXX' 的解决方法

FileNotFoundError: [Errno 2] No such file or directory: ‘XXX’ 的解决方法 在编写爬虫文件的过程中,一般会将爬取下来的文件保存在一个文件夹内,而当选取的文件夹不存在时,会报错"FileNotFoundError: [Errno ...

解决FileNotFoundError: [Errno 2] No such file or directory

解决FileNotFoundError: [Errno 2] No such file or directory 问题截图: 我们可以看到’best.pth.tar’和’test_snli.py’在同一个文件夹下面,但在运行后提示找不到’best.pth.tar’文件。 解决方法: 在运行...

gcc:error:No such file or directory

gcc:error:No such file or directory 今天在Windows上写好了代码,复制到Linux上进行测试。步骤如下: 第一步:vim a.c //新建一个C语言的程序,复制到里面 第二步:gcc -o a.c a //编译刚才的代码,报错:“No ...

新手怎么跑源程序——小白发生gcc: error: No such file or directory的一种可能

Ubuntu新手操作之—— 如何跑一个写好的源程序 这个问题来源于本新手小白的一个~~-智障问题-~~: 为什么我打开终端了还跑不了程序! 或者 拷了一个程序进来,怎么跑程序鸭? ##用个小标题做分割线 ...

fatal error: numpy/arrayobject.h: No such file or directory

fatal error: numpy/arrayobject.h: No such file or directory 1. fatal error: numpy/arrayobject.h: No such file or directory fatal error: numpy/arrayobject.h: No such file or directory compilation termi...

xxx: fatal error: Python.h: No such file or directory 完美解决方案

今天搭建一个python的服务项目,需要安装一个x11_hash对包,执行pip install x11_hash 结果报错 sudo pip install x11_hash Collecting x11_hash Using cached ...

brew install node 报错:Error: No such file or directory @ dir_chdir Bottle installation failed:

在终端输入 brew install node 回车 报错如下图 brew install node ==> Installing dependencies for node: icu4c ==> Installing node dependency: icu4c ==> Downloading ...

Error: ENOENT: no such file or directory, mkdir E:\

在又一次安装VUE的时候,遇到了问题。...方案2: 尝试了如下命令 npm rebuild node-sass npm install npm -g sudo npm install -g npm npm install -g npm npm cache clear npm cache verify Npm install -g bo

C++ vscode头文件找不到fatal error: No such file or directory

1. vscodeC++多文件编译 vscode的多文件编译可以通过多种方式来实现,例如,直接的多文件编译,引入makefile生成多个task进行编译,这二者实际上都依赖于vscode中tasks.... "label": "C/C++: gcc-7 build active file

fatal error: usb.h: No such file or directory 解决办法

编译报错: fatal error: usb.h: No such file or directory 解决办法: apt-get install libusb-dev

错误: clang: error: no such file or directory: '/Users/...', clang: error: no input files

clang: error: no such file or directory: ‘/Users/dcsnail/Desktop/…/SomeClass.m’ clang: error: no input files 解决 在Xcode 中搜索当前类名, 会发现同一个文件有两次添加或者在compile sources 中...

Error: ENOENT: no such file or directory, mkdir ‘D:\

Error: ENOENT: no such file or directory, mkdir ‘D:’ 安装好node之后,运行npm命令总是会出现这样的报错 Error: ENOENT: no such file or directory, mkdir ‘D:’ 首先因为我刚来的公司,因为马上要搬家,所以...

npm 报错: Error: ENOENT: no such file or directory, mkdir

Error: ENOENT: no such file or directory, mkdir D:\ 因为我压根就只有一个C盘,所以这个问题让我很是困惑。试了很多遍重新安装,但依然解决不了问题。知道在网上找到了一个解决方法。 其实这个就是在C:\Users\...

cocoapi - error: pycocotools/_mask.c: No such file or directory

cocoapi - error: pycocotools/_mask.c: No such file or directory 1. x86_64-linux-gnu-gcc: error: pycocotools/_mask.c: No such file or directory strong@foreverstrong:~/darknet_model_validation/coco_...

fatal error: boost/python.hpp: No such file or directory

本来想将crf装到Python3版本下面,所以把之前的Python2.7给卸载了,但它只能在Python2上运行,之后又... fatal error: boost/python.hpp: No such file or directory ``` 不知道如何解决,崩溃...... 求大神解答......

nodejs安装后出现问题 Error: ENOENT: no such file or directory, mkdir

解决办法是:删除C:\Users{... nodejs安装后使用 npm -v 命令,出现: Error: ENOENT: no such file or directory, mkdir ‘D:’ 6.14.4 这位仁兄的文章链接如下: nodejs 安装后 npm-v 无效,node全局环境配置 ...

vue启动报错Module build failed: Error: ENOENT: no such file or directory

Module build failed: Error: ENOENT: no such file or directory, scandir '/Users/songmengda/Desktop/aaa/xxx-aaa/develop/gmac/node_modules/node-sass/vendor' at Object.fs.readdirSy...

fatal error: pcap.h: No such file or directory

fatal error: pcap.h: No such file or directory Q:在编译C文件的时候,发现没有pcap.h头文件 A:去这个网站里面下载libpcap压缩包 http://www.tcpdump.org/#latest-release 然后解压之后 cd libpcap-1.9.0 cd ...

clang: error: no such file or directory: libcocos2d iOS.a

cocos2dx项目将lib_cocos2dx.xcodeproj文件拖拽到工程中,用xcodebuild命令打包...clang: error: no such file or directory: 'xxxx/libcocos2d iOS.a' 解决方法: 将lib_cocos2dx.xcodeproj加入到依赖环境中,如图:

npm WARN saveError ENOENT: no such file or directory的解决方法

npm WARN saveError ENOENT: no such file or directory, open ‘C:\Users\lxz\package.json’ npm WARN enoent ENOENT: no such file or directory, open ‘C:\Users\lxz\package.json’ npm WARN lxz No des

error: GL/gl.h: No such file or directory

sudo apt-get install bison build-essential gperf flex ruby python libasound2-dev libbz2-dev libcap-dev libcups2-dev libdrm-dev libegl1-mesa-dev libgcrypt11-dev libnss3-dev libpc...

解决Error: ENOENT: no such file or directory, scandir ‘xxx\node-sass\vendor

解决Error: ENOENT: no such file or directory, scandir 'xxx\node-sass\vendor' 前端项目持续部署打包中出现一个奇怪的问题,记录一下。 cnpm install 安装依赖成功 cnpm run build 构建时失败了,错误...

“ fatal error: openssl/ssl.h: No such file or directory “错误解决

今天在 CentOS 7.6 上编译 HAProxy 1.9.4 版本的时候发生如下错误 [root@JasonSong haproxy-1.9.4]# make clean [root@JasonSong haproxy-1.9.4]# make -j 8 TARGET=linux2628 USE_OPENSSL=1 USE_PCRE=1 USE_ZLIB=...

Codeblocks 一直出现 codeblocks fatal error: *.h: No such file or directory

这几天写程序的时候动不动就出现这个恼人的错误,明明前一次编译的时候还是好好的。但是继续写了一会儿,再编译就又出现这个错误了。真的让人丈二摸不着头脑。今天仔细搜了搜 C++ 的命名规范,觉得应该是文件名命名...

ubuntu cmake Fatal error: iostream: No such file or directory

报错描述:ubuntu cmake Fatal error: iostream: No such file or directory 报错原因: 造成这个报错的原因是因为iostream并不是c语言里面的写法。而你的文件名是xx.c,cmake看你文件是.c结尾所以它认为这是c语言...

IOException: No such file or directory 问题解决

Android开发,在访问文件夹创建文件的时候,报错IOException: No such file or directory ,代码本身没有问题。 注册权限 找了一会儿,突然间想起来这是一个访问内存,需要权限,在AndroidManifest中进行注册: &...

fatal error: vector: No such file or directory

jni/mac.cpp:28:18: fatal error: vector: No such file or directory jni/mac.cpp:29:18: fatal error: memory: No such file or directory compilation t...

相关热词 c#框架设计 c# 删除数据库 c# 中文文字 图片转 c#如何将程序封装 c#练手项目 c# 模拟 鼠标 c#数组重置 c# 取当前路径 c# 遍历替换字符串 c# 虚方法的使用