请教:如何动态创建TIDTCPserver并为之分配相应的onexecute处理事件?

Delphi > 网络通信/分布式开发 [问题点数:100分,结帖人sodme]
等级
本版专家分:72
结帖率 100%
等级
本版专家分:6272
等级
本版专家分:72
sodme

等级:

动态创建TIdTCPServer问题

TIdTCPServer控件中文指南

TIdTCPServer控件中文指南 . 2009-01-08 13:53 236人阅读 评论(0) 收藏 举报   IdTCPServer  简介 该控件包含一个完整的、多线程TCP服务器。该控件使用一个或者多个线程监听(listen)客户机连接,使用 ...

【我的Android进阶旅】解决错误:You have not accepted the license agreements of the following SDK ...

一、错误描述 今天有个同事编译项目的时候,出现了如下所示的错误: Checking the license for package CMake 3.6.4111459 in /data/opt/android/sdk/licenses Warning: License for package CMake 3.6.4111459 not ...

【我的Android进阶旅】Linux环境下如何安装NDK?

一、需求描述 随着项目越来越大,需要越来越多的NDK开发,最近一个迭代需要Android NDK开发,在本地Window开发完毕之后,在jenkins服务器进行编译的时候出错了,如下所示,提示 NDK not configured....

【我的Android进阶旅】解决编译错误: com.android.builder.dexing.DexArchiveMergerException: Unable ...

一、问题描述 今天下午在编译项目的时候,替换了很多内部开发出来的库的版本信息,然后编译的时候出现一个错误,如下所示: 1.1 问题简单描述 FAILURE: Build failed with an exception. * What went wrong: ...

src: make OnWorkComplete and OnExecute override-able

- Added <code>Napi::AsyncWorker::OnExecute</code>. <p>Fixes: #582 <ul><li>[x] npm test passed.</li><li>[x] documentation has changed.</li></ul>该提问来源于开源项目:nodejs/node-addon-api</p></...

【我的Android进阶旅】解决Android Studio编译报错 null value in entry: destinationDir=null

一、问题描述 打开Android Studio,编写了一些代码之后,重新编译然后出现了如下所示的错误: FAILURE: Build failed with an exception. * What went wrong: null value in entry: destinationDir=null ...

【我的Android进阶旅】Proguard混淆配置错误导致混淆的时候出现错误:Caused by: proguard.Parse...

一、错误描述 刚刚完成一个新功能,然后加上了混淆配置,接着Jenkins自动化编译的时候出错了,错误描述如下所示: Warning: Exception while processing task java.io.IOException: proguard.ParseException: ...

【我的Android进阶旅】修复错误:Use of generics not allowed for java type at '...

刚把app项目的compileSdkVer 改 28,buildToolsVer改"28.0.3"之后,编译失败了,失败错误如下所示: Warning: Exception while processing task java.io.IOException: proguard.ParseException: Use ...

【我的Android进阶旅】解决AndroidStudio编译时报错:Timeout waiting to lock artifact cache .

1、 错误描述今天在Android Studio中,使用gradle命令的时候,出现了如下所示的错误:D:\GitLab Source\XTCLint>gradlew clean uploadArchives --stacktrace Starting a Gradle Daemon, 1 busy and 1 incompatible ...

【我的Android进阶旅】解决Jenkins编译出现的错误:java.io.tmpdir is set to a directory that doesn't ...

一、问题一描述 今天,有个同事编译出现了问题,找我帮忙解决,错误如下所示: [Gradle] - Launching build. [Z1_AW_Launcher] $ /opt/gradle/gradle-4.3/bin/gradle clean buildInfo -s -i build -s jenkinsInfo -...

【我的Android进阶旅】编译出现错误:Caused by: java.util.zip.ZipError: jzentry == 0,... name =*.jar...

一、问题描述 下午编译APP的时候,出现了如下所示的错误: FAILURE: Build failed with an exception. * What went wrong: Execution failed for task ':watch:transformClassesWithComponentCodeForDebug'. ...

记录一次AAPT2 error: check logs for details

报错日志 org.gradle.api.tasks.TaskExecutionException: Execution failed for task ':testsdk:processDebugResources'. at org.gradle.api.internal.tasks.execution.ExecuteActionsTaskExecuter.executeActions...

解决内部服务器配置的域名解析错误:Temporary failure in name resolution

一、问题描述 有同事反馈,Jenkins编译失败,域名解析失败。错误如下所示: FAILURE: Build failed with an exception. * Where: Script '/data1/jenkins/workspace/F3_AW_Launcher_I13_INA/dependencies.gradle' ...

Execution failed for task ':app:mergeDebugResources'.

今天在项目中碰到下面的编译错误,错误信息如下: org.gradle.api.tasks.TaskExecutionException: Execution failed for task ':app:mergeDebugResources'. at org.gradle.api.internal.tasks.execution....

android studio3.2一个坑: Failed to process resources, see aapt output above for details.

最近升级了android studio 3.2,然后我使用的引用是: ... 然后就报错了,编译不通过: org.gradle.api.tasks.TaskExecutionException: Execution failed for task ':app:processDebugResources'. ...

【我的Android进阶旅】解决错误ABIs [armeabi] are not supported for platform.

一、错误描述 今天将Tencent的Matrix库下载下来,编译的时候,出现了错误, ABIs [armeabi] are not supported for platform. Supported ABIs are [armeabi-v7a, arm64-v8a, x86, x86_64]. 如下所示: ...

升级Android Studio 导致的 `Error:Failed to notify project evaluation listener.`解决办法

最近升级Android Studio和sdk后, gradle同步项目时忽然报错, Error:Failed to notify project evaluation listener.截图如下, 更详细的错误见最后. 使用gradlew build --debug看了下输出的信息, 没有找到有用的. ...

【我的Android进阶旅】如何查看Gradle项目的依赖树情况

一、问题描述 今天在编写代码过程中,引入了一个组内新的封装库,导致编译冲突。如下所示: FAILURE: Build failed with an exception. ...Execution failed for task ':demo:...

$ gradle packageDebug --stacktrace error: top-left corner pixel must be either opaque white or trans...

$ gradle packageDebug --stacktrace error: top-left corner pixel must be either opaque white or transparent. Configure project :app Configuration 'compile' in project ':app' is de...

请帮助解决使用TIdTCPServer组件出现弹出You must have an OnExecute event.

【我的Android进阶旅】解决Center OS 64位系统编译Android APP报错error=2和finished with non-zero exit...

一、错误描述1、问题 java.io.IOException: error=2, 没有那个文件或目录 今天在刚重新搭建好的64位的Center OS上安装好了Android SDK,Jenkins,Git等一系列用于持续集成的环境之后,准备编译下项目试一试,然后...

Indy10 控件的使用(2)TidTCpServer组件学习

Indy10控件的使用(2)TidTCpServer组件学习 (2012-05-18 15:16:53) 转载▼ 标签: indy10 lazarus idtcpserver 分类: Indy10 以下来自英文原版帮助文件,文桓英语不好,翻译了老...

【dotnet跨平台】"dotnet restore"和"dotnet run"都做了些什么?

【dotnet跨平台】"dotnet restore"和"dotnet run"都做了些什么? 前言: 关于dotnet跨平台的相关内容,可以参考:跨平台.NET Core--微软开源方向 其中,.net core基础库叫CoreFX:... 在

【Unity3D进阶4-12】Unity3D 对话系统

一、目录 【Unity3D从入门到进阶】文章目录及设置这个专栏的初衷

MobSDK:Could not resolve com.mob.sdk:MobSDK-Impl:latest.integration错误处理(为了方便报错放在了下面)

打开电脑随便改改界面,一运行就给我整了这个锤子,虽然一大堆的错误看不懂,但是总体还是知道时因为引入Mob服务导致的错误,找来找去原来是没有添加maven库的路径引用,之前一直没加可以用,不晓得怎么回事。...

AndroidStudio与gradle版本异常

1、AndroidStudio版本太低 AndroidStudio版本太低,与下载的gradle版本不兼容,报错如下: java.lang.AbstractMethodError: org.jetbrains.plugins.gradle.tooling.util.ModuleComponentIdentifierImpl....

Unable to load class ‘org.gradle.api.internal.plugins.DefaultConvention

错误 Unable to load class 'org.gradle.api.internal.plugins.DefaultConvention'. 原因 IDE与Gradle不兼容。 解决办法 ... 修改gradle-wrapper.properties,把链接复制过去: 错误:...

从零学习游戏服务器开发(四)LogServer源码探究

这是从零学习开源项目的第四篇,上一篇是《从零学习开源项目系列...我们在Visual Studio中将LogServer设置启动项,然后按F5将LogServer启动起来,启动成功后显示如下图: 从上图中,我们可以到大致做了三件事:...

个人简历模板

优质简历模板,目前最前全的模板收藏,需要换工作的小伙伴们可以试试

相关热词 c# 测试并发 c# 如何提交地址 c# 反射 转 原码 c#mvc项目 c# 示例 长连接 c# 开发网站 c#通过反射获取类型信息 c# lock 的参数 c# stream 复制 android c#